You are viewing a plain text version of this content. The canonical link for it is here.
Posted to builds@solr.apache.org by Policeman Jenkins Server <je...@thetaphi.de> on 2023/03/14 15:02:10 UTC
[JENKINS] Solr-main-Linux (64bit/hotspot/jdk-17.0.5) - Build # 10762 - Unstable!
Build: https://jenkins.thetaphi.de/job/Solr-main-Linux/10762/
Java: 64bit/hotspot/jdk-17.0.5 -XX:+UseCompressedOops -XX:+UseParallelGC
3 tests failed.
FAILED: org.apache.solr.cloud.SplitShardWithNodeRoleTest.testSolrClusterWithNodeRoleWithPull
Error Message:
java.lang.AssertionError: Timed out waiting for sub shards to be active. Number of active shards=1
Timeout waiting to see state for collection=coll_NRT_PULL :DocCollection(coll_NRT_PULL//collections/coll_NRT_PULL/state.json/16 {/collections/coll_NRT_PULL/state.json/[28]: [core_node10:2:A, core_node4:1:A, core_node2:2:A:L, core_node8:2:A:L, core_node9:2:A, core_node7:2:A:L]})={
"pullReplicas":"1",
"configName":"conf",
"replicationFactor":"1",
"shards":{
"shard1":{
"range":"80000000-7fffffff",
"state":"active",
"replicas":{
"core_node2":{
"core":"coll_NRT_PULL_shard1_replica_n1",
"node_name":"127.0.0.1:40501_solr",
"base_url":"https://127.0.0.1:40501/solr",
"state":"down",
"force_set_state":"false",
"type":"NRT"},
"core_node4":{
"core":"coll_NRT_PULL_shard1_replica_p3",
"node_name":"127.0.0.1:44693_solr",
"base_url":"https://127.0.0.1:44693/solr",
"state":"down",
"force_set_state":"false",
"type":"PULL"}}},
"shard1_0":{
"parent":"shard1",
"stateTimestamp":"1678798770477020765",
"shard_parent_node":"127.0.0.1:40501_solr",
"replicas":{
"core_node7":{
"core":"coll_NRT_PULL_shard1_0_replica_n5",
"leader":"true",
"node_name":"127.0.0.1:40501_solr",
"base_url":"https://127.0.0.1:40501/solr",
"state":"down",
"force_set_state":"false",
"type":"NRT"},
"core_node10":{
"core":"coll_NRT_PULL_shard1_0_replica_p1",
"node_name":"127.0.0.1:44693_solr",
"base_url":"https://127.0.0.1:44693/solr",
"state":"active",
"type":"PULL",
"force_set_state":"false"}},
"range":"80000000-ffffffff",
"state":"recovery",
"shard_parent_zk_session":"72294636318949382"},
"shard1_1":{
"parent":"shard1",
"stateTimestamp":"1678798770477002890",
"shard_parent_node":"127.0.0.1:40501_solr",
"replicas":{
"core_node8":{
"core":"coll_NRT_PULL_shard1_1_replica_n6",
"leader":"true",
"node_name":"127.0.0.1:40501_solr",
"base_url":"https://127.0.0.1:40501/solr",
"state":"down",
"force_set_state":"false",
"type":"NRT"},
"core_node9":{
"core":"coll_NRT_PULL_shard1_1_replica_p0",
"node_name":"127.0.0.1:44693_solr",
"base_url":"https://127.0.0.1:44693/solr",
"state":"active",
"type":"PULL",
"force_set_state":"false"}},
"range":"0-7fffffff",
"state":"recovery",
"shard_parent_zk_session":"72294636318949382"}},
"router":{"name":"compositeId"},
"nrtReplicas":"1",
"tlogReplicas":"0",
"perReplicaState":"true"}
Live Nodes: [127.0.0.1:40501_solr, 127.0.0.1:44235_solr, 127.0.0.1:44429_solr, 127.0.0.1:44693_solr, 127.0.0.1:46149_solr, 127.0.0.1:46867_solr]
Last available state: DocCollection(coll_NRT_PULL//collections/coll_NRT_PULL/state.json/16 {/collections/coll_NRT_PULL/state.json/[28]: [core_node10:2:A, core_node4:1:A, core_node2:2:A:L, core_node8:2:A:L, core_node9:2:A, core_node7:2:A:L]})={
"pullReplicas":"1",
"configName":"conf",
"replicationFactor":"1",
"shards":{
"shard1":{
"range":"80000000-7fffffff",
"state":"active",
"replicas":{
"core_node2":{
"core":"coll_NRT_PULL_shard1_replica_n1",
"node_name":"127.0.0.1:40501_solr",
"base_url":"https://127.0.0.1:40501/solr",
"state":"down",
"force_set_state":"false",
"type":"NRT"},
"core_node4":{
"core":"coll_NRT_PULL_shard1_replica_p3",
"node_name":"127.0.0.1:44693_solr",
"base_url":"https://127.0.0.1:44693/solr",
"state":"down",
"force_set_state":"false",
"type":"PULL"}}},
"shard1_0":{
"parent":"shard1",
"stateTimestamp":"1678798770477020765",
"shard_parent_node":"127.0.0.1:40501_solr",
"replicas":{
"core_node7":{
"core":"coll_NRT_PULL_shard1_0_replica_n5",
"leader":"true",
"node_name":"127.0.0.1:40501_solr",
"base_url":"https://127.0.0.1:40501/solr",
"state":"down",
"force_set_state":"false",
"type":"NRT"},
"core_node10":{
"core":"coll_NRT_PULL_shard1_0_replica_p1",
"node_name":"127.0.0.1:44693_solr",
"base_url":"https://127.0.0.1:44693/solr",
"state":"active",
"type":"PULL",
"force_set_state":"false"}},
"range":"80000000-ffffffff",
"state":"recovery",
"shard_parent_zk_session":"72294636318949382"},
"shard1_1":{
"parent":"shard1",
"stateTimestamp":"1678798770477002890",
"shard_parent_node":"127.0.0.1:40501_solr",
"replicas":{
"core_node8":{
"core":"coll_NRT_PULL_shard1_1_replica_n6",
"leader":"true",
"node_name":"127.0.0.1:40501_solr",
"base_url":"https://127.0.0.1:40501/solr",
"state":"down",
"force_set_state":"false",
"type":"NRT"},
"core_node9":{
"core":"coll_NRT_PULL_shard1_1_replica_p0",
"node_name":"127.0.0.1:44693_solr",
"base_url":"https://127.0.0.1:44693/solr",
"state":"active",
"type":"PULL",
"force_set_state":"false"}},
"range":"0-7fffffff",
"state":"recovery",
"shard_parent_zk_session":"72294636318949382"}},
"router":{"name":"compositeId"},
"nrtReplicas":"1",
"tlogReplicas":"0",
"perReplicaState":"true"}
Stack Trace:
java.lang.AssertionError: Timed out waiting for sub shards to be active. Number of active shards=1
Timeout waiting to see state for collection=coll_NRT_PULL :DocCollection(coll_NRT_PULL//collections/coll_NRT_PULL/state.json/16 {/collections/coll_NRT_PULL/state.json/[28]: [core_node10:2:A, core_node4:1:A, core_node2:2:A:L, core_node8:2:A:L, core_node9:2:A, core_node7:2:A:L]})={
"pullReplicas":"1",
"configName":"conf",
"replicationFactor":"1",
"shards":{
"shard1":{
"range":"80000000-7fffffff",
"state":"active",
"replicas":{
"core_node2":{
"core":"coll_NRT_PULL_shard1_replica_n1",
"node_name":"127.0.0.1:40501_solr",
"base_url":"https://127.0.0.1:40501/solr",
"state":"down",
"force_set_state":"false",
"type":"NRT"},
"core_node4":{
"core":"coll_NRT_PULL_shard1_replica_p3",
"node_name":"127.0.0.1:44693_solr",
"base_url":"https://127.0.0.1:44693/solr",
"state":"down",
"force_set_state":"false",
"type":"PULL"}}},
"shard1_0":{
"parent":"shard1",
"stateTimestamp":"1678798770477020765",
"shard_parent_node":"127.0.0.1:40501_solr",
"replicas":{
"core_node7":{
"core":"coll_NRT_PULL_shard1_0_replica_n5",
"leader":"true",
"node_name":"127.0.0.1:40501_solr",
"base_url":"https://127.0.0.1:40501/solr",
"state":"down",
"force_set_state":"false",
"type":"NRT"},
"core_node10":{
"core":"coll_NRT_PULL_shard1_0_replica_p1",
"node_name":"127.0.0.1:44693_solr",
"base_url":"https://127.0.0.1:44693/solr",
"state":"active",
"type":"PULL",
"force_set_state":"false"}},
"range":"80000000-ffffffff",
"state":"recovery",
"shard_parent_zk_session":"72294636318949382"},
"shard1_1":{
"parent":"shard1",
"stateTimestamp":"1678798770477002890",
"shard_parent_node":"127.0.0.1:40501_solr",
"replicas":{
"core_node8":{
"core":"coll_NRT_PULL_shard1_1_replica_n6",
"leader":"true",
"node_name":"127.0.0.1:40501_solr",
"base_url":"https://127.0.0.1:40501/solr",
"state":"down",
"force_set_state":"false",
"type":"NRT"},
"core_node9":{
"core":"coll_NRT_PULL_shard1_1_replica_p0",
"node_name":"127.0.0.1:44693_solr",
"base_url":"https://127.0.0.1:44693/solr",
"state":"active",
"type":"PULL",
"force_set_state":"false"}},
"range":"0-7fffffff",
"state":"recovery",
"shard_parent_zk_session":"72294636318949382"}},
"router":{"name":"compositeId"},
"nrtReplicas":"1",
"tlogReplicas":"0",
"perReplicaState":"true"}
Live Nodes: [127.0.0.1:40501_solr, 127.0.0.1:44235_solr, 127.0.0.1:44429_solr, 127.0.0.1:44693_solr, 127.0.0.1:46149_solr, 127.0.0.1:46867_solr]
Last available state: DocCollection(coll_NRT_PULL//collections/coll_NRT_PULL/state.json/16 {/collections/coll_NRT_PULL/state.json/[28]: [core_node10:2:A, core_node4:1:A, core_node2:2:A:L, core_node8:2:A:L, core_node9:2:A, core_node7:2:A:L]})={
"pullReplicas":"1",
"configName":"conf",
"replicationFactor":"1",
"shards":{
"shard1":{
"range":"80000000-7fffffff",
"state":"active",
"replicas":{
"core_node2":{
"core":"coll_NRT_PULL_shard1_replica_n1",
"node_name":"127.0.0.1:40501_solr",
"base_url":"https://127.0.0.1:40501/solr",
"state":"down",
"force_set_state":"false",
"type":"NRT"},
"core_node4":{
"core":"coll_NRT_PULL_shard1_replica_p3",
"node_name":"127.0.0.1:44693_solr",
"base_url":"https://127.0.0.1:44693/solr",
"state":"down",
"force_set_state":"false",
"type":"PULL"}}},
"shard1_0":{
"parent":"shard1",
"stateTimestamp":"1678798770477020765",
"shard_parent_node":"127.0.0.1:40501_solr",
"replicas":{
"core_node7":{
"core":"coll_NRT_PULL_shard1_0_replica_n5",
"leader":"true",
"node_name":"127.0.0.1:40501_solr",
"base_url":"https://127.0.0.1:40501/solr",
"state":"down",
"force_set_state":"false",
"type":"NRT"},
"core_node10":{
"core":"coll_NRT_PULL_shard1_0_replica_p1",
"node_name":"127.0.0.1:44693_solr",
"base_url":"https://127.0.0.1:44693/solr",
"state":"active",
"type":"PULL",
"force_set_state":"false"}},
"range":"80000000-ffffffff",
"state":"recovery",
"shard_parent_zk_session":"72294636318949382"},
"shard1_1":{
"parent":"shard1",
"stateTimestamp":"1678798770477002890",
"shard_parent_node":"127.0.0.1:40501_solr",
"replicas":{
"core_node8":{
"core":"coll_NRT_PULL_shard1_1_replica_n6",
"leader":"true",
"node_name":"127.0.0.1:40501_solr",
"base_url":"https://127.0.0.1:40501/solr",
"state":"down",
"force_set_state":"false",
"type":"NRT"},
"core_node9":{
"core":"coll_NRT_PULL_shard1_1_replica_p0",
"node_name":"127.0.0.1:44693_solr",
"base_url":"https://127.0.0.1:44693/solr",
"state":"active",
"type":"PULL",
"force_set_state":"false"}},
"range":"0-7fffffff",
"state":"recovery",
"shard_parent_zk_session":"72294636318949382"}},
"router":{"name":"compositeId"},
"nrtReplicas":"1",
"tlogReplicas":"0",
"perReplicaState":"true"}
at __randomizedtesting.SeedInfo.seed([F27CE9F682136D9C:28DA7BD226DD20E1]:0)
at org.junit.Assert.fail(Assert.java:89)
at org.apache.solr.cloud.SolrCloudTestCase.waitForState(SolrCloudTestCase.java:170)
at org.apache.solr.cloud.SolrCloudTestCase.waitForState(SolrCloudTestCase.java:136)
at org.apache.solr.cloud.SplitShardWithNodeRoleTest.doSplit(SplitShardWithNodeRoleTest.java:87)
at org.apache.solr.cloud.SplitShardWithNodeRoleTest.testSolrClusterWithNodeRoleWithPull(SplitShardWithNodeRoleTest.java:65)
at java.base/jdk.internal.reflect.NativeMethodAccessorImpl.invoke0(Native Method)
at java.base/jdk.internal.reflect.NativeMethodAccessorImpl.invoke(NativeMethodAccessorImpl.java:77)
at java.base/jdk.internal.reflect.DelegatingMethodAccessorImpl.invoke(DelegatingMethodAccessorImpl.java:43)
at java.base/java.lang.reflect.Method.invoke(Method.java:568)
at com.carrotsearch.randomizedtesting.RandomizedRunner.invoke(RandomizedRunner.java:1758)
at com.carrotsearch.randomizedtesting.RandomizedRunner$8.evaluate(RandomizedRunner.java:946)
at com.carrotsearch.randomizedtesting.RandomizedRunner$9.evaluate(RandomizedRunner.java:982)
at com.carrotsearch.randomizedtesting.RandomizedRunner$10.evaluate(RandomizedRunner.java:996)
at com.carrotsearch.randomizedtesting.rules.SystemPropertiesRestoreRule$1.evaluate(SystemPropertiesRestoreRule.java:80)
at org.junit.rules.RunRules.evaluate(RunRules.java:20)
at org.apache.lucene.tests.util.TestRuleSetupTeardownChained$1.evaluate(TestRuleSetupTeardownChained.java:44)
at org.apache.lucene.tests.util.AbstractBeforeAfterRule$1.evaluate(AbstractBeforeAfterRule.java:43)
at org.apache.lucene.tests.util.TestRuleThreadAndTestName$1.evaluate(TestRuleThreadAndTestName.java:45)
at org.apache.lucene.tests.util.TestRuleIgnoreAfterMaxFailures$1.evaluate(TestRuleIgnoreAfterMaxFailures.java:60)
at org.apache.lucene.tests.util.TestRuleMarkFailure$1.evaluate(TestRuleMarkFailure.java:44)
at org.junit.rules.RunRules.evaluate(RunRules.java:20)
at com.carrotsearch.randomizedtesting.rules.StatementAdapter.evaluate(StatementAdapter.java:36)
at com.carrotsearch.randomizedtesting.ThreadLeakControl$StatementRunner.run(ThreadLeakControl.java:390)
at com.carrotsearch.randomizedtesting.ThreadLeakControl.forkTimeoutingTask(ThreadLeakControl.java:843)
at com.carrotsearch.randomizedtesting.ThreadLeakControl$3.evaluate(ThreadLeakControl.java:490)
at com.carrotsearch.randomizedtesting.RandomizedRunner.runSingleTest(RandomizedRunner.java:955)
at com.carrotsearch.randomizedtesting.RandomizedRunner$5.evaluate(RandomizedRunner.java:840)
at com.carrotsearch.randomizedtesting.RandomizedRunner$6.evaluate(RandomizedRunner.java:891)
at com.carrotsearch.randomizedtesting.RandomizedRunner$7.evaluate(RandomizedRunner.java:902)
at com.carrotsearch.randomizedtesting.rules.StatementAdapter.evaluate(StatementAdapter.java:36)
at com.carrotsearch.randomizedtesting.rules.StatementAdapter.evaluate(StatementAdapter.java:36)
at org.apache.lucene.tests.util.AbstractBeforeAfterRule$1.evaluate(AbstractBeforeAfterRule.java:43)
at org.apache.lucene.tests.util.AbstractBeforeAfterRule$1.evaluate(AbstractBeforeAfterRule.java:43)
at com.carrotsearch.randomizedtesting.rules.SystemPropertiesRestoreRule$1.evaluate(SystemPropertiesRestoreRule.java:80)
at org.junit.rules.RunRules.evaluate(RunRules.java:20)
at org.apache.lucene.tests.util.AbstractBeforeAfterRule$1.evaluate(AbstractBeforeAfterRule.java:43)
at com.carrotsearch.randomizedtesting.rules.StatementAdapter.evaluate(StatementAdapter.java:36)
at org.apache.lucene.tests.util.TestRuleStoreClassName$1.evaluate(TestRuleStoreClassName.java:38)
at com.carrotsearch.randomizedtesting.rules.NoShadowingOrOverridesOnMethodsRule$1.evaluate(NoShadowingOrOverridesOnMethodsRule.java:40)
at com.carrotsearch.randomizedtesting.rules.NoShadowingOrOverridesOnMethodsRule$1.evaluate(NoShadowingOrOverridesOnMethodsRule.java:40)
at com.carrotsearch.randomizedtesting.rules.StatementAdapter.evaluate(StatementAdapter.java:36)
at com.carrotsearch.randomizedtesting.rules.StatementAdapter.evaluate(StatementAdapter.java:36)
at org.apache.lucene.tests.util.TestRuleAssertionsRequired$1.evaluate(TestRuleAssertionsRequired.java:53)
at org.apache.lucene.tests.util.AbstractBeforeAfterRule$1.evaluate(AbstractBeforeAfterRule.java:43)
at org.apache.lucene.tests.util.TestRuleMarkFailure$1.evaluate(TestRuleMarkFailure.java:44)
at org.apache.lucene.tests.util.TestRuleIgnoreAfterMaxFailures$1.evaluate(TestRuleIgnoreAfterMaxFailures.java:60)
at org.apache.lucene.tests.util.TestRuleIgnoreTestSuites$1.evaluate(TestRuleIgnoreTestSuites.java:47)
at org.junit.rules.RunRules.evaluate(RunRules.java:20)
at com.carrotsearch.randomizedtesting.rules.StatementAdapter.evaluate(StatementAdapter.java:36)
at com.carrotsearch.randomizedtesting.ThreadLeakControl$StatementRunner.run(ThreadLeakControl.java:390)
at com.carrotsearch.randomizedtesting.ThreadLeakControl.lambda$forkTimeoutingTask$0(ThreadLeakControl.java:850)
at java.base/java.lang.Thread.run(Thread.java:833)
FAILED: org.apache.solr.cloud.TestDeleteCollectionOnDownNodes.deleteCollectionWithDownNodes
Error Message:
java.lang.Exception: Test abandoned because suite timeout was reached.
Stack Trace:
java.lang.Exception: Test abandoned because suite timeout was reached.
at __randomizedtesting.SeedInfo.seed([F27CE9F682136D9C]:0)
FAILED: org.apache.solr.cloud.TestDeleteCollectionOnDownNodes.classMethod
Error Message:
java.lang.Exception: Suite timeout exceeded (>= 7200000 msec).
Stack Trace:
java.lang.Exception: Suite timeout exceeded (>= 7200000 msec).
at __randomizedtesting.SeedInfo.seed([F27CE9F682136D9C]:0)
[JENKINS] Solr-main-Linux (64bit/hotspot/jdk-20-rc) - Build # 10763 - Still Unstable!
Posted by Policeman Jenkins Server <je...@thetaphi.de>.
Build: https://jenkins.thetaphi.de/job/Solr-main-Linux/10763/
Java: 64bit/hotspot/jdk-20-rc -XX:+UseCompressedOops -XX:+UseG1GC
1 tests failed.
FAILED: org.apache.solr.cloud.ReindexCollectionTest.testFailure
Error Message:
java.lang.AssertionError: .rx_ck_failReindexing still exists
Stack Trace:
java.lang.AssertionError: .rx_ck_failReindexing still exists
at __randomizedtesting.SeedInfo.seed([54A4D147DF0CC96C:3C1922ABE53CABC3]:0)
at org.junit.Assert.fail(Assert.java:89)
at org.junit.Assert.assertTrue(Assert.java:42)
at org.junit.Assert.assertFalse(Assert.java:65)
at org.apache.solr.cloud.ReindexCollectionTest.lambda$testFailure$9(ReindexCollectionTest.java:356)
at org.apache.solr.common.cloud.ClusterState.lambda$forEachCollection$1(ClusterState.java:377)
at java.base/java.util.LinkedHashMap.forEach(LinkedHashMap.java:729)
at org.apache.solr.common.cloud.ClusterState.forEachCollection(ClusterState.java:372)
at org.apache.solr.cloud.ReindexCollectionTest.testFailure(ReindexCollectionTest.java:354)
at java.base/jdk.internal.reflect.DirectMethodHandleAccessor.invoke(DirectMethodHandleAccessor.java:104)
at java.base/java.lang.reflect.Method.invoke(Method.java:578)
at com.carrotsearch.randomizedtesting.RandomizedRunner.invoke(RandomizedRunner.java:1758)
at com.carrotsearch.randomizedtesting.RandomizedRunner$8.evaluate(RandomizedRunner.java:946)
at com.carrotsearch.randomizedtesting.RandomizedRunner$9.evaluate(RandomizedRunner.java:982)
at com.carrotsearch.randomizedtesting.RandomizedRunner$10.evaluate(RandomizedRunner.java:996)
at com.carrotsearch.randomizedtesting.rules.SystemPropertiesRestoreRule$1.evaluate(SystemPropertiesRestoreRule.java:80)
at org.junit.rules.RunRules.evaluate(RunRules.java:20)
at org.apache.lucene.tests.util.TestRuleSetupTeardownChained$1.evaluate(TestRuleSetupTeardownChained.java:44)
at org.apache.lucene.tests.util.AbstractBeforeAfterRule$1.evaluate(AbstractBeforeAfterRule.java:43)
at org.apache.lucene.tests.util.TestRuleThreadAndTestName$1.evaluate(TestRuleThreadAndTestName.java:45)
at org.apache.lucene.tests.util.TestRuleIgnoreAfterMaxFailures$1.evaluate(TestRuleIgnoreAfterMaxFailures.java:60)
at org.apache.lucene.tests.util.TestRuleMarkFailure$1.evaluate(TestRuleMarkFailure.java:44)
at org.junit.rules.RunRules.evaluate(RunRules.java:20)
at com.carrotsearch.randomizedtesting.rules.StatementAdapter.evaluate(StatementAdapter.java:36)
at com.carrotsearch.randomizedtesting.ThreadLeakControl$StatementRunner.run(ThreadLeakControl.java:390)
at com.carrotsearch.randomizedtesting.ThreadLeakControl.forkTimeoutingTask(ThreadLeakControl.java:843)
at com.carrotsearch.randomizedtesting.ThreadLeakControl$3.evaluate(ThreadLeakControl.java:490)
at com.carrotsearch.randomizedtesting.RandomizedRunner.runSingleTest(RandomizedRunner.java:955)
at com.carrotsearch.randomizedtesting.RandomizedRunner$5.evaluate(RandomizedRunner.java:840)
at com.carrotsearch.randomizedtesting.RandomizedRunner$6.evaluate(RandomizedRunner.java:891)
at com.carrotsearch.randomizedtesting.RandomizedRunner$7.evaluate(RandomizedRunner.java:902)
at com.carrotsearch.randomizedtesting.rules.StatementAdapter.evaluate(StatementAdapter.java:36)
at com.carrotsearch.randomizedtesting.rules.StatementAdapter.evaluate(StatementAdapter.java:36)
at org.apache.lucene.tests.util.AbstractBeforeAfterRule$1.evaluate(AbstractBeforeAfterRule.java:43)
at org.apache.lucene.tests.util.AbstractBeforeAfterRule$1.evaluate(AbstractBeforeAfterRule.java:43)
at com.carrotsearch.randomizedtesting.rules.SystemPropertiesRestoreRule$1.evaluate(SystemPropertiesRestoreRule.java:80)
at org.junit.rules.RunRules.evaluate(RunRules.java:20)
at org.apache.lucene.tests.util.AbstractBeforeAfterRule$1.evaluate(AbstractBeforeAfterRule.java:43)
at com.carrotsearch.randomizedtesting.rules.StatementAdapter.evaluate(StatementAdapter.java:36)
at org.apache.lucene.tests.util.TestRuleStoreClassName$1.evaluate(TestRuleStoreClassName.java:38)
at com.carrotsearch.randomizedtesting.rules.NoShadowingOrOverridesOnMethodsRule$1.evaluate(NoShadowingOrOverridesOnMethodsRule.java:40)
at com.carrotsearch.randomizedtesting.rules.NoShadowingOrOverridesOnMethodsRule$1.evaluate(NoShadowingOrOverridesOnMethodsRule.java:40)
at com.carrotsearch.randomizedtesting.rules.StatementAdapter.evaluate(StatementAdapter.java:36)
at com.carrotsearch.randomizedtesting.rules.StatementAdapter.evaluate(StatementAdapter.java:36)
at org.apache.lucene.tests.util.TestRuleAssertionsRequired$1.evaluate(TestRuleAssertionsRequired.java:53)
at org.apache.lucene.tests.util.AbstractBeforeAfterRule$1.evaluate(AbstractBeforeAfterRule.java:43)
at org.apache.lucene.tests.util.TestRuleMarkFailure$1.evaluate(TestRuleMarkFailure.java:44)
at org.apache.lucene.tests.util.TestRuleIgnoreAfterMaxFailures$1.evaluate(TestRuleIgnoreAfterMaxFailures.java:60)
at org.apache.lucene.tests.util.TestRuleIgnoreTestSuites$1.evaluate(TestRuleIgnoreTestSuites.java:47)
at org.junit.rules.RunRules.evaluate(RunRules.java:20)
at com.carrotsearch.randomizedtesting.rules.StatementAdapter.evaluate(StatementAdapter.java:36)
at com.carrotsearch.randomizedtesting.ThreadLeakControl$StatementRunner.run(ThreadLeakControl.java:390)
at com.carrotsearch.randomizedtesting.ThreadLeakControl.lambda$forkTimeoutingTask$0(ThreadLeakControl.java:850)
at java.base/java.lang.Thread.run(Thread.java:1623)