You are viewing a plain text version of this content. The canonical link for it is here.
Posted to notifications@maven.apache.org by Apache Jenkins Server <je...@builds.apache.org> on 2022/02/28 02:48:29 UTC

Build failed in Jenkins: Maven » maven-compiler-plugin-test-olamy » ci-reporting #25

See https://ci-maven.apache.org/job/Maven/job/maven-compiler-plugin-test-olamy/job/ci-reporting/25/

Changes:

* inherit enforcer plugin version from parent

All tests passed

Build log:
[...truncated 4118 lines...]
[ERROR] *  MCOMPILER-270_release\pom.xml
[ERROR] *  MCOMPILER-294\pom.xml
[ERROR] *  MCOMPILER-321_pathexceptions\pom.xml
[ERROR] *  MCOMPILER-328_multiReleaseOutput\pom.xml
[ERROR] *  MCOMPILER-336_incremental-modulepath\pom.xml
[ERROR] *  MCOMPILER-360\pom.xml
[ERROR] *  MCOMPILER-366\pom.xml
[ERROR] *  MCOMPILER-373_mrjar\pom.xml
[ERROR] *  MCOMPILER-481-requires-static-included\pom.xml
[ERROR] *  multirelease-patterns\multimodule\pom.xml
[ERROR] *  multirelease-patterns\multiproject\pom.xml
[ERROR] *  multirelease-patterns\packaging-plugin\pom.xml
[ERROR] *  setup_jar_automodule\pom.xml
[ERROR] *  setup_jar_module\pom.xml
[ERROR] *  setup_x\pom.xml
[INFO] -------------------------------------------------
[INFO] ------------------------------------------------------------------------
[INFO] BUILD SUCCESS
[INFO] ------------------------------------------------------------------------
[INFO] Total time:  12:58 min
[INFO] Finished at: 2022-02-28T02:40:25Z
[INFO] ------------------------------------------------------------------------
[INFO] [jenkins-event-spy] Generated F:\jenkins\jenkins-home\82467a7c\workspace\r-plugin-test-olamy_ci-reporting@2@tmp\withMaven3d967e9c\maven-spy-20220228-022726-152903471561909285392.log
Picked up JAVA_TOOL_OPTIONS: -Dmaven.ext.class.path="f:\jenkins\jenkins-home\82467a7c\workspace\r-plugin-test-olamy_ci-reporting@2@tmp\withMaven3d967e9c\pipeline-maven-spy.jar" -Dorg.jenkinsci.plugins.pipeline.maven.reportsFolder="f:\jenkins\jenkins-home\82467a7c\workspace\r-plugin-test-olamy_ci-reporting@2@tmp\withMaven3d967e9c" 
[Pipeline] }
[Pipeline] // dir
[Pipeline] }
[withMaven] artifactsPublisher - Archive artifact windows-jdk8-m3.6.x_build\pom.xml under org\apache\maven\plugins\maven-compiler-plugin\3.10.1-SNAPSHOT\maven-compiler-plugin-3.10.1-SNAPSHOT.pom
[withMaven] artifactsPublisher - Archive artifact windows-jdk8-m3.6.x_build\target\maven-compiler-plugin-3.10.1-SNAPSHOT.jar under org\apache\maven\plugins\maven-compiler-plugin\3.10.1-SNAPSHOT\maven-compiler-plugin-3.10.1-SNAPSHOT.jar
[withMaven] junitPublisher - Archive test results for Maven artifact org.apache.maven.plugins:maven-compiler-plugin:maven-plugin:3.10.1-SNAPSHOT generated by maven-surefire-plugin:test (default-test): windows-jdk8-m3.6.x_build\target\surefire-reports\*.xml
Recording test results
[withMaven] Jenkins Task Scanner Plugin not found, don't display results of source code scanning for 'TODO' and 'FIXME' in pipeline screen.
[withMaven] invokerPublisher - Archive invoker results for Maven artifact MavenArtifact{org.apache.maven.plugins:maven-compiler-plugin:maven-plugin:3.10.1-SNAPSHOT(version: 3.10.1-SNAPSHOT, snapshot:false) } generated by PluginInvocation{org.apache.maven.plugins:maven-invoker-plugin:3.2.2@integration-test  integration-test}: windows-jdk8-m3.6.x_build\target\invoker-reports\*.xml
[INFO] run post-build script verify.bsh
[INFO]           non-english-warnings\pom.xml ..................... SUCCESS (13.6 s)
[INFO] Building: test1\pom.xml
ERROR: [withMaven] invokerPublisher - Silently ignore exception archiving Invoker runs for Maven artifact MavenArtifact{org.apache.maven.plugins:maven-compiler-plugin:maven-plugin:3.10.1-SNAPSHOT(version: 3.10.1-SNAPSHOT, snapshot:false) } generated by PluginInvocation{org.apache.maven.plugins:maven-invoker-plugin:3.2.2@integration-test  integration-test}: java.io.IOException: Unknown attribute 'buildlog' for tag 'build-job' (position: START_TAG seen ...@2\windows-jdk8-m3.6.x_build\target\it\MCOMPILER-129\build.log" />... @2:262) 
[withMaven] Publishers: Generated Artifacts Publisher: 136 ms, Junit Publisher: 82 ms, Open Task Scanner Publisher: 2 ms, Invoker Publisher: 688 ms
[Pipeline] // withMaven
[Pipeline] cleanWs
[WS-CLEANUP] Deleting project workspace...
[WS-CLEANUP] Deferred wipeout is used...
[WS-CLEANUP] done
[Pipeline] }
[Pipeline] // stage
[Pipeline] }
[Pipeline] // ws
[Pipeline] }
[Pipeline] // node
[Pipeline] }
[INFO] run post-build script verify.groovy
[INFO]           MCOMPILER-224\pom.xml ............................ SUCCESS (3.1 s)
[INFO] Building: MCOMPILER-228\pom.xml
[INFO]           MCOMPILER-228\pom.xml ............................ SUCCESS (2.7 s)
[INFO] Building: MCOMPILER-260_customArguments\pom.xml
[INFO]           MCOMPILER-260_customArguments\pom.xml ............ SUCCESS (2.6 s)
[INFO] Building: MCOMPILER-268_modulepath\pom.xml
[INFO] run post-build script verify.groovy
[INFO]           MCOMPILER-268_modulepath\pom.xml ................. SUCCESS (3.0 s)
[INFO] Building: MCOMPILER-270_release\pom.xml
[INFO] run post-build script verify.groovy
[INFO]           MCOMPILER-270_release\pom.xml .................... SUCCESS (2.8 s)
[INFO] Building: MCOMPILER-272\pom.xml
[INFO]           test1\pom.xml .................................... SUCCESS (12.0 s)
[INFO] 
[INFO] --- maven-checkstyle-plugin:3.0.0:check (checkstyle-check) @ maven-compiler-plugin ---
[INFO]           MCOMPILER-272\pom.xml ............................ SUCCESS (3.0 s)
[INFO] Building: MCOMPILER-275_separate-moduleinfo\pom.xml
[INFO] There are 2 errors reported by Checkstyle 6.18 with config/maven_checks.xml ruleset.
[INFO] Ignored 2 errors, 0 violation remaining.
[INFO] 
[INFO] --- maven-invoker-plugin:3.2.2:verify (integration-test) @ maven-compiler-plugin ---
[INFO] -------------------------------------------------
[INFO] Build Summary:
[INFO]   Passed: 36, Failed: 0, Errors: 0, Skipped: 27
[INFO] -------------------------------------------------
[ERROR] The following builds was skipped:
[ERROR] *  automodules-application\pom.xml
[ERROR] *  automodules-library\pom.xml
[ERROR] *  automodules-manifest\pom.xml
[ERROR] *  automodules-transitive-module\pom.xml
[ERROR] *  default-fork\pom.xml
[ERROR] *  jdk9-exportsto\pom.xml
[ERROR] *  jpms_add-exports\pom.xml
[ERROR] *  jpms_compile-main-empty-test-bar\pom.xml
[ERROR] *  jpms_compile-main-foo-test-bar\pom.xml
[ERROR] *  jpms_compile-main-foo-test-foo\pom.xml
[ERROR] *  jpms_patch-module\pom.xml
[ERROR] *  MCOMPILER-268_modulepath\pom.xml
[ERROR] *  MCOMPILER-270_release\pom.xml
[ERROR] *  MCOMPILER-294\pom.xml
[ERROR] *  MCOMPILER-321_pathexceptions\pom.xml
[ERROR] *  MCOMPILER-328_multiReleaseOutput\pom.xml
[ERROR] *  MCOMPILER-336_incremental-modulepath\pom.xml
[ERROR] *  MCOMPILER-360\pom.xml
[ERROR] *  MCOMPILER-366\pom.xml
[ERROR] *  MCOMPILER-373_mrjar\pom.xml
[ERROR] *  MCOMPILER-481-requires-static-included\pom.xml
[ERROR] *  multirelease-patterns\multimodule\pom.xml
[ERROR] *  multirelease-patterns\multiproject\pom.xml
[ERROR] *  multirelease-patterns\packaging-plugin\pom.xml
[ERROR] *  setup_jar_automodule\pom.xml
[ERROR] *  setup_jar_module\pom.xml
[ERROR] *  setup_x\pom.xml
[INFO] -------------------------------------------------
[INFO] ------------------------------------------------------------------------
[INFO] BUILD SUCCESS
[INFO] ------------------------------------------------------------------------
[INFO] Total time:  10:57 min
[INFO] Finished at: 2022-02-28T02:40:44Z
[INFO] ------------------------------------------------------------------------
[INFO] [jenkins-event-spy] Generated F:\jenkins\jenkins-home\82467a7c\workspace\r-plugin-test-olamy_ci-reporting@2@tmp\withMavenad47e8c2\maven-spy-20220228-022946-4485811015907979312175.log
Picked up JAVA_TOOL_OPTIONS: -Dmaven.ext.class.path="f:\jenkins\jenkins-home\82467a7c\workspace\r-plugin-test-olamy_ci-reporting@2@tmp\withMavenad47e8c2\pipeline-maven-spy.jar" -Dorg.jenkinsci.plugins.pipeline.maven.reportsFolder="f:\jenkins\jenkins-home\82467a7c\workspace\r-plugin-test-olamy_ci-reporting@2@tmp\withMavenad47e8c2" 
[Pipeline] }
[Pipeline] // dir
[Pipeline] }
[INFO] run post-build script verify.groovy
[INFO]           MCOMPILER-275_separate-moduleinfo\pom.xml ........ SUCCESS (3.7 s)
[INFO] Building: MCOMPILER-284\pom.xml
[withMaven] artifactsPublisher - Archive artifact windows-jdk8-m3.8.x_build\pom.xml under org\apache\maven\plugins\maven-compiler-plugin\3.10.1-SNAPSHOT\maven-compiler-plugin-3.10.1-SNAPSHOT.pom
[withMaven] artifactsPublisher - Archive artifact windows-jdk8-m3.8.x_build\target\maven-compiler-plugin-3.10.1-SNAPSHOT.jar under org\apache\maven\plugins\maven-compiler-plugin\3.10.1-SNAPSHOT\maven-compiler-plugin-3.10.1-SNAPSHOT.jar
[withMaven] junitPublisher - Archive test results for Maven artifact org.apache.maven.plugins:maven-compiler-plugin:maven-plugin:3.10.1-SNAPSHOT generated by maven-surefire-plugin:test (default-test): windows-jdk8-m3.8.x_build\target\surefire-reports\*.xml
Recording test results
[INFO] run post-build script verify.bsh
[INFO]           MCOMPILER-284\pom.xml ............................ SUCCESS (2.1 s)
[INFO] Building: MCOMPILER-294\pom.xml
[withMaven] Jenkins Task Scanner Plugin not found, don't display results of source code scanning for 'TODO' and 'FIXME' in pipeline screen.
[withMaven] invokerPublisher - Archive invoker results for Maven artifact MavenArtifact{org.apache.maven.plugins:maven-compiler-plugin:maven-plugin:3.10.1-SNAPSHOT(version: 3.10.1-SNAPSHOT, snapshot:false) } generated by PluginInvocation{org.apache.maven.plugins:maven-invoker-plugin:3.2.2@integration-test  integration-test}: windows-jdk8-m3.8.x_build\target\invoker-reports\*.xml
ERROR: [withMaven] invokerPublisher - Silently ignore exception archiving Invoker runs for Maven artifact MavenArtifact{org.apache.maven.plugins:maven-compiler-plugin:maven-plugin:3.10.1-SNAPSHOT(version: 3.10.1-SNAPSHOT, snapshot:false) } generated by PluginInvocation{org.apache.maven.plugins:maven-invoker-plugin:3.2.2@integration-test  integration-test}: java.io.IOException: Unknown attribute 'buildlog' for tag 'build-job' (position: START_TAG seen ...@2\windows-jdk8-m3.8.x_build\target\it\MCOMPILER-129\build.log" />... @2:262) 
[withMaven] Publishers: Generated Artifacts Publisher: 704 ms, Junit Publisher: 1371 ms, Open Task Scanner Publisher: 1 ms, Invoker Publisher: 1044 ms
[Pipeline] // withMaven
[Pipeline] cleanWs
[WS-CLEANUP] Deleting project workspace...
[WS-CLEANUP] Deferred wipeout is used...
[WS-CLEANUP] done
[Pipeline] }
[Pipeline] // stage
[Pipeline] }
[Pipeline] // ws
[Pipeline] }
[Pipeline] // node
[Pipeline] }
[INFO]           MCOMPILER-294\pom.xml ............................ SUCCESS (2.8 s)
[INFO] Building: MCOMPILER-298\pom.xml
[INFO]           MCOMPILER-298\pom.xml ............................ SUCCESS (3.9 s)
[INFO] Building: MCOMPILER-321_pathexceptions\pom.xml
[INFO] run post-build script verify.groovy
[INFO]           MCOMPILER-321_pathexceptions\pom.xml ............. SUCCESS (4.5 s)
[INFO] Building: MCOMPILER-328_multiReleaseOutput\pom.xml
[INFO] run post-build script verify.groovy
[INFO]           MCOMPILER-328_multiReleaseOutput\pom.xml ......... SUCCESS (11.6 s)
[INFO] Building: MCOMPILER-336_incremental-modulepath\pom.xml
[INFO]           MCOMPILER-336_incremental-modulepath\pom.xml ..... SUCCESS (29.5 s)
[INFO] Building: MCOMPILER-349_dependencyChanged\pom.xml
[INFO] run post-build script verify.groovy
[INFO]           MCOMPILER-349_dependencyChanged\pom.xml .......... SUCCESS (36.0 s)
[INFO] Building: MCOMPILER-360\pom.xml
[INFO]           MCOMPILER-360\pom.xml ............................ SUCCESS (11.1 s)
[INFO] Building: MCOMPILER-366\pom.xml
[INFO] run post-build script verify.groovy
[INFO]           MCOMPILER-366\pom.xml ............................ SUCCESS (13.4 s)
[INFO] Building: MCOMPILER-373_mrjar\pom.xml
[INFO]           MCOMPILER-373_mrjar\pom.xml ...................... SUCCESS (12.8 s)
[INFO] Building: MCOMPILER-379\pom.xml
[INFO]           MCOMPILER-379\pom.xml ............................ SUCCESS (10.9 s)
[INFO] Building: MCOMPILER-474_recompile-dependent-when-package\pom.xml
[INFO] run post-build script verify.groovy
[INFO]           MCOMPILER-474_recompile-dependent-when-package\pom.xml SUCCESS (39.7 s)
[INFO] Building: MCOMPILER-481-requires-static-included\pom.xml
[INFO]           MCOMPILER-481-requires-static-included\pom.xml ... SUCCESS (26.4 s)
[INFO] Building: MCOMPILER-485\pom.xml
[INFO] run post-build script verify.groovy
[INFO]           MCOMPILER-485\pom.xml ............................ SUCCESS (11.0 s)
[INFO] Building: multirelease-patterns\multimodule\pom.xml
[INFO] run post-build script verify.groovy
[INFO]           multirelease-patterns\multimodule\pom.xml ........ SUCCESS (36.6 s)
[INFO] Building: multirelease-patterns\multiproject\pom.xml
[INFO] run post-build script verify.groovy
[INFO]           multirelease-patterns\multiproject\pom.xml ....... SUCCESS (81.2 s)
[INFO] Building: multirelease-patterns\packaging-plugin\pom.xml
[INFO] run post-build script verify.groovy
[INFO]           multirelease-patterns\packaging-plugin\pom.xml ... SUCCESS (41.5 s)
[INFO] Building: multirelease-patterns\singleproject-runtime\pom.xml
[INFO] run post-build script verify.groovy
[INFO]           multirelease-patterns\singleproject-runtime\pom.xml SUCCESS (22.4 s)
[INFO] Building: multirelease-patterns\singleproject-toolchains\pom.xml
[INFO] run post-build script verify.groovy
[INFO]           multirelease-patterns\singleproject-toolchains\pom.xml SUCCESS (31.6 s)
[INFO] Building: non-english-warnings\pom.xml
[INFO] run post-build script verify.bsh
[INFO]           non-english-warnings\pom.xml ..................... SUCCESS (12.0 s)
[INFO] Building: test1\pom.xml
[INFO]           test1\pom.xml .................................... SUCCESS (11.7 s)
[INFO] 
[INFO] --- maven-checkstyle-plugin:3.0.0:check (checkstyle-check) @ maven-compiler-plugin ---
[INFO] There are 2 errors reported by Checkstyle 6.18 with config/maven_checks.xml ruleset.
[INFO] Ignored 2 errors, 0 violation remaining.
[INFO] 
[INFO] --- maven-invoker-plugin:3.2.2:verify (integration-test) @ maven-compiler-plugin ---
[INFO] -------------------------------------------------
[INFO] Build Summary:
[INFO]   Passed: 60, Failed: 0, Errors: 0, Skipped: 3
[INFO] -------------------------------------------------
[ERROR] The following builds was skipped:
[ERROR] *  default-fork\pom.xml
[ERROR] *  groovy-project-with-new-plexus-compiler\pom.xml
[ERROR] *  MCOMPILER-197\pom.xml
[INFO] -------------------------------------------------
[INFO] ------------------------------------------------------------------------
[INFO] BUILD SUCCESS
[INFO] ------------------------------------------------------------------------
[INFO] Total time:  18:37 min
[INFO] Finished at: 2022-02-28T02:48:24Z
[INFO] ------------------------------------------------------------------------
[INFO] [jenkins-event-spy] Generated F:\jenkins\jenkins-home\82467a7c\workspace\r-plugin-test-olamy_ci-reporting@2@tmp\withMaven4664a94c\maven-spy-20220228-022946-32818112508611412943685.log
[Pipeline] }
[Pipeline] // dir
[Pipeline] }
[withMaven] artifactsPublisher - Archive artifact windows-jdk17-m3.6.x_build\pom.xml under org\apache\maven\plugins\maven-compiler-plugin\3.10.1-SNAPSHOT\maven-compiler-plugin-3.10.1-SNAPSHOT.pom
[withMaven] artifactsPublisher - Archive artifact windows-jdk17-m3.6.x_build\target\maven-compiler-plugin-3.10.1-SNAPSHOT.jar under org\apache\maven\plugins\maven-compiler-plugin\3.10.1-SNAPSHOT\maven-compiler-plugin-3.10.1-SNAPSHOT.jar
[withMaven] junitPublisher - Archive test results for Maven artifact org.apache.maven.plugins:maven-compiler-plugin:maven-plugin:3.10.1-SNAPSHOT generated by maven-surefire-plugin:test (default-test): windows-jdk17-m3.6.x_build\target\surefire-reports\*.xml
Recording test results
[withMaven] Jenkins Task Scanner Plugin not found, don't display results of source code scanning for 'TODO' and 'FIXME' in pipeline screen.
[withMaven] invokerPublisher - Archive invoker results for Maven artifact MavenArtifact{org.apache.maven.plugins:maven-compiler-plugin:maven-plugin:3.10.1-SNAPSHOT(version: 3.10.1-SNAPSHOT, snapshot:false) } generated by PluginInvocation{org.apache.maven.plugins:maven-invoker-plugin:3.2.2@integration-test  integration-test}: windows-jdk17-m3.6.x_build\target\invoker-reports\*.xml
ERROR: [withMaven] invokerPublisher - Silently ignore exception archiving Invoker runs for Maven artifact MavenArtifact{org.apache.maven.plugins:maven-compiler-plugin:maven-plugin:3.10.1-SNAPSHOT(version: 3.10.1-SNAPSHOT, snapshot:false) } generated by PluginInvocation{org.apache.maven.plugins:maven-invoker-plugin:3.2.2@integration-test  integration-test}: java.io.IOException: Unknown attribute 'buildlog' for tag 'build-job' (position: START_TAG seen ...2\windows-jdk17-m3.6.x_build\target\it\MCOMPILER-129\build.log" />... @2:264) 
[withMaven] Publishers: Generated Artifacts Publisher: 599 ms, Junit Publisher: 642 ms, Open Task Scanner Publisher: 1 ms, Invoker Publisher: 1251 ms, Pipeline Graph Publisher: 3 ms
[Pipeline] // withMaven
[Pipeline] cleanWs
[WS-CLEANUP] Deleting project workspace...
[WS-CLEANUP] Deferred wipeout is used...
[WS-CLEANUP] done
[Pipeline] }
[Pipeline] // stage
[Pipeline] }
[Pipeline] // ws
[Pipeline] }
[Pipeline] // node
[Pipeline] }
[Pipeline] // parallel
[Pipeline] stage
[Pipeline] { (Notifications)
[Pipeline] echo
Build result: FAILURE
[Pipeline] jiraIssueSelector
[Pipeline] echo
The authors of changes [olamy].
[Pipeline] echo
Sending email ...
[Pipeline] emailext

Build succeeded in Jenkins: Maven » maven-compiler-plugin-test-olamy » ci-reporting #26

Posted by Apache Jenkins Server <je...@builds.apache.org>.
See https://ci-maven.apache.org/job/Maven/job/maven-compiler-plugin-test-olamy/job/ci-reporting/26/

Changes:

* add snapshot repo for parent snapshot

All tests passed