You are viewing a plain text version of this content. The canonical link for it is here.
Posted to commits@phoenix.apache.org by Apache Jenkins Server <je...@builds.apache.org> on 2017/03/03 06:35:51 UTC
Build failed in Jenkins: Phoenix | Master #1575
See <https://builds.apache.org/job/Phoenix-master/1575/display/redirect?page=changes>
Changes:
[samarth] PHOENIX-3702 RenewLeaseIT#testLeaseDoesNotTimeout failing on
[samarth] PHOENIX-3062 Ignore PhoenixTracingEndToEndIT till consensus is reached
[ssa] PHOENIX-3708 temporary disable tests introduced in PHOENIX-3346
------------------------------------------
[...truncated 81.80 KB...]
Tests run: 1, Failures: 0, Errors: 0, Skipped: 0, Time elapsed: 6.403 sec - in org.apache.phoenix.rpc.UpdateCacheWithScnIT
Tests run: 112, Failures: 0, Errors: 0, Skipped: 0, Time elapsed: 113.011 sec - in org.apache.phoenix.end2end.ScanQueryIT
Tests run: 112, Failures: 0, Errors: 0, Skipped: 0, Time elapsed: 213.066 sec - in org.apache.phoenix.end2end.MutableQueryIT
Tests run: 50, Failures: 0, Errors: 0, Skipped: 0, Time elapsed: 44.373 sec - in org.apache.phoenix.end2end.VariableLengthPKIT
Tests run: 46, Failures: 0, Errors: 0, Skipped: 0, Time elapsed: 119.746 sec - in org.apache.phoenix.end2end.RowValueConstructorIT
Tests run: 25, Failures: 0, Errors: 0, Skipped: 0, Time elapsed: 108.395 sec - in org.apache.phoenix.end2end.UpsertValuesIT
Tests run: 22, Failures: 0, Errors: 0, Skipped: 0, Time elapsed: 131.576 sec - in org.apache.phoenix.end2end.UpsertSelectIT
Results :
Tests run: 1418, Failures: 0, Errors: 0, Skipped: 0
[INFO]
[INFO] --- maven-failsafe-plugin:2.19.1:integration-test (HBaseManagedTimeTests) @ phoenix-core ---
-------------------------------------------------------
T E S T S
-------------------------------------------------------
Results :
Tests run: 0, Failures: 0, Errors: 0, Skipped: 0
[INFO]
[INFO] --- maven-failsafe-plugin:2.19.1:integration-test (NeedTheirOwnClusterTests) @ phoenix-core ---
-------------------------------------------------------
T E S T S
-------------------------------------------------------
Running org.apache.hadoop.hbase.regionserver.wal.WALReplayWithIndexWritesAndCompressedWALIT
Running org.apache.phoenix.end2end.ConnectionUtilIT
Tests run: 1, Failures: 0, Errors: 0, Skipped: 0, Time elapsed: 43.858 sec - in org.apache.hadoop.hbase.regionserver.wal.WALReplayWithIndexWritesAndCompressedWALIT
Running org.apache.phoenix.end2end.CountDistinctCompressionIT
Running org.apache.phoenix.end2end.AutomaticRebuildIT
Running org.apache.phoenix.end2end.CsvBulkLoadToolIT
Running org.apache.phoenix.end2end.ContextClassloaderIT
Tests run: 1, Failures: 0, Errors: 0, Skipped: 0, Time elapsed: 5.456 sec - in org.apache.phoenix.end2end.CountDistinctCompressionIT
Tests run: 3, Failures: 0, Errors: 0, Skipped: 0, Time elapsed: 4.246 sec - in org.apache.phoenix.end2end.ContextClassloaderIT
Tests run: 1, Failures: 0, Errors: 0, Skipped: 0, Time elapsed: 27.392 sec - in org.apache.phoenix.end2end.ConnectionUtilIT
Running org.apache.phoenix.end2end.FlappingLocalIndexIT
Running org.apache.phoenix.end2end.IndexExtendedIT
Running org.apache.phoenix.end2end.IndexToolForPartialBuildIT
Running org.apache.phoenix.end2end.IndexToolForPartialBuildWithNamespaceEnabledIT
Running org.apache.phoenix.end2end.QueryWithLimitIT
Running org.apache.phoenix.end2end.QueryTimeoutIT
Tests run: 2, Failures: 0, Errors: 0, Skipped: 0, Time elapsed: 38.805 sec - in org.apache.phoenix.end2end.IndexToolForPartialBuildIT
Tests run: 2, Failures: 0, Errors: 0, Skipped: 0, Time elapsed: 9.544 sec - in org.apache.phoenix.end2end.QueryWithLimitIT
Tests run: 2, Failures: 0, Errors: 0, Skipped: 0, Time elapsed: 19.442 sec - in org.apache.phoenix.end2end.QueryTimeoutIT
Tests run: 11, Failures: 0, Errors: 0, Skipped: 0, Time elapsed: 87.687 sec - in org.apache.phoenix.end2end.CsvBulkLoadToolIT
Tests run: 8, Failures: 0, Errors: 0, Skipped: 0, Time elapsed: 80.021 sec - in org.apache.phoenix.end2end.FlappingLocalIndexIT
Tests run: 2, Failures: 0, Errors: 0, Skipped: 0, Time elapsed: 69.447 sec - in org.apache.phoenix.end2end.IndexToolForPartialBuildWithNamespaceEnabledIT
Running org.apache.phoenix.end2end.RegexBulkLoadToolIT
Running org.apache.phoenix.end2end.RenewLeaseIT
Running org.apache.phoenix.end2end.SpillableGroupByIT
Running org.apache.phoenix.end2end.StatsCollectorIT
Tests run: 2, Failures: 0, Errors: 0, Skipped: 0, Time elapsed: 9.358 sec - in org.apache.phoenix.end2end.SpillableGroupByIT
Running org.apache.phoenix.end2end.SysTableNamespaceMappedStatsCollectorIT
Tests run: 2, Failures: 0, Errors: 0, Skipped: 0, Time elapsed: 153.016 sec - in org.apache.phoenix.end2end.AutomaticRebuildIT
Tests run: 1, Failures: 0, Errors: 0, Skipped: 0, Time elapsed: 36.56 sec - in org.apache.phoenix.end2end.RenewLeaseIT
Running org.apache.phoenix.end2end.UserDefinedFunctionsIT
Running org.apache.phoenix.end2end.index.ImmutableIndexIT
Tests run: 10, Failures: 0, Errors: 0, Skipped: 0, Time elapsed: 78.23 sec - in org.apache.phoenix.end2end.RegexBulkLoadToolIT
Running org.apache.phoenix.end2end.index.MutableIndexFailureIT
Running org.apache.phoenix.end2end.index.LocalIndexIT
Tests run: 14, Failures: 0, Errors: 0, Skipped: 0, Time elapsed: 42.822 sec - in org.apache.phoenix.end2end.UserDefinedFunctionsIT
Running org.apache.phoenix.end2end.index.MutableIndexReplicationIT
Tests run: 1, Failures: 0, Errors: 0, Skipped: 0, Time elapsed: 20.659 sec - in org.apache.phoenix.end2end.index.MutableIndexReplicationIT
Running org.apache.phoenix.end2end.index.ReadOnlyIndexFailureIT
Running org.apache.phoenix.end2end.index.txn.TxWriteFailureIT
Tests run: 2, Failures: 0, Errors: 0, Skipped: 0, Time elapsed: 27.449 sec - in org.apache.phoenix.end2end.index.ReadOnlyIndexFailureIT
Tests run: 80, Failures: 0, Errors: 0, Skipped: 0, Time elapsed: 279.679 sec - in org.apache.phoenix.end2end.IndexExtendedIT
Running org.apache.phoenix.hbase.index.FailForUnsupportedHBaseVersionsIT
Tests run: 2, Failures: 0, Errors: 0, Skipped: 0, Time elapsed: 20.565 sec - in org.apache.phoenix.hbase.index.FailForUnsupportedHBaseVersionsIT
Running org.apache.phoenix.hbase.index.covered.EndToEndCoveredColumnsIndexBuilderIT
Running org.apache.phoenix.execute.PartialCommitIT
Tests run: 12, Failures: 0, Errors: 0, Skipped: 0, Time elapsed: 7.593 sec - in org.apache.phoenix.execute.PartialCommitIT
Tests run: 8, Failures: 0, Errors: 0, Skipped: 0, Time elapsed: 59.154 sec - in org.apache.phoenix.end2end.index.txn.TxWriteFailureIT
Tests run: 2, Failures: 0, Errors: 0, Skipped: 0, Time elapsed: 18.383 sec - in org.apache.phoenix.hbase.index.covered.EndToEndCoveredColumnsIndexBuilderIT
Running org.apache.phoenix.hbase.index.covered.example.FailWithoutRetriesIT
Tests run: 1, Failures: 0, Errors: 0, Skipped: 0, Time elapsed: 8.619 sec - in org.apache.phoenix.hbase.index.covered.example.FailWithoutRetriesIT
Running org.apache.phoenix.hbase.index.covered.example.EndToEndCoveredIndexingIT
Running org.apache.phoenix.hbase.index.covered.example.EndtoEndIndexingWithCompressionIT
Tests run: 120, Failures: 0, Errors: 0, Skipped: 24, Time elapsed: 257.782 sec - in org.apache.phoenix.end2end.StatsCollectorIT
Tests run: 120, Failures: 0, Errors: 0, Skipped: 24, Time elapsed: 251.993 sec - in org.apache.phoenix.end2end.SysTableNamespaceMappedStatsCollectorIT
Running org.apache.phoenix.iterate.RoundRobinResultIteratorWithStatsIT
Running org.apache.phoenix.iterate.ScannerLeaseRenewalIT
Running org.apache.phoenix.monitoring.PhoenixMetricsIT
Tests run: 1, Failures: 0, Errors: 0, Skipped: 0, Time elapsed: 10.66 sec - in org.apache.phoenix.iterate.RoundRobinResultIteratorWithStatsIT
Tests run: 28, Failures: 0, Errors: 0, Skipped: 0, Time elapsed: 241.565 sec - in org.apache.phoenix.end2end.index.LocalIndexIT
Running org.apache.phoenix.rpc.PhoenixClientRpcIT
Running org.apache.phoenix.rpc.PhoenixServerRpcIT
Tests run: 2, Failures: 0, Errors: 0, Skipped: 0, Time elapsed: 11.349 sec - in org.apache.phoenix.rpc.PhoenixClientRpcIT
Tests run: 1, Failures: 0, Errors: 0, Skipped: 0, Time elapsed: 21 sec - in org.apache.phoenix.rpc.PhoenixServerRpcIT
Tests run: 21, Failures: 0, Errors: 0, Skipped: 0, Time elapsed: 67.396 sec - in org.apache.phoenix.monitoring.PhoenixMetricsIT
Tests run: 11, Failures: 0, Errors: 0, Skipped: 0, Time elapsed: 128.364 sec - in org.apache.phoenix.hbase.index.covered.example.EndToEndCoveredIndexingIT
Tests run: 8, Failures: 0, Errors: 0, Skipped: 0, Time elapsed: 317.688 sec - in org.apache.phoenix.end2end.index.MutableIndexFailureIT
Tests run: 11, Failures: 0, Errors: 0, Skipped: 0, Time elapsed: 128.209 sec - in org.apache.phoenix.hbase.index.covered.example.EndtoEndIndexingWithCompressionIT
Tests run: 2, Failures: 0, Errors: 0, Skipped: 0, Time elapsed: 171.619 sec - in org.apache.phoenix.iterate.ScannerLeaseRenewalIT
Tests run: 25, Failures: 0, Errors: 11, Skipped: 0, Time elapsed: 676.099 sec <<< FAILURE! - in org.apache.phoenix.end2end.index.ImmutableIndexIT
testCreateIndexDuringUpsertSelect[ImmutableIndexIT_localIndex=false,transactional=true,columnEncoded=false](org.apache.phoenix.end2end.index.ImmutableIndexIT) Time elapsed: 46.156 sec <<< ERROR!
java.lang.RuntimeException: java.lang.Exception: Thrift error for org.apache.tephra.distributed.TransactionServiceClient$2@3f802351: Unable to discover tx service.
at org.apache.phoenix.end2end.index.ImmutableIndexIT.testCreateIndexDuringUpsertSelect(ImmutableIndexIT.java:179)
Caused by: java.lang.Exception: Thrift error for org.apache.tephra.distributed.TransactionServiceClient$2@3f802351: Unable to discover tx service.
at org.apache.phoenix.end2end.index.ImmutableIndexIT.testCreateIndexDuringUpsertSelect(ImmutableIndexIT.java:179)
Caused by: org.apache.thrift.TException: Unable to discover tx service.
at org.apache.phoenix.end2end.index.ImmutableIndexIT.testCreateIndexDuringUpsertSelect(ImmutableIndexIT.java:179)
testDropIfImmutableKeyValueColumn[ImmutableIndexIT_localIndex=false,transactional=true,columnEncoded=false](org.apache.phoenix.end2end.index.ImmutableIndexIT) Time elapsed: 46.117 sec <<< ERROR!
java.lang.RuntimeException: java.lang.Exception: Thrift error for org.apache.tephra.distributed.TransactionServiceClient$2@2f0838f8: Unable to discover tx service.
at org.apache.phoenix.end2end.index.ImmutableIndexIT.testDropIfImmutableKeyValueColumn(ImmutableIndexIT.java:130)
Caused by: java.lang.Exception: Thrift error for org.apache.tephra.distributed.TransactionServiceClient$2@2f0838f8: Unable to discover tx service.
at org.apache.phoenix.end2end.index.ImmutableIndexIT.testDropIfImmutableKeyValueColumn(ImmutableIndexIT.java:130)
Caused by: org.apache.thrift.TException: Unable to discover tx service.
at org.apache.phoenix.end2end.index.ImmutableIndexIT.testDropIfImmutableKeyValueColumn(ImmutableIndexIT.java:130)
testCreateIndexWhileUpsertingData[ImmutableIndexIT_localIndex=false,transactional=true,columnEncoded=false](org.apache.phoenix.end2end.index.ImmutableIndexIT) Time elapsed: 46.118 sec <<< ERROR!
java.lang.RuntimeException: java.lang.Exception: Thrift error for org.apache.tephra.distributed.TransactionServiceClient$2@388a14ff: Unable to discover tx service.
at org.apache.phoenix.end2end.index.ImmutableIndexIT.testCreateIndexWhileUpsertingData(ImmutableIndexIT.java:275)
Caused by: java.lang.Exception: Thrift error for org.apache.tephra.distributed.TransactionServiceClient$2@388a14ff: Unable to discover tx service.
at org.apache.phoenix.end2end.index.ImmutableIndexIT.testCreateIndexWhileUpsertingData(ImmutableIndexIT.java:275)
Caused by: org.apache.thrift.TException: Unable to discover tx service.
at org.apache.phoenix.end2end.index.ImmutableIndexIT.testCreateIndexWhileUpsertingData(ImmutableIndexIT.java:275)
testCreateIndexDuringUpsertSelect[ImmutableIndexIT_localIndex=false,transactional=true,columnEncoded=true](org.apache.phoenix.end2end.index.ImmutableIndexIT) Time elapsed: 46.122 sec <<< ERROR!
java.lang.RuntimeException: java.lang.Exception: Thrift error for org.apache.tephra.distributed.TransactionServiceClient$2@513fd7b: Unable to discover tx service.
at org.apache.phoenix.end2end.index.ImmutableIndexIT.testCreateIndexDuringUpsertSelect(ImmutableIndexIT.java:179)
Caused by: java.lang.Exception: Thrift error for org.apache.tephra.distributed.TransactionServiceClient$2@513fd7b: Unable to discover tx service.
at org.apache.phoenix.end2end.index.ImmutableIndexIT.testCreateIndexDuringUpsertSelect(ImmutableIndexIT.java:179)
Caused by: org.apache.thrift.TException: Unable to discover tx service.
at org.apache.phoenix.end2end.index.ImmutableIndexIT.testCreateIndexDuringUpsertSelect(ImmutableIndexIT.java:179)
testDropIfImmutableKeyValueColumn[ImmutableIndexIT_localIndex=false,transactional=true,columnEncoded=true](org.apache.phoenix.end2end.index.ImmutableIndexIT) Time elapsed: 46.12 sec <<< ERROR!
java.lang.RuntimeException: java.lang.Exception: Thrift error for org.apache.tephra.distributed.TransactionServiceClient$2@9137b72: Unable to discover tx service.
at org.apache.phoenix.end2end.index.ImmutableIndexIT.testDropIfImmutableKeyValueColumn(ImmutableIndexIT.java:130)
Caused by: java.lang.Exception: Thrift error for org.apache.tephra.distributed.TransactionServiceClient$2@9137b72: Unable to discover tx service.
at org.apache.phoenix.end2end.index.ImmutableIndexIT.testDropIfImmutableKeyValueColumn(ImmutableIndexIT.java:130)
Caused by: org.apache.thrift.TException: Unable to discover tx service.
at org.apache.phoenix.end2end.index.ImmutableIndexIT.testDropIfImmutableKeyValueColumn(ImmutableIndexIT.java:130)
testCreateIndexWhileUpsertingData[ImmutableIndexIT_localIndex=false,transactional=true,columnEncoded=true](org.apache.phoenix.end2end.index.ImmutableIndexIT) Time elapsed: 46.118 sec <<< ERROR!
java.lang.RuntimeException: java.lang.Exception: Thrift error for org.apache.tephra.distributed.TransactionServiceClient$2@1d3ae1bc: Unable to discover tx service.
at org.apache.phoenix.end2end.index.ImmutableIndexIT.testCreateIndexWhileUpsertingData(ImmutableIndexIT.java:275)
Caused by: java.lang.Exception: Thrift error for org.apache.tephra.distributed.TransactionServiceClient$2@1d3ae1bc: Unable to discover tx service.
at org.apache.phoenix.end2end.index.ImmutableIndexIT.testCreateIndexWhileUpsertingData(ImmutableIndexIT.java:275)
Caused by: org.apache.thrift.TException: Unable to discover tx service.
at org.apache.phoenix.end2end.index.ImmutableIndexIT.testCreateIndexWhileUpsertingData(ImmutableIndexIT.java:275)
testDropIfImmutableKeyValueColumn[ImmutableIndexIT_localIndex=true,transactional=true,columnEncoded=false](org.apache.phoenix.end2end.index.ImmutableIndexIT) Time elapsed: 46.118 sec <<< ERROR!
java.lang.RuntimeException: java.lang.Exception: Thrift error for org.apache.tephra.distributed.TransactionServiceClient$2@3b97aec0: Unable to discover tx service.
at org.apache.phoenix.end2end.index.ImmutableIndexIT.testDropIfImmutableKeyValueColumn(ImmutableIndexIT.java:130)
Caused by: java.lang.Exception: Thrift error for org.apache.tephra.distributed.TransactionServiceClient$2@3b97aec0: Unable to discover tx service.
at org.apache.phoenix.end2end.index.ImmutableIndexIT.testDropIfImmutableKeyValueColumn(ImmutableIndexIT.java:130)
Caused by: org.apache.thrift.TException: Unable to discover tx service.
at org.apache.phoenix.end2end.index.ImmutableIndexIT.testDropIfImmutableKeyValueColumn(ImmutableIndexIT.java:130)
testCreateIndexWhileUpsertingData[ImmutableIndexIT_localIndex=true,transactional=true,columnEncoded=false](org.apache.phoenix.end2end.index.ImmutableIndexIT) Time elapsed: 46.115 sec <<< ERROR!
java.lang.RuntimeException: java.lang.Exception: Thrift error for org.apache.tephra.distributed.TransactionServiceClient$2@5df14070: Unable to discover tx service.
at org.apache.phoenix.end2end.index.ImmutableIndexIT.testCreateIndexWhileUpsertingData(ImmutableIndexIT.java:275)
Caused by: java.lang.Exception: Thrift error for org.apache.tephra.distributed.TransactionServiceClient$2@5df14070: Unable to discover tx service.
at org.apache.phoenix.end2end.index.ImmutableIndexIT.testCreateIndexWhileUpsertingData(ImmutableIndexIT.java:275)
Caused by: org.apache.thrift.TException: Unable to discover tx service.
at org.apache.phoenix.end2end.index.ImmutableIndexIT.testCreateIndexWhileUpsertingData(ImmutableIndexIT.java:275)
testDropIfImmutableKeyValueColumn[ImmutableIndexIT_localIndex=true,transactional=true,columnEncoded=true](org.apache.phoenix.end2end.index.ImmutableIndexIT) Time elapsed: 46.116 sec <<< ERROR!
java.lang.RuntimeException: java.lang.Exception: Thrift error for org.apache.tephra.distributed.TransactionServiceClient$2@47fcc2a: Unable to discover tx service.
at org.apache.phoenix.end2end.index.ImmutableIndexIT.testDropIfImmutableKeyValueColumn(ImmutableIndexIT.java:130)
Caused by: java.lang.Exception: Thrift error for org.apache.tephra.distributed.TransactionServiceClient$2@47fcc2a: Unable to discover tx service.
at org.apache.phoenix.end2end.index.ImmutableIndexIT.testDropIfImmutableKeyValueColumn(ImmutableIndexIT.java:130)
Caused by: org.apache.thrift.TException: Unable to discover tx service.
at org.apache.phoenix.end2end.index.ImmutableIndexIT.testDropIfImmutableKeyValueColumn(ImmutableIndexIT.java:130)
testCreateIndexWhileUpsertingData[ImmutableIndexIT_localIndex=true,transactional=true,columnEncoded=true](org.apache.phoenix.end2end.index.ImmutableIndexIT) Time elapsed: 46.115 sec <<< ERROR!
java.lang.RuntimeException: java.lang.Exception: Thrift error for org.apache.tephra.distributed.TransactionServiceClient$2@6fc2eb12: Unable to discover tx service.
at org.apache.phoenix.end2end.index.ImmutableIndexIT.testCreateIndexWhileUpsertingData(ImmutableIndexIT.java:275)
Caused by: java.lang.Exception: Thrift error for org.apache.tephra.distributed.TransactionServiceClient$2@6fc2eb12: Unable to discover tx service.
at org.apache.phoenix.end2end.index.ImmutableIndexIT.testCreateIndexWhileUpsertingData(ImmutableIndexIT.java:275)
Caused by: org.apache.thrift.TException: Unable to discover tx service.
at org.apache.phoenix.end2end.index.ImmutableIndexIT.testCreateIndexWhileUpsertingData(ImmutableIndexIT.java:275)
org.apache.phoenix.end2end.index.ImmutableIndexIT Time elapsed: 55.181 sec <<< ERROR!
com.google.common.util.concurrent.UncheckedExecutionException: java.lang.Exception: Service failed while running
Caused by: java.lang.Exception: Service failed while running
Caused by: com.google.common.util.concurrent.UncheckedExecutionException: org.apache.thrift.transport.TTransportException: Could not create ServerSocket on address /0.0.0.0:35865.
Caused by: org.apache.thrift.transport.TTransportException: Could not create ServerSocket on address /0.0.0.0:35865.
Results :
Tests in error:
ImmutableIndexIT>BaseUniqueNamesOwnClusterIT.doTeardown:36->BaseTest.tearDownMiniCluster:544->BaseTest.tearDownTxManager:441 » UncheckedExecution
ImmutableIndexIT.testCreateIndexDuringUpsertSelect:179 » Runtime java.lang.Exc...
ImmutableIndexIT.testCreateIndexDuringUpsertSelect:179 » Runtime java.lang.Exc...
ImmutableIndexIT.testCreateIndexWhileUpsertingData:275 » Runtime java.lang.Exc...
ImmutableIndexIT.testCreateIndexWhileUpsertingData:275 » Runtime java.lang.Exc...
ImmutableIndexIT.testCreateIndexWhileUpsertingData:275 » Runtime java.lang.Exc...
ImmutableIndexIT.testCreateIndexWhileUpsertingData:275 » Runtime java.lang.Exc...
ImmutableIndexIT.testDropIfImmutableKeyValueColumn:130 » Runtime java.lang.Exc...
ImmutableIndexIT.testDropIfImmutableKeyValueColumn:130 » Runtime java.lang.Exc...
ImmutableIndexIT.testDropIfImmutableKeyValueColumn:130 » Runtime java.lang.Exc...
ImmutableIndexIT.testDropIfImmutableKeyValueColumn:130 » Runtime java.lang.Exc...
Tests run: 520, Failures: 0, Errors: 11, Skipped: 48
[INFO]
[INFO] --- maven-failsafe-plugin:2.19.1:verify (ParallelStatsEnabledTest) @ phoenix-core ---
[INFO] ------------------------------------------------------------------------
[INFO] Reactor Summary:
[INFO]
[INFO] Apache Phoenix ..................................... SUCCESS [ 4.611 s]
[INFO] Phoenix Core ....................................... FAILURE [ 01:11 h]
[INFO] Phoenix - Flume .................................... SKIPPED
[INFO] Phoenix - Kafka .................................... SKIPPED
[INFO] Phoenix - Pig ...................................... SKIPPED
[INFO] Phoenix Query Server Client ........................ SKIPPED
[INFO] Phoenix Query Server ............................... SKIPPED
[INFO] Phoenix - Pherf .................................... SKIPPED
[INFO] Phoenix - Spark .................................... SKIPPED
[INFO] Phoenix - Hive ..................................... SKIPPED
[INFO] Phoenix Client ..................................... SKIPPED
[INFO] Phoenix Server ..................................... SKIPPED
[INFO] Phoenix Assembly ................................... SKIPPED
[INFO] Phoenix - Tracing Web Application .................. SKIPPED
[INFO] ------------------------------------------------------------------------
[INFO] BUILD FAILURE
[INFO] ------------------------------------------------------------------------
[INFO] Total time: 01:11 h
[INFO] Finished at: 2017-03-03T06:31:19+00:00
[INFO] Final Memory: 60M/809M
[INFO] ------------------------------------------------------------------------
[ERROR] Failed to execute goal org.apache.maven.plugins:maven-failsafe-plugin:2.19.1:verify (ParallelStatsEnabledTest) on project phoenix-core: There are test failures.
[ERROR]
[ERROR] Please refer to <https://builds.apache.org/job/Phoenix-master/ws/phoenix-core/target/failsafe-reports> for the individual test results.
[ERROR] -> [Help 1]
[ERROR]
[ERROR] To see the full stack trace of the errors, re-run Maven with the -e switch.
[ERROR] Re-run Maven using the -X switch to enable full debug logging.
[ERROR]
[ERROR] For more information about the errors and possible solutions, please read the following articles:
[ERROR] [Help 1] http://cwiki.apache.org/confluence/display/MAVEN/MojoFailureException
[ERROR]
[ERROR] After correcting the problems, you can resume the build with the command
[ERROR] mvn <goals> -rf :phoenix-core
Build step 'Invoke top-level Maven targets' marked build as failure
Archiving artifacts
[JIRA] Updating issue PHOENIX-3702
[JIRA] Updating issue PHOENIX-3062
[JIRA] Updating issue PHOENIX-3708
[JIRA] Updating issue PHOENIX-3346
Recording test results
Jenkins build is back to normal : Phoenix | Master #1576
Posted by Apache Jenkins Server <je...@builds.apache.org>.
See <https://builds.apache.org/job/Phoenix-master/1576/display/redirect?page=changes>