You are viewing a plain text version of this content. The canonical link for it is here.
Posted to builds@beam.apache.org by Apache Jenkins Server <je...@builds.apache.org> on 2023/04/27 13:42:17 UTC

Build failed in Jenkins: beam_PostCommit_Python_Examples_Spark #1733

See <https://ci-beam.apache.org/job/beam_PostCommit_Python_Examples_Spark/1733/display/redirect>

Changes:


------------------------------------------
[...truncated 5.09 MB...]
    declare_namespace(parent)

../../build/gradleenv/2022703441/lib/python3.7/site-packages/pkg_resources/__init__.py:2870
  <https://ci-beam.apache.org/job/beam_PostCommit_Python_Examples_Spark/ws/src/build/gradleenv/2022703441/lib/python3.7/site-packages/pkg_resources/__init__.py>:2870: DeprecationWarning: Deprecated call to `pkg_resources.declare_namespace('google.logging')`.
  Implementing implicit namespace packages (as specified in PEP 420) is preferred to `pkg_resources.declare_namespace`. See https://setuptools.pypa.io/en/latest/references/keywords.html#keyword-namespace-packages
    declare_namespace(pkg)

../../build/gradleenv/2022703441/lib/python3.7/site-packages/pkg_resources/__init__.py:2870
  <https://ci-beam.apache.org/job/beam_PostCommit_Python_Examples_Spark/ws/src/build/gradleenv/2022703441/lib/python3.7/site-packages/pkg_resources/__init__.py>:2870: DeprecationWarning: Deprecated call to `pkg_resources.declare_namespace('google.iam')`.
  Implementing implicit namespace packages (as specified in PEP 420) is preferred to `pkg_resources.declare_namespace`. See https://setuptools.pypa.io/en/latest/references/keywords.html#keyword-namespace-packages
    declare_namespace(pkg)

../../build/gradleenv/2022703441/lib/python3.7/site-packages/google/rpc/__init__.py:20
  <https://ci-beam.apache.org/job/beam_PostCommit_Python_Examples_Spark/ws/src/build/gradleenv/2022703441/lib/python3.7/site-packages/google/rpc/__init__.py>:20: DeprecationWarning: Deprecated call to `pkg_resources.declare_namespace('google.rpc')`.
  Implementing implicit namespace packages (as specified in PEP 420) is preferred to `pkg_resources.declare_namespace`. See https://setuptools.pypa.io/en/latest/references/keywords.html#keyword-namespace-packages
    pkg_resources.declare_namespace(__name__)

apache_beam/examples/complete/game/hourly_team_score_it_test.py::HourlyTeamScoreIT::test_hourly_team_score_output_checksum_on_small_input
  <https://ci-beam.apache.org/job/beam_PostCommit_Python_Examples_Spark/ws/src/sdks/python/apache_beam/io/gcp/tests/utils.py>:63: PendingDeprecationWarning: Client.dataset is deprecated and will be removed in a future version. Use a string like 'my_project.my_dataset' or a cloud.google.bigquery.DatasetReference object, instead.
    dataset_ref = client.dataset(unique_dataset_name, project=project)

apache_beam/examples/complete/game/hourly_team_score_it_test.py::HourlyTeamScoreIT::test_hourly_team_score_output_checksum_on_small_input
apache_beam/examples/cookbook/bigquery_tornadoes_it_test.py::BigqueryTornadoesIT::test_bigquery_tornadoes_it
apache_beam/examples/cookbook/filters_test.py::FiltersTest::test_filters_output_bigquery_matcher
  <https://ci-beam.apache.org/job/beam_PostCommit_Python_Examples_Spark/ws/src/sdks/python/apache_beam/io/gcp/bigquery.py>:2029: BeamDeprecationWarning: options is deprecated since First stable release. References to <pipeline>.options will not be supported
    is_streaming_pipeline = p.options.view_as(StandardOptions).streaming

apache_beam/examples/complete/game/hourly_team_score_it_test.py::HourlyTeamScoreIT::test_hourly_team_score_output_checksum_on_small_input
apache_beam/examples/cookbook/bigquery_tornadoes_it_test.py::BigqueryTornadoesIT::test_bigquery_tornadoes_it
apache_beam/examples/cookbook/filters_test.py::FiltersTest::test_filters_output_bigquery_matcher
  <https://ci-beam.apache.org/job/beam_PostCommit_Python_Examples_Spark/ws/src/sdks/python/apache_beam/io/gcp/bigquery.py>:2035: BeamDeprecationWarning: options is deprecated since First stable release. References to <pipeline>.options will not be supported
    experiments = p.options.view_as(DebugOptions).experiments or []

apache_beam/examples/complete/game/hourly_team_score_it_test.py::HourlyTeamScoreIT::test_hourly_team_score_output_checksum_on_small_input
apache_beam/examples/cookbook/bigquery_tornadoes_it_test.py::BigqueryTornadoesIT::test_bigquery_tornadoes_it
apache_beam/examples/cookbook/filters_test.py::FiltersTest::test_filters_output_bigquery_matcher
  <https://ci-beam.apache.org/job/beam_PostCommit_Python_Examples_Spark/ws/src/sdks/python/apache_beam/io/gcp/bigquery_file_loads.py>:1173: BeamDeprecationWarning: options is deprecated since First stable release. References to <pipeline>.options will not be supported
    temp_location = p.options.view_as(GoogleCloudOptions).temp_location

apache_beam/examples/complete/game/hourly_team_score_it_test.py::HourlyTeamScoreIT::test_hourly_team_score_output_checksum_on_small_input
apache_beam/examples/cookbook/bigquery_tornadoes_it_test.py::BigqueryTornadoesIT::test_bigquery_tornadoes_it
apache_beam/examples/cookbook/filters_test.py::FiltersTest::test_filters_output_bigquery_matcher
  <https://ci-beam.apache.org/job/beam_PostCommit_Python_Examples_Spark/ws/src/sdks/python/apache_beam/io/gcp/bigquery_file_loads.py>:1175: BeamDeprecationWarning: options is deprecated since First stable release. References to <pipeline>.options will not be supported
    p.options.view_as(GoogleCloudOptions).job_name or 'AUTOMATIC_JOB_NAME')

apache_beam/examples/cookbook/bigquery_side_input_it_test.py::BigQuerySideInputIT::test_bigquery_side_input_it
apache_beam/examples/cookbook/bigquery_side_input_it_test.py::BigQuerySideInputIT::test_bigquery_side_input_it
apache_beam/examples/cookbook/bigquery_tornadoes_it_test.py::BigqueryTornadoesIT::test_bigquery_tornadoes_it
apache_beam/examples/cookbook/filters_test.py::FiltersTest::test_filters_output_bigquery_matcher
apache_beam/examples/dataframe/flight_delays_it_test.py::FlightDelaysTest::test_flight_delays
  <https://ci-beam.apache.org/job/beam_PostCommit_Python_Examples_Spark/ws/src/sdks/python/apache_beam/io/gcp/bigquery.py>:2665: BeamDeprecationWarning: options is deprecated since First stable release. References to <pipeline>.options will not be supported
    temp_location = pcoll.pipeline.options.view_as(

apache_beam/examples/cookbook/bigquery_side_input_it_test.py::BigQuerySideInputIT::test_bigquery_side_input_it
apache_beam/examples/cookbook/bigquery_side_input_it_test.py::BigQuerySideInputIT::test_bigquery_side_input_it
apache_beam/examples/cookbook/bigquery_tornadoes_it_test.py::BigqueryTornadoesIT::test_bigquery_tornadoes_it
apache_beam/examples/cookbook/filters_test.py::FiltersTest::test_filters_output_bigquery_matcher
apache_beam/examples/dataframe/flight_delays_it_test.py::FlightDelaysTest::test_flight_delays
  <https://ci-beam.apache.org/job/beam_PostCommit_Python_Examples_Spark/ws/src/sdks/python/apache_beam/io/gcp/bigquery.py>:2667: BeamDeprecationWarning: options is deprecated since First stable release. References to <pipeline>.options will not be supported
    job_name = pcoll.pipeline.options.view_as(GoogleCloudOptions).job_name

apache_beam/examples/cookbook/bigquery_side_input_it_test.py::BigQuerySideInputIT::test_bigquery_side_input_it

Exception in thread read_grpc_client_inputs:
Traceback (most recent call last):
  File "/usr/lib/python3.7/threading.py", line 926, in _bootstrap_inner
    self.run()
  File "/usr/lib/python3.7/threading.py", line 870, in run
    self._target(*self._args, **self._kwargs)
  File "<https://ci-beam.apache.org/job/beam_PostCommit_Python_Examples_Spark/ws/src/sdks/python/apache_beam/runners/worker/data_plane.py",> line 671, in <lambda>
    target=lambda: self._read_inputs(elements_iterator),
apache_beam/examples/cookbook/bigquery_side_input_it_test.py::BigQuerySideInputIT::test_bigquery_side_input_it
apache_beam/examples/cookbook/bigquery_tornadoes_it_test.py::BigqueryTornadoesIT::test_bigquery_tornadoes_it
apache_beam/examples/cookbook/filters_test.py::FiltersTest::test_filters_output_bigquery_matcher
apache_beam/examples/dataframe/flight_delays_it_test.py::FlightDelaysTest::test_flight_delays
  File "<https://ci-beam.apache.org/job/beam_PostCommit_Python_Examples_Spark/ws/src/sdks/python/apache_beam/runners/worker/data_plane.py",> line 654, in _read_inputs
    for elements in elements_iterator:
  <https://ci-beam.apache.org/job/beam_PostCommit_Python_Examples_Spark/ws/src/sdks/python/apache_beam/io/gcp/bigquery.py>:2698: BeamDeprecationWarning: options is deprecated since First stable release. References to <pipeline>.options will not be supported
    | _PassThroughThenCleanup(files_to_remove_pcoll))

apache_beam/examples/cookbook/bigquery_tornadoes_it_test.py::BigqueryTornadoesIT::test_bigquery_tornadoes_it
  File "<https://ci-beam.apache.org/job/beam_PostCommit_Python_Examples_Spark/ws/src/build/gradleenv/2022703441/lib/python3.7/site-packages/grpc/_channel.py",> line 475, in __next__
    return self._next()
apache_beam/examples/cookbook/filters_test.py::FiltersTest::test_filters_output_bigquery_matcher
  <https://ci-beam.apache.org/job/beam_PostCommit_Python_Examples_Spark/ws/src/sdks/python/apache_beam/io/gcp/bigquery.py>:2025: BeamDeprecationWarning: options is deprecated since First stable release. References to <pipeline>.options will not be supported
    self.table_reference.projectId = pcoll.pipeline.options.view_as(
  File "<https://ci-beam.apache.org/job/beam_PostCommit_Python_Examples_Spark/ws/src/build/gradleenv/2022703441/lib/python3.7/site-packages/grpc/_channel.py",> line 881, in _next
    raise self
grpc._channel._MultiThreadedRendezvous: <_MultiThreadedRendezvous of RPC that terminated with:
	status = StatusCode.CANCELLED
	details = "Multiplexer hanging up"

apache_beam/examples/cookbook/bigquery_tornadoes_it_test.py::BigqueryTornadoesIT::test_bigquery_tornadoes_it
apache_beam/examples/cookbook/filters_test.py::FiltersTest::test_filters_output_bigquery_matcher
  <https://ci-beam.apache.org/job/beam_PostCommit_Python_Examples_Spark/ws/src/sdks/python/apache_beam/io/gcp/bigquery_file_loads.py>:1166: BeamDeprecationWarning: options is deprecated since First stable release. References to <pipeline>.options will not be supported
    self.project = self.project or p.options.view_as(GoogleCloudOptions).project
	debug_error_string = "UNKNOWN:Error received from peer ipv6:%5B::1%5D:36175 {created_time:"2023-04-27T13:41:40.40993566+00:00", grpc_status:1, grpc_message:"Multiplexer hanging up"}"
>

Exception in thread read_grpc_client_inputs:
Traceback (most recent call last):
  File "/usr/lib/python3.7/threading.py", line 926, in _bootstrap_inner
    self.run()
  File "/usr/lib/python3.7/threading.py", line 870, in run
    self._target(*self._args, **self._kwargs)
  File "<https://ci-beam.apache.org/job/beam_PostCommit_Python_Examples_Spark/ws/src/sdks/python/apache_beam/runners/worker/data_plane.py",> line 671, in <lambda>
    target=lambda: self._read_inputs(elements_iterator),
  File "<https://ci-beam.apache.org/job/beam_PostCommit_Python_Examples_Spark/ws/src/sdks/python/apache_beam/runners/worker/data_plane.py",> line 654, in _read_inputs
    for elements in elements_iterator:
  File "<https://ci-beam.apache.org/job/beam_PostCommit_Python_Examples_Spark/ws/src/build/gradleenv/2022703441/lib/python3.7/site-packages/grpc/_channel.py",> line 475, in __next__
    return self._next()
  File "<https://ci-beam.apache.org/job/beam_PostCommit_Python_Examples_Spark/ws/src/build/gradleenv/2022703441/lib/python3.7/site-packages/grpc/_channel.py",> line 881, in _next
    raise self
grpc._channel._MultiThreadedRendezvous: <_MultiThreadedRendezvous of RPC that terminated with:
	status = StatusCode.CANCELLED
	details = "Multiplexer hanging up"
	debug_error_string = "UNKNOWN:Error received from peer ipv6:%5B::1%5D:38919 {created_time:"2023-04-27T13:41:40.870776465+00:00", grpc_status:1, grpc_message:"Multiplexer hanging up"}"
>


apache_beam/examples/cookbook/bigquery_tornadoes_it_test.py::BigqueryTornadoesIT::test_bigquery_tornadoes_it
apache_beam/examples/cookbook/filters_test.py::FiltersTest::test_filters_output_bigquery_matcher
  <https://ci-beam.apache.org/job/beam_PostCommit_Python_Examples_Spark/ws/src/sdks/python/apache_beam/io/gcp/tests/utils.py>:100: PendingDeprecationWarning: Client.dataset is deprecated and will be removed in a future version. Use a string like 'my_project.my_dataset' or a cloud.google.bigquery.DatasetReference object, instead.
    table_ref = client.dataset(dataset_id).table(table_id)

apache_beam/examples/dataframe/flight_delays_it_test.py::FlightDelaysTest::test_flight_delays
  <https://ci-beam.apache.org/job/beam_PostCommit_Python_Examples_Spark/ws/src/sdks/python/apache_beam/examples/dataframe/flight_delays.py>:47: FutureWarning: Dropping of nuisance columns in DataFrame reductions (with 'numeric_only=None') is deprecated; in a future version this will raise TypeError.  Select only valid columns before calling the reduction.
    return airline_df[at_top_airports].mean()

apache_beam/examples/dataframe/flight_delays_it_test.py::FlightDelaysTest::test_flight_delays
apache_beam/examples/dataframe/wordcount_test.py::WordCountTest::test_basics
  <https://ci-beam.apache.org/job/beam_PostCommit_Python_Examples_Spark/ws/src/sdks/python/apache_beam/dataframe/io.py>:664: FutureWarning: WriteToFiles is experimental.
    sink=lambda _: _WriteToPandasFileSink(

apache_beam/examples/dataframe/flight_delays_it_test.py::FlightDelaysTest::test_flight_delays
apache_beam/examples/dataframe/wordcount_test.py::WordCountTest::test_basics
  <https://ci-beam.apache.org/job/beam_PostCommit_Python_Examples_Spark/ws/src/sdks/python/apache_beam/io/fileio.py>:596: BeamDeprecationWarning: options is deprecated since First stable release. References to <pipeline>.options will not be supported
    p.options.view_as(GoogleCloudOptions).temp_location or

Exception in thread read_grpc_client_inputs:
Traceback (most recent call last):
  File "/usr/lib/python3.7/threading.py", line 926, in _bootstrap_inner
    self.run()
  File "/usr/lib/python3.7/threading.py", line 870, in run
    self._target(*self._args, **self._kwargs)
  File "<https://ci-beam.apache.org/job/beam_PostCommit_Python_Examples_Spark/ws/src/sdks/python/apache_beam/runners/worker/data_plane.py",> line 671, in <lambda>
    target=lambda: self._read_inputs(elements_iterator),
  File "<https://ci-beam.apache.org/job/beam_PostCommit_Python_Examples_Spark/ws/src/sdks/python/apache_beam/runners/worker/data_plane.py",> line 654, in _read_inputs
    for elements in elements_iterator:
  File "<https://ci-beam.apache.org/job/beam_PostCommit_Python_Examples_Spark/ws/src/build/gradleenv/2022703441/lib/python3.7/site-packages/grpc/_channel.py",> line 475, in __next__
    return self._next()
  File "<https://ci-beam.apache.org/job/beam_PostCommit_Python_Examples_Spark/ws/src/build/gradleenv/2022703441/lib/python3.7/site-packages/grpc/_channel.py",> line 881, in _next
    raise self
grpc._channel._MultiThreadedRendezvous: <_MultiThreadedRendezvous of RPC that terminated with:
	status = StatusCode.CANCELLED
	details = "Multiplexer hanging up"
	debug_error_string = "UNKNOWN:Error received from peer ipv6:%5B::1%5D:40511 {grpc_message:"Multiplexer hanging up", grpc_status:1, created_time:"2023-04-27T13:41:58.853100568+00:00"}"
>

-- Docs: https://docs.pytest.org/en/stable/how-to/capture-warnings.html
- generated xml file: <https://ci-beam.apache.org/job/beam_PostCommit_Python_Examples_Spark/ws/src/sdks/python/pytest_postCommitExamples-spark-py37.xml> -
=========================== short test summary info ============================
FAILED apache_beam/examples/complete/juliaset/juliaset/juliaset_test.py::JuliaSetTest::test_output_file_format - Failed: Timeout >600.0s [while running 'WriteToText/Write/WriteImpl/PreFinalize']
= 1 failed, 21 passed, 10 skipped, 6873 deselected, 79 warnings in 826.62s (0:13:46) =
Exception in thread read_grpc_client_inputs:
Traceback (most recent call last):
  File "/usr/lib/python3.7/threading.py", line 926, in _bootstrap_inner
    self.run()
  File "/usr/lib/python3.7/threading.py", line 870, in run
    self._target(*self._args, **self._kwargs)
  File "<https://ci-beam.apache.org/job/beam_PostCommit_Python_Examples_Spark/ws/src/sdks/python/apache_beam/runners/worker/data_plane.py",> line 671, in <lambda>
    target=lambda: self._read_inputs(elements_iterator),
  File "<https://ci-beam.apache.org/job/beam_PostCommit_Python_Examples_Spark/ws/src/sdks/python/apache_beam/runners/worker/data_plane.py",> line 654, in _read_inputs
    for elements in elements_iterator:
  File "<https://ci-beam.apache.org/job/beam_PostCommit_Python_Examples_Spark/ws/src/build/gradleenv/2022703441/lib/python3.7/site-packages/grpc/_channel.py",> line 475, in __next__
    return self._next()
  File "<https://ci-beam.apache.org/job/beam_PostCommit_Python_Examples_Spark/ws/src/build/gradleenv/2022703441/lib/python3.7/site-packages/grpc/_channel.py",> line 881, in _next
    raise self
grpc._channel._MultiThreadedRendezvous: <_MultiThreadedRendezvous of RPC that terminated with:
	status = StatusCode.CANCELLED
	details = "Multiplexer hanging up"
	debug_error_string = "UNKNOWN:Error received from peer ipv6:%5B::1%5D:34389 {grpc_message:"Multiplexer hanging up", grpc_status:1, created_time:"2023-04-27T13:42:08.433262419+00:00"}"
>


> Task :sdks:python:test-suites:portable:py37:sparkExamples FAILED

FAILURE: Build completed with 2 failures.

1: Task failed with an exception.
-----------
* Where:
Script '<https://ci-beam.apache.org/job/beam_PostCommit_Python_Examples_Spark/ws/src/sdks/python/test-suites/portable/common.gradle'> line: 276

* What went wrong:
Execution failed for task ':sdks:python:test-suites:portable:py311:sparkExamples'.
> Process 'command 'sh'' finished with non-zero exit value 1

* Try:
> Run with --stacktrace option to get the stack trace.
> Run with --info or --debug option to get more log output.
==============================================================================

2: Task failed with an exception.
-----------
* Where:
Script '<https://ci-beam.apache.org/job/beam_PostCommit_Python_Examples_Spark/ws/src/sdks/python/test-suites/portable/common.gradle'> line: 276

* What went wrong:
Execution failed for task ':sdks:python:test-suites:portable:py37:sparkExamples'.
> Process 'command 'sh'' finished with non-zero exit value 1

* Try:
> Run with --stacktrace option to get the stack trace.
> Run with --info or --debug option to get more log output.
==============================================================================

* Get more help at https://help.gradle.org

Deprecated Gradle features were used in this build, making it incompatible with Gradle 8.0.

You can use '--warning-mode all' to show the individual deprecation warnings and determine if they come from your own scripts or plugins.

See https://docs.gradle.org/7.5.1/userguide/command_line_interface.html#sec:command_line_warnings

BUILD FAILED in 15m 39s
81 actionable tasks: 51 executed, 28 from cache, 2 up-to-date
Build scan background action failed.
java.lang.IllegalArgumentException: com.gradle.enterprise.gradleplugin.internal.extension.a is not an interface
	at java.lang.reflect.Proxy$ProxyClassFactory.apply(Proxy.java:590)
	at java.lang.reflect.Proxy$ProxyClassFactory.apply(Proxy.java:557)
	at java.lang.reflect.WeakCache$Factory.get(WeakCache.java:230)
	at java.lang.reflect.WeakCache.get(WeakCache.java:127)
	at java.lang.reflect.Proxy.getProxyClass0(Proxy.java:419)
	at java.lang.reflect.Proxy.newProxyInstance(Proxy.java:719)
	at com.gradle.ProxyFactory$ProxyingInvocationHandler.createLocalProxy(ProxyFactory.java:64)
	at com.gradle.ProxyFactory$ProxyingInvocationHandler.lambda$adaptActionArg$1(ProxyFactory.java:59)
	at com.gradle.enterprise.gradleplugin.internal.extension.b$3.run(SourceFile:100)
	at java.util.concurrent.Executors$RunnableAdapter.call(Executors.java:511)
	at java.util.concurrent.FutureTask.run(FutureTask.java:266)
	at java.util.concurrent.ThreadPoolExecutor.runWorker(ThreadPoolExecutor.java:1149)
	at java.util.concurrent.ThreadPoolExecutor$Worker.run(ThreadPoolExecutor.java:624)
	at java.lang.Thread.run(Thread.java:750)

Publishing build scan...
https://gradle.com/s/fgydumjvrfmg4

Build step 'Invoke Gradle script' changed build result to FAILURE
Build step 'Invoke Gradle script' marked build as failure

---------------------------------------------------------------------
To unsubscribe, e-mail: builds-unsubscribe@beam.apache.org
For additional commands, e-mail: builds-help@beam.apache.org


Jenkins build is back to normal : beam_PostCommit_Python_Examples_Spark #1734

Posted by Apache Jenkins Server <je...@builds.apache.org>.
See <https://ci-beam.apache.org/job/beam_PostCommit_Python_Examples_Spark/1734/display/redirect>


---------------------------------------------------------------------
To unsubscribe, e-mail: builds-unsubscribe@beam.apache.org
For additional commands, e-mail: builds-help@beam.apache.org