You are viewing a plain text version of this content. The canonical link for it is here.
Posted to builds@solr.apache.org by Apache Jenkins Server <je...@builds.apache.org> on 2024/12/19 08:58:24 UTC

[JENKINS] Solr » Solr-NightlyTests-main - Build # 1314 - Still Unstable!

Build: https://ci-builds.apache.org/job/Solr/job/Solr-NightlyTests-main/1314/

4 tests failed.
FAILED:  org.apache.solr.hdfs.cloud.MoveReplicaHdfsFailoverTest.testDataDirAndUlogAreMaintained

Error Message:
java.lang.AssertionError: expected:<1> but was:<0>

Stack Trace:
java.lang.AssertionError: expected:<1> but was:<0>
	at __randomizedtesting.SeedInfo.seed([10D35D38CE507C29:3FE0C8EB7220CE0B]:0)
	at org.junit.Assert.fail(Assert.java:89)
	at org.junit.Assert.failNotEquals(Assert.java:835)
	at org.junit.Assert.assertEquals(Assert.java:647)
	at org.junit.Assert.assertEquals(Assert.java:633)
	at org.apache.solr.hdfs.cloud.MoveReplicaHdfsFailoverTest.testDataDirAndUlogAreMaintained(MoveReplicaHdfsFailoverTest.java:113)
	at java.base/jdk.internal.reflect.DirectMethodHandleAccessor.invoke(DirectMethodHandleAccessor.java:103)
	at java.base/java.lang.reflect.Method.invoke(Method.java:580)
	at com.carrotsearch.randomizedtesting.RandomizedRunner.invoke(RandomizedRunner.java:1758)
	at com.carrotsearch.randomizedtesting.RandomizedRunner$8.evaluate(RandomizedRunner.java:946)
	at com.carrotsearch.randomizedtesting.RandomizedRunner$9.evaluate(RandomizedRunner.java:982)
	at com.carrotsearch.randomizedtesting.RandomizedRunner$10.evaluate(RandomizedRunner.java:996)
	at com.carrotsearch.randomizedtesting.rules.SystemPropertiesRestoreRule$1.evaluate(SystemPropertiesRestoreRule.java:80)
	at org.junit.rules.RunRules.evaluate(RunRules.java:20)
	at org.apache.lucene.tests.util.TestRuleSetupTeardownChained$1.evaluate(TestRuleSetupTeardownChained.java:48)
	at org.apache.lucene.tests.util.AbstractBeforeAfterRule$1.evaluate(AbstractBeforeAfterRule.java:43)
	at org.apache.lucene.tests.util.TestRuleThreadAndTestName$1.evaluate(TestRuleThreadAndTestName.java:45)
	at org.apache.lucene.tests.util.TestRuleIgnoreAfterMaxFailures$1.evaluate(TestRuleIgnoreAfterMaxFailures.java:60)
	at org.apache.lucene.tests.util.TestRuleMarkFailure$1.evaluate(TestRuleMarkFailure.java:44)
	at org.junit.rules.RunRules.evaluate(RunRules.java:20)
	at com.carrotsearch.randomizedtesting.rules.StatementAdapter.evaluate(StatementAdapter.java:36)
	at com.carrotsearch.randomizedtesting.ThreadLeakControl$StatementRunner.run(ThreadLeakControl.java:390)
	at com.carrotsearch.randomizedtesting.ThreadLeakControl.forkTimeoutingTask(ThreadLeakControl.java:843)
	at com.carrotsearch.randomizedtesting.ThreadLeakControl$3.evaluate(ThreadLeakControl.java:490)
	at com.carrotsearch.randomizedtesting.RandomizedRunner.runSingleTest(RandomizedRunner.java:955)
	at com.carrotsearch.randomizedtesting.RandomizedRunner$5.evaluate(RandomizedRunner.java:840)
	at com.carrotsearch.randomizedtesting.RandomizedRunner$6.evaluate(RandomizedRunner.java:891)
	at com.carrotsearch.randomizedtesting.RandomizedRunner$7.evaluate(RandomizedRunner.java:902)
	at com.carrotsearch.randomizedtesting.rules.StatementAdapter.evaluate(StatementAdapter.java:36)
	at com.carrotsearch.randomizedtesting.rules.StatementAdapter.evaluate(StatementAdapter.java:36)
	at org.apache.lucene.tests.util.AbstractBeforeAfterRule$1.evaluate(AbstractBeforeAfterRule.java:43)
	at com.carrotsearch.randomizedtesting.rules.SystemPropertiesRestoreRule$1.evaluate(SystemPropertiesRestoreRule.java:80)
	at org.junit.rules.RunRules.evaluate(RunRules.java:20)
	at org.apache.lucene.tests.util.AbstractBeforeAfterRule$1.evaluate(AbstractBeforeAfterRule.java:43)
	at com.carrotsearch.randomizedtesting.rules.StatementAdapter.evaluate(StatementAdapter.java:36)
	at org.apache.lucene.tests.util.TestRuleStoreClassName$1.evaluate(TestRuleStoreClassName.java:38)
	at com.carrotsearch.randomizedtesting.rules.NoShadowingOrOverridesOnMethodsRule$1.evaluate(NoShadowingOrOverridesOnMethodsRule.java:40)
	at com.carrotsearch.randomizedtesting.rules.NoShadowingOrOverridesOnMethodsRule$1.evaluate(NoShadowingOrOverridesOnMethodsRule.java:40)
	at com.carrotsearch.randomizedtesting.rules.StatementAdapter.evaluate(StatementAdapter.java:36)
	at com.carrotsearch.randomizedtesting.rules.StatementAdapter.evaluate(StatementAdapter.java:36)
	at org.apache.lucene.tests.util.TestRuleAssertionsRequired$1.evaluate(TestRuleAssertionsRequired.java:53)
	at org.apache.lucene.tests.util.AbstractBeforeAfterRule$1.evaluate(AbstractBeforeAfterRule.java:43)
	at org.apache.lucene.tests.util.TestRuleMarkFailure$1.evaluate(TestRuleMarkFailure.java:44)
	at org.apache.lucene.tests.util.TestRuleIgnoreAfterMaxFailures$1.evaluate(TestRuleIgnoreAfterMaxFailures.java:60)
	at org.apache.lucene.tests.util.TestRuleIgnoreTestSuites$1.evaluate(TestRuleIgnoreTestSuites.java:47)
	at org.junit.rules.RunRules.evaluate(RunRules.java:20)
	at com.carrotsearch.randomizedtesting.rules.StatementAdapter.evaluate(StatementAdapter.java:36)
	at com.carrotsearch.randomizedtesting.ThreadLeakControl$StatementRunner.run(ThreadLeakControl.java:390)
	at com.carrotsearch.randomizedtesting.ThreadLeakControl.lambda$forkTimeoutingTask$0(ThreadLeakControl.java:850)
	at java.base/java.lang.Thread.run(Thread.java:1583)


FAILED:  org.apache.solr.hdfs.cloud.MoveReplicaHdfsFailoverTest.testDataDirAndUlogAreMaintained

Error Message:
java.lang.AssertionError: expected:<1> but was:<0>

Stack Trace:
java.lang.AssertionError: expected:<1> but was:<0>
	at __randomizedtesting.SeedInfo.seed([10D35D38CE507C29:3FE0C8EB7220CE0B]:0)
	at org.junit.Assert.fail(Assert.java:89)
	at org.junit.Assert.failNotEquals(Assert.java:835)
	at org.junit.Assert.assertEquals(Assert.java:647)
	at org.junit.Assert.assertEquals(Assert.java:633)
	at org.apache.solr.hdfs.cloud.MoveReplicaHdfsFailoverTest.testDataDirAndUlogAreMaintained(MoveReplicaHdfsFailoverTest.java:113)
	at java.base/jdk.internal.reflect.DirectMethodHandleAccessor.invoke(DirectMethodHandleAccessor.java:103)
	at java.base/java.lang.reflect.Method.invoke(Method.java:580)
	at com.carrotsearch.randomizedtesting.RandomizedRunner.invoke(RandomizedRunner.java:1758)
	at com.carrotsearch.randomizedtesting.RandomizedRunner$8.evaluate(RandomizedRunner.java:946)
	at com.carrotsearch.randomizedtesting.RandomizedRunner$9.evaluate(RandomizedRunner.java:982)
	at com.carrotsearch.randomizedtesting.RandomizedRunner$10.evaluate(RandomizedRunner.java:996)
	at com.carrotsearch.randomizedtesting.rules.SystemPropertiesRestoreRule$1.evaluate(SystemPropertiesRestoreRule.java:80)
	at org.junit.rules.RunRules.evaluate(RunRules.java:20)
	at org.apache.lucene.tests.util.TestRuleSetupTeardownChained$1.evaluate(TestRuleSetupTeardownChained.java:48)
	at org.apache.lucene.tests.util.AbstractBeforeAfterRule$1.evaluate(AbstractBeforeAfterRule.java:43)
	at org.apache.lucene.tests.util.TestRuleThreadAndTestName$1.evaluate(TestRuleThreadAndTestName.java:45)
	at org.apache.lucene.tests.util.TestRuleIgnoreAfterMaxFailures$1.evaluate(TestRuleIgnoreAfterMaxFailures.java:60)
	at org.apache.lucene.tests.util.TestRuleMarkFailure$1.evaluate(TestRuleMarkFailure.java:44)
	at org.junit.rules.RunRules.evaluate(RunRules.java:20)
	at com.carrotsearch.randomizedtesting.rules.StatementAdapter.evaluate(StatementAdapter.java:36)
	at com.carrotsearch.randomizedtesting.ThreadLeakControl$StatementRunner.run(ThreadLeakControl.java:390)
	at com.carrotsearch.randomizedtesting.ThreadLeakControl.forkTimeoutingTask(ThreadLeakControl.java:843)
	at com.carrotsearch.randomizedtesting.ThreadLeakControl$3.evaluate(ThreadLeakControl.java:490)
	at com.carrotsearch.randomizedtesting.RandomizedRunner.runSingleTest(RandomizedRunner.java:955)
	at com.carrotsearch.randomizedtesting.RandomizedRunner$5.evaluate(RandomizedRunner.java:840)
	at com.carrotsearch.randomizedtesting.RandomizedRunner$6.evaluate(RandomizedRunner.java:891)
	at com.carrotsearch.randomizedtesting.RandomizedRunner$7.evaluate(RandomizedRunner.java:902)
	at com.carrotsearch.randomizedtesting.rules.StatementAdapter.evaluate(StatementAdapter.java:36)
	at com.carrotsearch.randomizedtesting.rules.StatementAdapter.evaluate(StatementAdapter.java:36)
	at org.apache.lucene.tests.util.AbstractBeforeAfterRule$1.evaluate(AbstractBeforeAfterRule.java:43)
	at com.carrotsearch.randomizedtesting.rules.SystemPropertiesRestoreRule$1.evaluate(SystemPropertiesRestoreRule.java:80)
	at org.junit.rules.RunRules.evaluate(RunRules.java:20)
	at org.apache.lucene.tests.util.AbstractBeforeAfterRule$1.evaluate(AbstractBeforeAfterRule.java:43)
	at com.carrotsearch.randomizedtesting.rules.StatementAdapter.evaluate(StatementAdapter.java:36)
	at org.apache.lucene.tests.util.TestRuleStoreClassName$1.evaluate(TestRuleStoreClassName.java:38)
	at com.carrotsearch.randomizedtesting.rules.NoShadowingOrOverridesOnMethodsRule$1.evaluate(NoShadowingOrOverridesOnMethodsRule.java:40)
	at com.carrotsearch.randomizedtesting.rules.NoShadowingOrOverridesOnMethodsRule$1.evaluate(NoShadowingOrOverridesOnMethodsRule.java:40)
	at com.carrotsearch.randomizedtesting.rules.StatementAdapter.evaluate(StatementAdapter.java:36)
	at com.carrotsearch.randomizedtesting.rules.StatementAdapter.evaluate(StatementAdapter.java:36)
	at org.apache.lucene.tests.util.TestRuleAssertionsRequired$1.evaluate(TestRuleAssertionsRequired.java:53)
	at org.apache.lucene.tests.util.AbstractBeforeAfterRule$1.evaluate(AbstractBeforeAfterRule.java:43)
	at org.apache.lucene.tests.util.TestRuleMarkFailure$1.evaluate(TestRuleMarkFailure.java:44)
	at org.apache.lucene.tests.util.TestRuleIgnoreAfterMaxFailures$1.evaluate(TestRuleIgnoreAfterMaxFailures.java:60)
	at org.apache.lucene.tests.util.TestRuleIgnoreTestSuites$1.evaluate(TestRuleIgnoreTestSuites.java:47)
	at org.junit.rules.RunRules.evaluate(RunRules.java:20)
	at com.carrotsearch.randomizedtesting.rules.StatementAdapter.evaluate(StatementAdapter.java:36)
	at com.carrotsearch.randomizedtesting.ThreadLeakControl$StatementRunner.run(ThreadLeakControl.java:390)
	at com.carrotsearch.randomizedtesting.ThreadLeakControl.lambda$forkTimeoutingTask$0(ThreadLeakControl.java:850)
	at java.base/java.lang.Thread.run(Thread.java:1583)


FAILED:  org.apache.solr.hdfs.cloud.MoveReplicaHdfsFailoverTest.testDataDirAndUlogAreMaintained

Error Message:
java.lang.AssertionError: expected:<1> but was:<0>

Stack Trace:
java.lang.AssertionError: expected:<1> but was:<0>
	at __randomizedtesting.SeedInfo.seed([10D35D38CE507C29:3FE0C8EB7220CE0B]:0)
	at org.junit.Assert.fail(Assert.java:89)
	at org.junit.Assert.failNotEquals(Assert.java:835)
	at org.junit.Assert.assertEquals(Assert.java:647)
	at org.junit.Assert.assertEquals(Assert.java:633)
	at org.apache.solr.hdfs.cloud.MoveReplicaHdfsFailoverTest.testDataDirAndUlogAreMaintained(MoveReplicaHdfsFailoverTest.java:113)
	at java.base/jdk.internal.reflect.DirectMethodHandleAccessor.invoke(DirectMethodHandleAccessor.java:103)
	at java.base/java.lang.reflect.Method.invoke(Method.java:580)
	at com.carrotsearch.randomizedtesting.RandomizedRunner.invoke(RandomizedRunner.java:1758)
	at com.carrotsearch.randomizedtesting.RandomizedRunner$8.evaluate(RandomizedRunner.java:946)
	at com.carrotsearch.randomizedtesting.RandomizedRunner$9.evaluate(RandomizedRunner.java:982)
	at com.carrotsearch.randomizedtesting.RandomizedRunner$10.evaluate(RandomizedRunner.java:996)
	at com.carrotsearch.randomizedtesting.rules.SystemPropertiesRestoreRule$1.evaluate(SystemPropertiesRestoreRule.java:80)
	at org.junit.rules.RunRules.evaluate(RunRules.java:20)
	at org.apache.lucene.tests.util.TestRuleSetupTeardownChained$1.evaluate(TestRuleSetupTeardownChained.java:48)
	at org.apache.lucene.tests.util.AbstractBeforeAfterRule$1.evaluate(AbstractBeforeAfterRule.java:43)
	at org.apache.lucene.tests.util.TestRuleThreadAndTestName$1.evaluate(TestRuleThreadAndTestName.java:45)
	at org.apache.lucene.tests.util.TestRuleIgnoreAfterMaxFailures$1.evaluate(TestRuleIgnoreAfterMaxFailures.java:60)
	at org.apache.lucene.tests.util.TestRuleMarkFailure$1.evaluate(TestRuleMarkFailure.java:44)
	at org.junit.rules.RunRules.evaluate(RunRules.java:20)
	at com.carrotsearch.randomizedtesting.rules.StatementAdapter.evaluate(StatementAdapter.java:36)
	at com.carrotsearch.randomizedtesting.ThreadLeakControl$StatementRunner.run(ThreadLeakControl.java:390)
	at com.carrotsearch.randomizedtesting.ThreadLeakControl.forkTimeoutingTask(ThreadLeakControl.java:843)
	at com.carrotsearch.randomizedtesting.ThreadLeakControl$3.evaluate(ThreadLeakControl.java:490)
	at com.carrotsearch.randomizedtesting.RandomizedRunner.runSingleTest(RandomizedRunner.java:955)
	at com.carrotsearch.randomizedtesting.RandomizedRunner$5.evaluate(RandomizedRunner.java:840)
	at com.carrotsearch.randomizedtesting.RandomizedRunner$6.evaluate(RandomizedRunner.java:891)
	at com.carrotsearch.randomizedtesting.RandomizedRunner$7.evaluate(RandomizedRunner.java:902)
	at com.carrotsearch.randomizedtesting.rules.StatementAdapter.evaluate(StatementAdapter.java:36)
	at com.carrotsearch.randomizedtesting.rules.StatementAdapter.evaluate(StatementAdapter.java:36)
	at org.apache.lucene.tests.util.AbstractBeforeAfterRule$1.evaluate(AbstractBeforeAfterRule.java:43)
	at com.carrotsearch.randomizedtesting.rules.SystemPropertiesRestoreRule$1.evaluate(SystemPropertiesRestoreRule.java:80)
	at org.junit.rules.RunRules.evaluate(RunRules.java:20)
	at org.apache.lucene.tests.util.AbstractBeforeAfterRule$1.evaluate(AbstractBeforeAfterRule.java:43)
	at com.carrotsearch.randomizedtesting.rules.StatementAdapter.evaluate(StatementAdapter.java:36)
	at org.apache.lucene.tests.util.TestRuleStoreClassName$1.evaluate(TestRuleStoreClassName.java:38)
	at com.carrotsearch.randomizedtesting.rules.NoShadowingOrOverridesOnMethodsRule$1.evaluate(NoShadowingOrOverridesOnMethodsRule.java:40)
	at com.carrotsearch.randomizedtesting.rules.NoShadowingOrOverridesOnMethodsRule$1.evaluate(NoShadowingOrOverridesOnMethodsRule.java:40)
	at com.carrotsearch.randomizedtesting.rules.StatementAdapter.evaluate(StatementAdapter.java:36)
	at com.carrotsearch.randomizedtesting.rules.StatementAdapter.evaluate(StatementAdapter.java:36)
	at org.apache.lucene.tests.util.TestRuleAssertionsRequired$1.evaluate(TestRuleAssertionsRequired.java:53)
	at org.apache.lucene.tests.util.AbstractBeforeAfterRule$1.evaluate(AbstractBeforeAfterRule.java:43)
	at org.apache.lucene.tests.util.TestRuleMarkFailure$1.evaluate(TestRuleMarkFailure.java:44)
	at org.apache.lucene.tests.util.TestRuleIgnoreAfterMaxFailures$1.evaluate(TestRuleIgnoreAfterMaxFailures.java:60)
	at org.apache.lucene.tests.util.TestRuleIgnoreTestSuites$1.evaluate(TestRuleIgnoreTestSuites.java:47)
	at org.junit.rules.RunRules.evaluate(RunRules.java:20)
	at com.carrotsearch.randomizedtesting.rules.StatementAdapter.evaluate(StatementAdapter.java:36)
	at com.carrotsearch.randomizedtesting.ThreadLeakControl$StatementRunner.run(ThreadLeakControl.java:390)
	at com.carrotsearch.randomizedtesting.ThreadLeakControl.lambda$forkTimeoutingTask$0(ThreadLeakControl.java:850)
	at java.base/java.lang.Thread.run(Thread.java:1583)


FAILED:  org.apache.solr.hdfs.cloud.MoveReplicaHdfsFailoverTest.testDataDirAndUlogAreMaintained

Error Message:
java.lang.AssertionError: expected:<1> but was:<0>

Stack Trace:
java.lang.AssertionError: expected:<1> but was:<0>
	at __randomizedtesting.SeedInfo.seed([10D35D38CE507C29:3FE0C8EB7220CE0B]:0)
	at org.junit.Assert.fail(Assert.java:89)
	at org.junit.Assert.failNotEquals(Assert.java:835)
	at org.junit.Assert.assertEquals(Assert.java:647)
	at org.junit.Assert.assertEquals(Assert.java:633)
	at org.apache.solr.hdfs.cloud.MoveReplicaHdfsFailoverTest.testDataDirAndUlogAreMaintained(MoveReplicaHdfsFailoverTest.java:113)
	at java.base/jdk.internal.reflect.DirectMethodHandleAccessor.invoke(DirectMethodHandleAccessor.java:103)
	at java.base/java.lang.reflect.Method.invoke(Method.java:580)
	at com.carrotsearch.randomizedtesting.RandomizedRunner.invoke(RandomizedRunner.java:1758)
	at com.carrotsearch.randomizedtesting.RandomizedRunner$8.evaluate(RandomizedRunner.java:946)
	at com.carrotsearch.randomizedtesting.RandomizedRunner$9.evaluate(RandomizedRunner.java:982)
	at com.carrotsearch.randomizedtesting.RandomizedRunner$10.evaluate(RandomizedRunner.java:996)
	at com.carrotsearch.randomizedtesting.rules.SystemPropertiesRestoreRule$1.evaluate(SystemPropertiesRestoreRule.java:80)
	at org.junit.rules.RunRules.evaluate(RunRules.java:20)
	at org.apache.lucene.tests.util.TestRuleSetupTeardownChained$1.evaluate(TestRuleSetupTeardownChained.java:48)
	at org.apache.lucene.tests.util.AbstractBeforeAfterRule$1.evaluate(AbstractBeforeAfterRule.java:43)
	at org.apache.lucene.tests.util.TestRuleThreadAndTestName$1.evaluate(TestRuleThreadAndTestName.java:45)
	at org.apache.lucene.tests.util.TestRuleIgnoreAfterMaxFailures$1.evaluate(TestRuleIgnoreAfterMaxFailures.java:60)
	at org.apache.lucene.tests.util.TestRuleMarkFailure$1.evaluate(TestRuleMarkFailure.java:44)
	at org.junit.rules.RunRules.evaluate(RunRules.java:20)
	at com.carrotsearch.randomizedtesting.rules.StatementAdapter.evaluate(StatementAdapter.java:36)
	at com.carrotsearch.randomizedtesting.ThreadLeakControl$StatementRunner.run(ThreadLeakControl.java:390)
	at com.carrotsearch.randomizedtesting.ThreadLeakControl.forkTimeoutingTask(ThreadLeakControl.java:843)
	at com.carrotsearch.randomizedtesting.ThreadLeakControl$3.evaluate(ThreadLeakControl.java:490)
	at com.carrotsearch.randomizedtesting.RandomizedRunner.runSingleTest(RandomizedRunner.java:955)
	at com.carrotsearch.randomizedtesting.RandomizedRunner$5.evaluate(RandomizedRunner.java:840)
	at com.carrotsearch.randomizedtesting.RandomizedRunner$6.evaluate(RandomizedRunner.java:891)
	at com.carrotsearch.randomizedtesting.RandomizedRunner$7.evaluate(RandomizedRunner.java:902)
	at com.carrotsearch.randomizedtesting.rules.StatementAdapter.evaluate(StatementAdapter.java:36)
	at com.carrotsearch.randomizedtesting.rules.StatementAdapter.evaluate(StatementAdapter.java:36)
	at org.apache.lucene.tests.util.AbstractBeforeAfterRule$1.evaluate(AbstractBeforeAfterRule.java:43)
	at com.carrotsearch.randomizedtesting.rules.SystemPropertiesRestoreRule$1.evaluate(SystemPropertiesRestoreRule.java:80)
	at org.junit.rules.RunRules.evaluate(RunRules.java:20)
	at org.apache.lucene.tests.util.AbstractBeforeAfterRule$1.evaluate(AbstractBeforeAfterRule.java:43)
	at com.carrotsearch.randomizedtesting.rules.StatementAdapter.evaluate(StatementAdapter.java:36)
	at org.apache.lucene.tests.util.TestRuleStoreClassName$1.evaluate(TestRuleStoreClassName.java:38)
	at com.carrotsearch.randomizedtesting.rules.NoShadowingOrOverridesOnMethodsRule$1.evaluate(NoShadowingOrOverridesOnMethodsRule.java:40)
	at com.carrotsearch.randomizedtesting.rules.NoShadowingOrOverridesOnMethodsRule$1.evaluate(NoShadowingOrOverridesOnMethodsRule.java:40)
	at com.carrotsearch.randomizedtesting.rules.StatementAdapter.evaluate(StatementAdapter.java:36)
	at com.carrotsearch.randomizedtesting.rules.StatementAdapter.evaluate(StatementAdapter.java:36)
	at org.apache.lucene.tests.util.TestRuleAssertionsRequired$1.evaluate(TestRuleAssertionsRequired.java:53)
	at org.apache.lucene.tests.util.AbstractBeforeAfterRule$1.evaluate(AbstractBeforeAfterRule.java:43)
	at org.apache.lucene.tests.util.TestRuleMarkFailure$1.evaluate(TestRuleMarkFailure.java:44)
	at org.apache.lucene.tests.util.TestRuleIgnoreAfterMaxFailures$1.evaluate(TestRuleIgnoreAfterMaxFailures.java:60)
	at org.apache.lucene.tests.util.TestRuleIgnoreTestSuites$1.evaluate(TestRuleIgnoreTestSuites.java:47)
	at org.junit.rules.RunRules.evaluate(RunRules.java:20)
	at com.carrotsearch.randomizedtesting.rules.StatementAdapter.evaluate(StatementAdapter.java:36)
	at com.carrotsearch.randomizedtesting.ThreadLeakControl$StatementRunner.run(ThreadLeakControl.java:390)
	at com.carrotsearch.randomizedtesting.ThreadLeakControl.lambda$forkTimeoutingTask$0(ThreadLeakControl.java:850)
	at java.base/java.lang.Thread.run(Thread.java:1583)




Build Log:
[...truncated 3437 lines...]
ERROR: The following test(s) have failed:
  - org.apache.solr.hdfs.cloud.MoveReplicaHdfsFailoverTest.testDataDirAndUlogAreMaintained (:solr:modules:hdfs)
    Test history: https://ge.apache.org/scans/tests?search.rootProjectNames=solr-root&tests.container=org.apache.solr.hdfs.cloud.MoveReplicaHdfsFailoverTest&tests.test=testDataDirAndUlogAreMaintained http://fucit.org/solr-jenkins-reports/history-trend-of-recent-failures.html#series/org.apache.solr.hdfs.cloud.MoveReplicaHdfsFailoverTest.testDataDirAndUlogAreMaintained
    Test output: /home/jenkins/jenkins-slave/workspace/Solr/Solr-NightlyTests-main/solr/modules/hdfs/build/test-results/test/outputs/OUTPUT-org.apache.solr.hdfs.cloud.MoveReplicaHdfsFailoverTest.txt
    Reproduce with: ./gradlew :solr:modules:hdfs:test --tests "org.apache.solr.hdfs.cloud.MoveReplicaHdfsFailoverTest.testDataDirAndUlogAreMaintained" -Ptests.jvms=4 -Ptests.haltonfailure=false "-Ptests.jvmargs=-XX:TieredStopAtLevel=1 -XX:+UseParallelGC -XX:ActiveProcessorCount=1 -XX:ReservedCodeCacheSize=120m" -Ptests.seed=10D35D38CE507C29 -Ptests.multiplier=2 -Ptests.nightly=true -Ptests.badapples=false -Ptests.file.encoding=UTF-8 -Ptests.linedocsfile=/home/jenkins/jenkins-slave/workspace/Solr/Solr-NightlyTests-main/test-data/enwiki.random.lines.txt


Deprecated Gradle features were used in this build, making it incompatible with Gradle 9.0.

You can use '--warning-mode all' to show the individual deprecation warnings and determine if they come from your own scripts or plugins.

For more on this, please refer to https://docs.gradle.org/8.10/userguide/command_line_interface.html#sec:command_line_warnings in the Gradle documentation.

BUILD SUCCESSFUL in 1h 49m 32s
148 actionable tasks: 148 executed

Publishing build scan...
https://ge.apache.org/s/vgaywrilbd5ca

Build step 'Invoke Gradle script' changed build result to SUCCESS
Archiving artifacts
‘**/*.events’ doesn’t match anything: ‘**’ exists but not ‘**/*.events’
No artifacts found that match the file pattern "**/*.events,heapdumps/**,**/hs_err_pid*". Configuration error?
Recording test results
[Checks API] No suitable checks publisher found.
Build step 'Publish JUnit test result report' changed build result to UNSTABLE
Email was triggered for: Unstable (Test Failures)
Sending email for trigger: Unstable (Test Failures)

[JENKINS] Solr » Solr-NightlyTests-main - Build # 1316 - Still Unstable!

Posted by Apache Jenkins Server <je...@builds.apache.org>.
Build: https://ci-builds.apache.org/job/Solr/job/Solr-NightlyTests-main/1316/

24 tests failed.
FAILED:  org.apache.solr.cloud.ChaosMonkeySafeLeaderTest.test

Error Message:
java.lang.AssertionError: expected:<0> but was:<6>

Stack Trace:
java.lang.AssertionError: expected:<0> but was:<6>
	at __randomizedtesting.SeedInfo.seed([9A2C4E350779A98:81F6FB39FE8BF760]:0)
	at org.junit.Assert.fail(Assert.java:89)
	at org.junit.Assert.failNotEquals(Assert.java:835)
	at org.junit.Assert.assertEquals(Assert.java:647)
	at org.junit.Assert.assertEquals(Assert.java:633)
	at org.apache.solr.cloud.AbstractChaosMonkeySafeLeaderTestBase.test(AbstractChaosMonkeySafeLeaderTestBase.java:166)
	at java.base/jdk.internal.reflect.DirectMethodHandleAccessor.invoke(DirectMethodHandleAccessor.java:103)
	at java.base/java.lang.reflect.Method.invoke(Method.java:580)
	at com.carrotsearch.randomizedtesting.RandomizedRunner.invoke(RandomizedRunner.java:1758)
	at com.carrotsearch.randomizedtesting.RandomizedRunner$8.evaluate(RandomizedRunner.java:946)
	at com.carrotsearch.randomizedtesting.RandomizedRunner$9.evaluate(RandomizedRunner.java:982)
	at com.carrotsearch.randomizedtesting.RandomizedRunner$10.evaluate(RandomizedRunner.java:996)
	at org.apache.solr.BaseDistributedSearchTestCase$ShardsRepeatRule$ShardsFixedStatement.callStatement(BaseDistributedSearchTestCase.java:1070)
	at org.apache.solr.BaseDistributedSearchTestCase$ShardsRepeatRule$ShardsStatement.evaluate(BaseDistributedSearchTestCase.java:1041)
	at com.carrotsearch.randomizedtesting.rules.SystemPropertiesRestoreRule$1.evaluate(SystemPropertiesRestoreRule.java:80)
	at org.junit.rules.RunRules.evaluate(RunRules.java:20)
	at org.apache.lucene.tests.util.TestRuleSetupTeardownChained$1.evaluate(TestRuleSetupTeardownChained.java:48)
	at org.apache.lucene.tests.util.AbstractBeforeAfterRule$1.evaluate(AbstractBeforeAfterRule.java:43)
	at org.apache.lucene.tests.util.TestRuleThreadAndTestName$1.evaluate(TestRuleThreadAndTestName.java:45)
	at org.apache.lucene.tests.util.TestRuleIgnoreAfterMaxFailures$1.evaluate(TestRuleIgnoreAfterMaxFailures.java:60)
	at org.apache.lucene.tests.util.TestRuleMarkFailure$1.evaluate(TestRuleMarkFailure.java:44)
	at org.junit.rules.RunRules.evaluate(RunRules.java:20)
	at com.carrotsearch.randomizedtesting.rules.StatementAdapter.evaluate(StatementAdapter.java:36)
	at com.carrotsearch.randomizedtesting.ThreadLeakControl$StatementRunner.run(ThreadLeakControl.java:390)
	at com.carrotsearch.randomizedtesting.ThreadLeakControl.forkTimeoutingTask(ThreadLeakControl.java:843)
	at com.carrotsearch.randomizedtesting.ThreadLeakControl$3.evaluate(ThreadLeakControl.java:490)
	at com.carrotsearch.randomizedtesting.RandomizedRunner.runSingleTest(RandomizedRunner.java:955)
	at com.carrotsearch.randomizedtesting.RandomizedRunner$5.evaluate(RandomizedRunner.java:840)
	at com.carrotsearch.randomizedtesting.RandomizedRunner$6.evaluate(RandomizedRunner.java:891)
	at com.carrotsearch.randomizedtesting.RandomizedRunner$7.evaluate(RandomizedRunner.java:902)
	at com.carrotsearch.randomizedtesting.rules.StatementAdapter.evaluate(StatementAdapter.java:36)
	at com.carrotsearch.randomizedtesting.rules.StatementAdapter.evaluate(StatementAdapter.java:36)
	at org.apache.lucene.tests.util.AbstractBeforeAfterRule$1.evaluate(AbstractBeforeAfterRule.java:43)
	at com.carrotsearch.randomizedtesting.rules.SystemPropertiesRestoreRule$1.evaluate(SystemPropertiesRestoreRule.java:80)
	at org.junit.rules.RunRules.evaluate(RunRules.java:20)
	at org.apache.lucene.tests.util.AbstractBeforeAfterRule$1.evaluate(AbstractBeforeAfterRule.java:43)
	at com.carrotsearch.randomizedtesting.rules.StatementAdapter.evaluate(StatementAdapter.java:36)
	at org.apache.lucene.tests.util.TestRuleStoreClassName$1.evaluate(TestRuleStoreClassName.java:38)
	at com.carrotsearch.randomizedtesting.rules.NoShadowingOrOverridesOnMethodsRule$1.evaluate(NoShadowingOrOverridesOnMethodsRule.java:40)
	at com.carrotsearch.randomizedtesting.rules.NoShadowingOrOverridesOnMethodsRule$1.evaluate(NoShadowingOrOverridesOnMethodsRule.java:40)
	at com.carrotsearch.randomizedtesting.rules.StatementAdapter.evaluate(StatementAdapter.java:36)
	at com.carrotsearch.randomizedtesting.rules.StatementAdapter.evaluate(StatementAdapter.java:36)
	at org.apache.lucene.tests.util.TestRuleAssertionsRequired$1.evaluate(TestRuleAssertionsRequired.java:53)
	at org.apache.lucene.tests.util.AbstractBeforeAfterRule$1.evaluate(AbstractBeforeAfterRule.java:43)
	at org.apache.lucene.tests.util.TestRuleMarkFailure$1.evaluate(TestRuleMarkFailure.java:44)
	at org.apache.lucene.tests.util.TestRuleIgnoreAfterMaxFailures$1.evaluate(TestRuleIgnoreAfterMaxFailures.java:60)
	at org.apache.lucene.tests.util.TestRuleIgnoreTestSuites$1.evaluate(TestRuleIgnoreTestSuites.java:47)
	at org.junit.rules.RunRules.evaluate(RunRules.java:20)
	at com.carrotsearch.randomizedtesting.rules.StatementAdapter.evaluate(StatementAdapter.java:36)
	at com.carrotsearch.randomizedtesting.ThreadLeakControl$StatementRunner.run(ThreadLeakControl.java:390)
	at com.carrotsearch.randomizedtesting.ThreadLeakControl.lambda$forkTimeoutingTask$0(ThreadLeakControl.java:850)
	at java.base/java.lang.Thread.run(Thread.java:1583)


FAILED:  org.apache.solr.hdfs.cloud.HdfsBasicDistributedZk2Test.classMethod

Error Message:
java.lang.AssertionError: ObjectTracker found 4 object(s) that were not released!!! [ZkCollectionTerms, ZkCollectionTerms, ZkShardTerms, ZkShardTerms]
org.apache.solr.cloud.ZkCollectionTerms:org.apache.solr.common.util.ObjectReleaseTracker$ObjectTrackerException: org.apache.solr.cloud.ZkCollectionTerms
	at org.apache.solr.common.util.ObjectReleaseTracker.track(ObjectReleaseTracker.java:54)
	at org.apache.solr.cloud.ZkCollectionTerms.<init>(ZkCollectionTerms.java:36)
	at org.apache.solr.cloud.ZkController.getCollectionTerms(ZkController.java:1791)
	at org.apache.solr.cloud.ZkController.register(ZkController.java:1279)
	at org.apache.solr.cloud.ZkController$RegisterCoreAsync.call(ZkController.java:273)
	at java.base/java.util.concurrent.FutureTask.run(FutureTask.java:317)
	at org.apache.solr.common.util.ExecutorUtil$MDCAwareThreadPoolExecutor.lambda$execute$0(ExecutorUtil.java:380)
	at java.base/java.util.concurrent.ThreadPoolExecutor.runWorker(ThreadPoolExecutor.java:1144)
	at java.base/java.util.concurrent.ThreadPoolExecutor$Worker.run(ThreadPoolExecutor.java:642)
	at java.base/java.lang.Thread.run(Thread.java:1583)
Caused by: java.lang.Exception: Submitter stack trace
	at org.apache.solr.common.util.ExecutorUtil$MDCAwareThreadPoolExecutor.execute(ExecutorUtil.java:347)
	at java.base/java.util.concurrent.AbstractExecutorService.submit(AbstractExecutorService.java:145)
	at org.apache.solr.cloud.ZkController.onReconnect(ZkController.java:487)
	at org.apache.solr.common.cloud.OnReconnect.stateChanged(OnReconnect.java:36)
	at org.apache.curator.framework.state.ConnectionStateManager.lambda$processEvents$0(ConnectionStateManager.java:256)
	at org.apache.curator.framework.listen.MappingListenerManager.lambda$forEach$0(MappingListenerManager.java:82)
	... 4 more
Caused by: java.lang.Exception: Submitter stack trace
	at org.apache.solr.common.util.ExecutorUtil$MDCAwareThreadPoolExecutor.execute(ExecutorUtil.java:347)
	at org.apache.curator.framework.listen.MappingListenerManager.forEach(MappingListenerManager.java:80)
	at org.apache.curator.framework.listen.StandardListenerManager.forEach(StandardListenerManager.java:81)
	at org.apache.curator.framework.state.ConnectionStateManager.processEvents(ConnectionStateManager.java:256)
	at org.apache.curator.framework.state.ConnectionStateManager.access$000(ConnectionStateManager.java:43)
	at org.apache.curator.framework.state.ConnectionStateManager$1.call(ConnectionStateManager.java:130)
	at java.base/java.util.concurrent.FutureTask.run(FutureTask.java:317)
	... 3 more

org.apache.solr.cloud.ZkCollectionTerms:org.apache.solr.common.util.ObjectReleaseTracker$ObjectTrackerException: org.apache.solr.cloud.ZkCollectionTerms
	at org.apache.solr.common.util.ObjectReleaseTracker.track(ObjectReleaseTracker.java:54)
	at org.apache.solr.cloud.ZkCollectionTerms.<init>(ZkCollectionTerms.java:36)
	at org.apache.solr.cloud.ZkController.getCollectionTerms(ZkController.java:1791)
	at org.apache.solr.cloud.ZkController.register(ZkController.java:1279)
	at org.apache.solr.cloud.ZkController$RegisterCoreAsync.call(ZkController.java:273)
	at java.base/java.util.concurrent.FutureTask.run(FutureTask.java:317)
	at org.apache.solr.common.util.ExecutorUtil$MDCAwareThreadPoolExecutor.lambda$execute$0(ExecutorUtil.java:380)
	at java.base/java.util.concurrent.ThreadPoolExecutor.runWorker(ThreadPoolExecutor.java:1144)
	at java.base/java.util.concurrent.ThreadPoolExecutor$Worker.run(ThreadPoolExecutor.java:642)
	at java.base/java.lang.Thread.run(Thread.java:1583)
Caused by: java.lang.Exception: Submitter stack trace
	at org.apache.solr.common.util.ExecutorUtil$MDCAwareThreadPoolExecutor.execute(ExecutorUtil.java:347)
	at java.base/java.util.concurrent.AbstractExecutorService.submit(AbstractExecutorService.java:145)
	at org.apache.solr.cloud.ZkController.onReconnect(ZkController.java:487)
	at org.apache.solr.common.cloud.OnReconnect.stateChanged(OnReconnect.java:36)
	at org.apache.curator.framework.state.ConnectionStateManager.lambda$processEvents$0(ConnectionStateManager.java:256)
	at org.apache.curator.framework.listen.MappingListenerManager.lambda$forEach$0(MappingListenerManager.java:82)
	... 4 more
Caused by: java.lang.Exception: Submitter stack trace
	at org.apache.solr.common.util.ExecutorUtil$MDCAwareThreadPoolExecutor.execute(ExecutorUtil.java:347)
	at org.apache.curator.framework.listen.MappingListenerManager.forEach(MappingListenerManager.java:80)
	at org.apache.curator.framework.listen.StandardListenerManager.forEach(StandardListenerManager.java:81)
	at org.apache.curator.framework.state.ConnectionStateManager.processEvents(ConnectionStateManager.java:256)
	at org.apache.curator.framework.state.ConnectionStateManager.access$000(ConnectionStateManager.java:43)
	at org.apache.curator.framework.state.ConnectionStateManager$1.call(ConnectionStateManager.java:130)
	at java.base/java.util.concurrent.FutureTask.run(FutureTask.java:317)
	... 3 more

org.apache.solr.cloud.ZkShardTerms:org.apache.solr.common.util.ObjectReleaseTracker$ObjectTrackerException: org.apache.solr.cloud.ZkShardTerms
	at org.apache.solr.common.util.ObjectReleaseTracker.track(ObjectReleaseTracker.java:54)
	at org.apache.solr.cloud.ZkShardTerms.<init>(ZkShardTerms.java:107)
	at org.apache.solr.cloud.ZkCollectionTerms.getShard(ZkCollectionTerms.java:42)
	at org.apache.solr.cloud.ZkCollectionTerms.register(ZkCollectionTerms.java:49)
	at org.apache.solr.cloud.ZkController.register(ZkController.java:1279)
	at org.apache.solr.cloud.ZkController$RegisterCoreAsync.call(ZkController.java:273)
	at java.base/java.util.concurrent.FutureTask.run(FutureTask.java:317)
	at org.apache.solr.common.util.ExecutorUtil$MDCAwareThreadPoolExecutor.lambda$execute$0(ExecutorUtil.java:380)
	at java.base/java.util.concurrent.ThreadPoolExecutor.runWorker(ThreadPoolExecutor.java:1144)
	at java.base/java.util.concurrent.ThreadPoolExecutor$Worker.run(ThreadPoolExecutor.java:642)
	at java.base/java.lang.Thread.run(Thread.java:1583)
Caused by: java.lang.Exception: Submitter stack trace
	at org.apache.solr.common.util.ExecutorUtil$MDCAwareThreadPoolExecutor.execute(ExecutorUtil.java:347)
	at java.base/java.util.concurrent.AbstractExecutorService.submit(AbstractExecutorService.java:145)
	at org.apache.solr.cloud.ZkController.onReconnect(ZkController.java:487)
	at org.apache.solr.common.cloud.OnReconnect.stateChanged(OnReconnect.java:36)
	at org.apache.curator.framework.state.ConnectionStateManager.lambda$processEvents$0(ConnectionStateManager.java:256)
	at org.apache.curator.framework.listen.MappingListenerManager.lambda$forEach$0(MappingListenerManager.java:82)
	... 4 more
Caused by: java.lang.Exception: Submitter stack trace
	at org.apache.solr.common.util.ExecutorUtil$MDCAwareThreadPoolExecutor.execute(ExecutorUtil.java:347)
	at org.apache.curator.framework.listen.MappingListenerManager.forEach(MappingListenerManager.java:80)
	at org.apache.curator.framework.listen.StandardListenerManager.forEach(StandardListenerManager.java:81)
	at org.apache.curator.framework.state.ConnectionStateManager.processEvents(ConnectionStateManager.java:256)
	at org.apache.curator.framework.state.ConnectionStateManager.access$000(ConnectionStateManager.java:43)
	at org.apache.curator.framework.state.ConnectionStateManager$1.call(ConnectionStateManager.java:130)
	at java.base/java.util.concurrent.FutureTask.run(FutureTask.java:317)
	... 3 more

org.apache.solr.cloud.ZkShardTerms:org.apache.solr.common.util.ObjectReleaseTracker$ObjectTrackerException: org.apache.solr.cloud.ZkShardTerms
	at org.apache.solr.common.util.ObjectReleaseTracker.track(ObjectReleaseTracker.java:54)
	at org.apache.solr.cloud.ZkShardTerms.<init>(ZkShardTerms.java:107)
	at org.apache.solr.cloud.ZkCollectionTerms.getShard(ZkCollectionTerms.java:42)
	at org.apache.solr.cloud.ZkCollectionTerms.register(ZkCollectionTerms.java:49)
	at org.apache.solr.cloud.ZkController.register(ZkController.java:1279)
	at org.apache.solr.cloud.ZkController$RegisterCoreAsync.call(ZkController.java:273)
	at java.base/java.util.concurrent.FutureTask.run(FutureTask.java:317)
	at org.apache.solr.common.util.ExecutorUtil$MDCAwareThreadPoolExecutor.lambda$execute$0(ExecutorUtil.java:380)
	at java.base/java.util.concurrent.ThreadPoolExecutor.runWorker(ThreadPoolExecutor.java:1144)
	at java.base/java.util.concurrent.ThreadPoolExecutor$Worker.run(ThreadPoolExecutor.java:642)
	at java.base/java.lang.Thread.run(Thread.java:1583)
Caused by: java.lang.Exception: Submitter stack trace
	at org.apache.solr.common.util.ExecutorUtil$MDCAwareThreadPoolExecutor.execute(ExecutorUtil.java:347)
	at java.base/java.util.concurrent.AbstractExecutorService.submit(AbstractExecutorService.java:145)
	at org.apache.solr.cloud.ZkController.onReconnect(ZkController.java:487)
	at org.apache.solr.common.cloud.OnReconnect.stateChanged(OnReconnect.java:36)
	at org.apache.curator.framework.state.ConnectionStateManager.lambda$processEvents$0(ConnectionStateManager.java:256)
	at org.apache.curator.framework.listen.MappingListenerManager.lambda$forEach$0(MappingListenerManager.java:82)
	... 4 more
Caused by: java.lang.Exception: Submitter stack trace
	at org.apache.solr.common.util.ExecutorUtil$MDCAwareThreadPoolExecutor.execute(ExecutorUtil.java:347)
	at org.apache.curator.framework.listen.MappingListenerManager.forEach(MappingListenerManager.java:80)
	at org.apache.curator.framework.listen.StandardListenerManager.forEach(StandardListenerManager.java:81)
	at org.apache.curator.framework.state.ConnectionStateManager.processEvents(ConnectionStateManager.java:256)
	at org.apache.curator.framework.state.ConnectionStateManager.access$000(ConnectionStateManager.java:43)
	at org.apache.curator.framework.state.ConnectionStateManager$1.call(ConnectionStateManager.java:130)
	at java.base/java.util.concurrent.FutureTask.run(FutureTask.java:317)
	... 3 more

 expected null, but was:<ObjectTracker found 4 object(s) that were not released!!! [ZkCollectionTerms, ZkCollectionTerms, ZkShardTerms, ZkShardTerms]
org.apache.solr.cloud.ZkCollectionTerms:org.apache.solr.common.util.ObjectReleaseTracker$ObjectTrackerException: org.apache.solr.cloud.ZkCollectionTerms
	at org.apache.solr.common.util.ObjectReleaseTracker.track(ObjectReleaseTracker.java:54)
	at org.apache.solr.cloud.ZkCollectionTerms.<init>(ZkCollectionTerms.java:36)
	at org.apache.solr.cloud.ZkController.getCollectionTerms(ZkController.java:1791)
	at org.apache.solr.cloud.ZkController.register(ZkController.java:1279)
	at org.apache.solr.cloud.ZkController$RegisterCoreAsync.call(ZkController.java:273)
	at java.base/java.util.concurrent.FutureTask.run(FutureTask.java:317)
	at org.apache.solr.common.util.ExecutorUtil$MDCAwareThreadPoolExecutor.lambda$execute$0(ExecutorUtil.java:380)
	at java.base/java.util.concurrent.ThreadPoolExecutor.runWorker(ThreadPoolExecutor.java:1144)
	at java.base/java.util.concurrent.ThreadPoolExecutor$Worker.run(ThreadPoolExecutor.java:642)
	at java.base/java.lang.Thread.run(Thread.java:1583)
Caused by: java.lang.Exception: Submitter stack trace
	at org.apache.solr.common.util.ExecutorUtil$MDCAwareThreadPoolExecutor.execute(ExecutorUtil.java:347)
	at java.base/java.util.concurrent.AbstractExecutorService.submit(AbstractExecutorService.java:145)
	at org.apache.solr.cloud.ZkController.onReconnect(ZkController.java:487)
	at org.apache.solr.common.cloud.OnReconnect.stateChanged(OnReconnect.java:36)
	at org.apache.curator.framework.state.ConnectionStateManager.lambda$processEvents$0(ConnectionStateManager.java:256)
	at org.apache.curator.framework.listen.MappingListenerManager.lambda$forEach$0(MappingListenerManager.java:82)
	... 4 more
Caused by: java.lang.Exception: Submitter stack trace
	at org.apache.solr.common.util.ExecutorUtil$MDCAwareThreadPoolExecutor.execute(ExecutorUtil.java:347)
	at org.apache.curator.framework.listen.MappingListenerManager.forEach(MappingListenerManager.java:80)
	at org.apache.curator.framework.listen.StandardListenerManager.forEach(StandardListenerManager.java:81)
	at org.apache.curator.framework.state.ConnectionStateManager.processEvents(ConnectionStateManager.java:256)
	at org.apache.curator.framework.state.ConnectionStateManager.access$000(ConnectionStateManager.java:43)
	at org.apache.curator.framework.state.ConnectionStateManager$1.call(ConnectionStateManager.java:130)
	at java.base/java.util.concurrent.FutureTask.run(FutureTask.java:317)
	... 3 more

org.apache.solr.cloud.ZkCollectionTerms:org.apache.solr.common.util.ObjectReleaseTracker$ObjectTrackerException: org.apache.solr.cloud.ZkCollectionTerms
	at org.apache.solr.common.util.ObjectReleaseTracker.track(ObjectReleaseTracker.java:54)
	at org.apache.solr.cloud.ZkCollectionTerms.<init>(ZkCollectionTerms.java:36)
	at org.apache.solr.cloud.ZkController.getCollectionTerms(ZkController.java:1791)
	at org.apache.solr.cloud.ZkController.register(ZkController.java:1279)
	at org.apache.solr.cloud.ZkController$RegisterCoreAsync.call(ZkController.java:273)
	at java.base/java.util.concurrent.FutureTask.run(FutureTask.java:317)
	at org.apache.solr.common.util.ExecutorUtil$MDCAwareThreadPoolExecutor.lambda$execute$0(ExecutorUtil.java:380)
	at java.base/java.util.concurrent.ThreadPoolExecutor.runWorker(ThreadPoolExecutor.java:1144)
	at java.base/java.util.concurrent.ThreadPoolExecutor$Worker.run(ThreadPoolExecutor.java:642)
	at java.base/java.lang.Thread.run(Thread.java:1583)
Caused by: java.lang.Exception: Submitter stack trace
	at org.apache.solr.common.util.ExecutorUtil$MDCAwareThreadPoolExecutor.execute(ExecutorUtil.java:347)
	at java.base/java.util.concurrent.AbstractExecutorService.submit(AbstractExecutorService.java:145)
	at org.apache.solr.cloud.ZkController.onReconnect(ZkController.java:487)
	at org.apache.solr.common.cloud.OnReconnect.stateChanged(OnReconnect.java:36)
	at org.apache.curator.framework.state.ConnectionStateManager.lambda$processEvents$0(ConnectionStateManager.java:256)
	at org.apache.curator.framework.listen.MappingListenerManager.lambda$forEach$0(MappingListenerManager.java:82)
	... 4 more
Caused by: java.lang.Exception: Submitter stack trace
	at org.apache.solr.common.util.ExecutorUtil$MDCAwareThreadPoolExecutor.execute(ExecutorUtil.java:347)
	at org.apache.curator.framework.listen.MappingListenerManager.forEach(MappingListenerManager.java:80)
	at org.apache.curator.framework.listen.StandardListenerManager.forEach(StandardListenerManager.java:81)
	at org.apache.curator.framework.state.ConnectionStateManager.processEvents(ConnectionStateManager.java:256)
	at org.apache.curator.framework.state.ConnectionStateManager.access$000(ConnectionStateManager.java:43)
	at org.apache.curator.framework.state.ConnectionStateManager$1.call(ConnectionStateManager.java:130)
	at java.base/java.util.concurrent.FutureTask.run(FutureTask.java:317)
	... 3 more

org.apache.solr.cloud.ZkShardTerms:org.apache.solr.common.util.ObjectReleaseTracker$ObjectTrackerException: org.apache.solr.cloud.ZkShardTerms
	at org.apache.solr.common.util.ObjectReleaseTracker.track(ObjectReleaseTracker.java:54)
	at org.apache.solr.cloud.ZkShardTerms.<init>(ZkShardTerms.java:107)
	at org.apache.solr.cloud.ZkCollectionTerms.getShard(ZkCollectionTerms.java:42)
	at org.apache.solr.cloud.ZkCollectionTerms.register(ZkCollectionTerms.java:49)
	at org.apache.solr.cloud.ZkController.register(ZkController.java:1279)
	at org.apache.solr.cloud.ZkController$RegisterCoreAsync.call(ZkController.java:273)
	at java.base/java.util.concurrent.FutureTask.run(FutureTask.java:317)
	at org.apache.solr.common.util.ExecutorUtil$MDCAwareThreadPoolExecutor.lambda$execute$0(ExecutorUtil.java:380)
	at java.base/java.util.concurrent.ThreadPoolExecutor.runWorker(ThreadPoolExecutor.java:1144)
	at java.base/java.util.concurrent.ThreadPoolExecutor$Worker.run(ThreadPoolExecutor.java:642)
	at java.base/java.lang.Thread.run(Thread.java:1583)
Caused by: java.lang.Exception: Submitter stack trace
	at org.apache.solr.common.util.ExecutorUtil$MDCAwareThreadPoolExecutor.execute(ExecutorUtil.java:347)
	at java.base/java.util.concurrent.AbstractExecutorService.submit(AbstractExecutorService.java:145)
	at org.apache.solr.cloud.ZkController.onReconnect(ZkController.java:487)
	at org.apache.solr.common.cloud.OnReconnect.stateChanged(OnReconnect.java:36)
	at org.apache.curator.framework.state.ConnectionStateManager.lambda$processEvents$0(ConnectionStateManager.java:256)
	at org.apache.curator.framework.listen.MappingListenerManager.lambda$forEach$0(MappingListenerManager.java:82)
	... 4 more
Caused by: java.lang.Exception: Submitter stack trace
	at org.apache.solr.common.util.ExecutorUtil$MDCAwareThreadPoolExecutor.execute(ExecutorUtil.java:347)
	at org.apache.curator.framework.listen.MappingListenerManager.forEach(MappingListenerManager.java:80)
	at org.apache.curator.framework.listen.StandardListenerManager.forEach(StandardListenerManager.java:81)
	at org.apache.curator.framework.state.ConnectionStateManager.processEvents(ConnectionStateManager.java:256)
	at org.apache.curator.framework.state.ConnectionStateManager.access$000(ConnectionStateManager.java:43)
	at org.apache.curator.framework.state.ConnectionStateManager$1.call(ConnectionStateManager.java:130)
	at java.base/java.util.concurrent.FutureTask.run(FutureTask.java:317)
	... 3 more

org.apache.solr.cloud.ZkShardTerms:org.apache.solr.common.util.ObjectReleaseTracker$ObjectTrackerException: org.apache.solr.cloud.ZkShardTerms
	at org.apache.solr.common.util.ObjectReleaseTracker.track(ObjectReleaseTracker.java:54)
	at org.apache.solr.cloud.ZkShardTerms.<init>(ZkShardTerms.java:107)
	at org.apache.solr.cloud.ZkCollectionTerms.getShard(ZkCollectionTerms.java:42)
	at org.apache.solr.cloud.ZkCollectionTerms.register(ZkCollectionTerms.java:49)
	at org.apache.solr.cloud.ZkController.register(ZkController.java:1279)
	at org.apache.solr.cloud.ZkController$RegisterCoreAsync.call(ZkController.java:273)
	at java.base/java.util.concurrent.FutureTask.run(FutureTask.java:317)
	at org.apache.solr.common.util.ExecutorUtil$MDCAwareThreadPoolExecutor.lambda$execute$0(ExecutorUtil.java:380)
	at java.base/java.util.concurrent.ThreadPoolExecutor.runWorker(ThreadPoolExecutor.java:1144)
	at java.base/java.util.concurrent.ThreadPoolExecutor$Worker.run(ThreadPoolExecutor.java:642)
	at java.base/java.lang.Thread.run(Thread.java:1583)
Caused by: java.lang.Exception: Submitter stack trace
	at org.apache.solr.common.util.ExecutorUtil$MDCAwareThreadPoolExecutor.execute(ExecutorUtil.java:347)
	at java.base/java.util.concurrent.AbstractExecutorService.submit(AbstractExecutorService.java:145)
	at org.apache.solr.cloud.ZkController.onReconnect(ZkController.java:487)
	at org.apache.solr.common.cloud.OnReconnect.stateChanged(OnReconnect.java:36)
	at org.apache.curator.framework.state.ConnectionStateManager.lambda$processEvents$0(ConnectionStateManager.java:256)
	at org.apache.curator.framework.listen.MappingListenerManager.lambda$forEach$0(MappingListenerManager.java:82)
	... 4 more
Caused by: java.lang.Exception: Submitter stack trace
	at org.apache.solr.common.util.ExecutorUtil$MDCAwareThreadPoolExecutor.execute(ExecutorUtil.java:347)
	at org.apache.curator.framework.listen.MappingListenerManager.forEach(MappingListenerManager.java:80)
	at org.apache.curator.framework.listen.StandardListenerManager.forEach(StandardListenerManager.java:81)
	at org.apache.curator.framework.state.ConnectionStateManager.processEvents(ConnectionStateManager.java:256)
	at org.apache.curator.framework.state.ConnectionStateManager.access$000(ConnectionStateManager.java:43)
	at org.apache.curator.framework.state.ConnectionStateManager$1.call(ConnectionStateManager.java:130)
	at java.base/java.util.concurrent.FutureTask.run(FutureTask.java:317)
	... 3 more

>

Stack Trace:
java.lang.AssertionError: ObjectTracker found 4 object(s) that were not released!!! [ZkCollectionTerms, ZkCollectionTerms, ZkShardTerms, ZkShardTerms]
org.apache.solr.cloud.ZkCollectionTerms:org.apache.solr.common.util.ObjectReleaseTracker$ObjectTrackerException: org.apache.solr.cloud.ZkCollectionTerms
	at org.apache.solr.common.util.ObjectReleaseTracker.track(ObjectReleaseTracker.java:54)
	at org.apache.solr.cloud.ZkCollectionTerms.<init>(ZkCollectionTerms.java:36)
	at org.apache.solr.cloud.ZkController.getCollectionTerms(ZkController.java:1791)
	at org.apache.solr.cloud.ZkController.register(ZkController.java:1279)
	at org.apache.solr.cloud.ZkController$RegisterCoreAsync.call(ZkController.java:273)
	at java.base/java.util.concurrent.FutureTask.run(FutureTask.java:317)
	at org.apache.solr.common.util.ExecutorUtil$MDCAwareThreadPoolExecutor.lambda$execute$0(ExecutorUtil.java:380)
	at java.base/java.util.concurrent.ThreadPoolExecutor.runWorker(ThreadPoolExecutor.java:1144)
	at java.base/java.util.concurrent.ThreadPoolExecutor$Worker.run(ThreadPoolExecutor.java:642)
	at java.base/java.lang.Thread.run(Thread.java:1583)
Caused by: java.lang.Exception: Submitter stack trace
	at org.apache.solr.common.util.ExecutorUtil$MDCAwareThreadPoolExecutor.execute(ExecutorUtil.java:347)
	at java.base/java.util.concurrent.AbstractExecutorService.submit(AbstractExecutorService.java:145)
	at org.apache.solr.cloud.ZkController.onReconnect(ZkController.java:487)
	at org.apache.solr.common.cloud.OnReconnect.stateChanged(OnReconnect.java:36)
	at org.apache.curator.framework.state.ConnectionStateManager.lambda$processEvents$0(ConnectionStateManager.java:256)
	at org.apache.curator.framework.listen.MappingListenerManager.lambda$forEach$0(MappingListenerManager.java:82)
	... 4 more
Caused by: java.lang.Exception: Submitter stack trace
	at org.apache.solr.common.util.ExecutorUtil$MDCAwareThreadPoolExecutor.execute(ExecutorUtil.java:347)
	at org.apache.curator.framework.listen.MappingListenerManager.forEach(MappingListenerManager.java:80)
	at org.apache.curator.framework.listen.StandardListenerManager.forEach(StandardListenerManager.java:81)
	at org.apache.curator.framework.state.ConnectionStateManager.processEvents(ConnectionStateManager.java:256)
	at org.apache.curator.framework.state.ConnectionStateManager.access$000(ConnectionStateManager.java:43)
	at org.apache.curator.framework.state.ConnectionStateManager$1.call(ConnectionStateManager.java:130)
	at java.base/java.util.concurrent.FutureTask.run(FutureTask.java:317)
	... 3 more

org.apache.solr.cloud.ZkCollectionTerms:org.apache.solr.common.util.ObjectReleaseTracker$ObjectTrackerException: org.apache.solr.cloud.ZkCollectionTerms
	at org.apache.solr.common.util.ObjectReleaseTracker.track(ObjectReleaseTracker.java:54)
	at org.apache.solr.cloud.ZkCollectionTerms.<init>(ZkCollectionTerms.java:36)
	at org.apache.solr.cloud.ZkController.getCollectionTerms(ZkController.java:1791)
	at org.apache.solr.cloud.ZkController.register(ZkController.java:1279)
	at org.apache.solr.cloud.ZkController$RegisterCoreAsync.call(ZkController.java:273)
	at java.base/java.util.concurrent.FutureTask.run(FutureTask.java:317)
	at org.apache.solr.common.util.ExecutorUtil$MDCAwareThreadPoolExecutor.lambda$execute$0(ExecutorUtil.java:380)
	at java.base/java.util.concurrent.ThreadPoolExecutor.runWorker(ThreadPoolExecutor.java:1144)
	at java.base/java.util.concurrent.ThreadPoolExecutor$Worker.run(ThreadPoolExecutor.java:642)
	at java.base/java.lang.Thread.run(Thread.java:1583)
Caused by: java.lang.Exception: Submitter stack trace
	at org.apache.solr.common.util.ExecutorUtil$MDCAwareThreadPoolExecutor.execute(ExecutorUtil.java:347)
	at java.base/java.util.concurrent.AbstractExecutorService.submit(AbstractExecutorService.java:145)
	at org.apache.solr.cloud.ZkController.onReconnect(ZkController.java:487)
	at org.apache.solr.common.cloud.OnReconnect.stateChanged(OnReconnect.java:36)
	at org.apache.curator.framework.state.ConnectionStateManager.lambda$processEvents$0(ConnectionStateManager.java:256)
	at org.apache.curator.framework.listen.MappingListenerManager.lambda$forEach$0(MappingListenerManager.java:82)
	... 4 more
Caused by: java.lang.Exception: Submitter stack trace
	at org.apache.solr.common.util.ExecutorUtil$MDCAwareThreadPoolExecutor.execute(ExecutorUtil.java:347)
	at org.apache.curator.framework.listen.MappingListenerManager.forEach(MappingListenerManager.java:80)
	at org.apache.curator.framework.listen.StandardListenerManager.forEach(StandardListenerManager.java:81)
	at org.apache.curator.framework.state.ConnectionStateManager.processEvents(ConnectionStateManager.java:256)
	at org.apache.curator.framework.state.ConnectionStateManager.access$000(ConnectionStateManager.java:43)
	at org.apache.curator.framework.state.ConnectionStateManager$1.call(ConnectionStateManager.java:130)
	at java.base/java.util.concurrent.FutureTask.run(FutureTask.java:317)
	... 3 more

org.apache.solr.cloud.ZkShardTerms:org.apache.solr.common.util.ObjectReleaseTracker$ObjectTrackerException: org.apache.solr.cloud.ZkShardTerms
	at org.apache.solr.common.util.ObjectReleaseTracker.track(ObjectReleaseTracker.java:54)
	at org.apache.solr.cloud.ZkShardTerms.<init>(ZkShardTerms.java:107)
	at org.apache.solr.cloud.ZkCollectionTerms.getShard(ZkCollectionTerms.java:42)
	at org.apache.solr.cloud.ZkCollectionTerms.register(ZkCollectionTerms.java:49)
	at org.apache.solr.cloud.ZkController.register(ZkController.java:1279)
	at org.apache.solr.cloud.ZkController$RegisterCoreAsync.call(ZkController.java:273)
	at java.base/java.util.concurrent.FutureTask.run(FutureTask.java:317)
	at org.apache.solr.common.util.ExecutorUtil$MDCAwareThreadPoolExecutor.lambda$execute$0(ExecutorUtil.java:380)
	at java.base/java.util.concurrent.ThreadPoolExecutor.runWorker(ThreadPoolExecutor.java:1144)
	at java.base/java.util.concurrent.ThreadPoolExecutor$Worker.run(ThreadPoolExecutor.java:642)
	at java.base/java.lang.Thread.run(Thread.java:1583)
Caused by: java.lang.Exception: Submitter stack trace
	at org.apache.solr.common.util.ExecutorUtil$MDCAwareThreadPoolExecutor.execute(ExecutorUtil.java:347)
	at java.base/java.util.concurrent.AbstractExecutorService.submit(AbstractExecutorService.java:145)
	at org.apache.solr.cloud.ZkController.onReconnect(ZkController.java:487)
	at org.apache.solr.common.cloud.OnReconnect.stateChanged(OnReconnect.java:36)
	at org.apache.curator.framework.state.ConnectionStateManager.lambda$processEvents$0(ConnectionStateManager.java:256)
	at org.apache.curator.framework.listen.MappingListenerManager.lambda$forEach$0(MappingListenerManager.java:82)
	... 4 more
Caused by: java.lang.Exception: Submitter stack trace
	at org.apache.solr.common.util.ExecutorUtil$MDCAwareThreadPoolExecutor.execute(ExecutorUtil.java:347)
	at org.apache.curator.framework.listen.MappingListenerManager.forEach(MappingListenerManager.java:80)
	at org.apache.curator.framework.listen.StandardListenerManager.forEach(StandardListenerManager.java:81)
	at org.apache.curator.framework.state.ConnectionStateManager.processEvents(ConnectionStateManager.java:256)
	at org.apache.curator.framework.state.ConnectionStateManager.access$000(ConnectionStateManager.java:43)
	at org.apache.curator.framework.state.ConnectionStateManager$1.call(ConnectionStateManager.java:130)
	at java.base/java.util.concurrent.FutureTask.run(FutureTask.java:317)
	... 3 more

org.apache.solr.cloud.ZkShardTerms:org.apache.solr.common.util.ObjectReleaseTracker$ObjectTrackerException: org.apache.solr.cloud.ZkShardTerms
	at org.apache.solr.common.util.ObjectReleaseTracker.track(ObjectReleaseTracker.java:54)
	at org.apache.solr.cloud.ZkShardTerms.<init>(ZkShardTerms.java:107)
	at org.apache.solr.cloud.ZkCollectionTerms.getShard(ZkCollectionTerms.java:42)
	at org.apache.solr.cloud.ZkCollectionTerms.register(ZkCollectionTerms.java:49)
	at org.apache.solr.cloud.ZkController.register(ZkController.java:1279)
	at org.apache.solr.cloud.ZkController$RegisterCoreAsync.call(ZkController.java:273)
	at java.base/java.util.concurrent.FutureTask.run(FutureTask.java:317)
	at org.apache.solr.common.util.ExecutorUtil$MDCAwareThreadPoolExecutor.lambda$execute$0(ExecutorUtil.java:380)
	at java.base/java.util.concurrent.ThreadPoolExecutor.runWorker(ThreadPoolExecutor.java:1144)
	at java.base/java.util.concurrent.ThreadPoolExecutor$Worker.run(ThreadPoolExecutor.java:642)
	at java.base/java.lang.Thread.run(Thread.java:1583)
Caused by: java.lang.Exception: Submitter stack trace
	at org.apache.solr.common.util.ExecutorUtil$MDCAwareThreadPoolExecutor.execute(ExecutorUtil.java:347)
	at java.base/java.util.concurrent.AbstractExecutorService.submit(AbstractExecutorService.java:145)
	at org.apache.solr.cloud.ZkController.onReconnect(ZkController.java:487)
	at org.apache.solr.common.cloud.OnReconnect.stateChanged(OnReconnect.java:36)
	at org.apache.curator.framework.state.ConnectionStateManager.lambda$processEvents$0(ConnectionStateManager.java:256)
	at org.apache.curator.framework.listen.MappingListenerManager.lambda$forEach$0(MappingListenerManager.java:82)
	... 4 more
Caused by: java.lang.Exception: Submitter stack trace
	at org.apache.solr.common.util.ExecutorUtil$MDCAwareThreadPoolExecutor.execute(ExecutorUtil.java:347)
	at org.apache.curator.framework.listen.MappingListenerManager.forEach(MappingListenerManager.java:80)
	at org.apache.curator.framework.listen.StandardListenerManager.forEach(StandardListenerManager.java:81)
	at org.apache.curator.framework.state.ConnectionStateManager.processEvents(ConnectionStateManager.java:256)
	at org.apache.curator.framework.state.ConnectionStateManager.access$000(ConnectionStateManager.java:43)
	at org.apache.curator.framework.state.ConnectionStateManager$1.call(ConnectionStateManager.java:130)
	at java.base/java.util.concurrent.FutureTask.run(FutureTask.java:317)
	... 3 more

 expected null, but was:<ObjectTracker found 4 object(s) that were not released!!! [ZkCollectionTerms, ZkCollectionTerms, ZkShardTerms, ZkShardTerms]
org.apache.solr.cloud.ZkCollectionTerms:org.apache.solr.common.util.ObjectReleaseTracker$ObjectTrackerException: org.apache.solr.cloud.ZkCollectionTerms
	at org.apache.solr.common.util.ObjectReleaseTracker.track(ObjectReleaseTracker.java:54)
	at org.apache.solr.cloud.ZkCollectionTerms.<init>(ZkCollectionTerms.java:36)
	at org.apache.solr.cloud.ZkController.getCollectionTerms(ZkController.java:1791)
	at org.apache.solr.cloud.ZkController.register(ZkController.java:1279)
	at org.apache.solr.cloud.ZkController$RegisterCoreAsync.call(ZkController.java:273)
	at java.base/java.util.concurrent.FutureTask.run(FutureTask.java:317)
	at org.apache.solr.common.util.ExecutorUtil$MDCAwareThreadPoolExecutor.lambda$execute$0(ExecutorUtil.java:380)
	at java.base/java.util.concurrent.ThreadPoolExecutor.runWorker(ThreadPoolExecutor.java:1144)
	at java.base/java.util.concurrent.ThreadPoolExecutor$Worker.run(ThreadPoolExecutor.java:642)
	at java.base/java.lang.Thread.run(Thread.java:1583)
Caused by: java.lang.Exception: Submitter stack trace
	at org.apache.solr.common.util.ExecutorUtil$MDCAwareThreadPoolExecutor.execute(ExecutorUtil.java:347)
	at java.base/java.util.concurrent.AbstractExecutorService.submit(AbstractExecutorService.java:145)
	at org.apache.solr.cloud.ZkController.onReconnect(ZkController.java:487)
	at org.apache.solr.common.cloud.OnReconnect.stateChanged(OnReconnect.java:36)
	at org.apache.curator.framework.state.ConnectionStateManager.lambda$processEvents$0(ConnectionStateManager.java:256)
	at org.apache.curator.framework.listen.MappingListenerManager.lambda$forEach$0(MappingListenerManager.java:82)
	... 4 more
Caused by: java.lang.Exception: Submitter stack trace
	at org.apache.solr.common.util.ExecutorUtil$MDCAwareThreadPoolExecutor.execute(ExecutorUtil.java:347)
	at org.apache.curator.framework.listen.MappingListenerManager.forEach(MappingListenerManager.java:80)
	at org.apache.curator.framework.listen.StandardListenerManager.forEach(StandardListenerManager.java:81)
	at org.apache.curator.framework.state.ConnectionStateManager.processEvents(ConnectionStateManager.java:256)
	at org.apache.curator.framework.state.ConnectionStateManager.access$000(ConnectionStateManager.java:43)
	at org.apache.curator.framework.state.ConnectionStateManager$1.call(ConnectionStateManager.java:130)
	at java.base/java.util.concurrent.FutureTask.run(FutureTask.java:317)
	... 3 more

org.apache.solr.cloud.ZkCollectionTerms:org.apache.solr.common.util.ObjectReleaseTracker$ObjectTrackerException: org.apache.solr.cloud.ZkCollectionTerms
	at org.apache.solr.common.util.ObjectReleaseTracker.track(ObjectReleaseTracker.java:54)
	at org.apache.solr.cloud.ZkCollectionTerms.<init>(ZkCollectionTerms.java:36)
	at org.apache.solr.cloud.ZkController.getCollectionTerms(ZkController.java:1791)
	at org.apache.solr.cloud.ZkController.register(ZkController.java:1279)
	at org.apache.solr.cloud.ZkController$RegisterCoreAsync.call(ZkController.java:273)
	at java.base/java.util.concurrent.FutureTask.run(FutureTask.java:317)
	at org.apache.solr.common.util.ExecutorUtil$MDCAwareThreadPoolExecutor.lambda$execute$0(ExecutorUtil.java:380)
	at java.base/java.util.concurrent.ThreadPoolExecutor.runWorker(ThreadPoolExecutor.java:1144)
	at java.base/java.util.concurrent.ThreadPoolExecutor$Worker.run(ThreadPoolExecutor.java:642)
	at java.base/java.lang.Thread.run(Thread.java:1583)
Caused by: java.lang.Exception: Submitter stack trace
	at org.apache.solr.common.util.ExecutorUtil$MDCAwareThreadPoolExecutor.execute(ExecutorUtil.java:347)
	at java.base/java.util.concurrent.AbstractExecutorService.submit(AbstractExecutorService.java:145)
	at org.apache.solr.cloud.ZkController.onReconnect(ZkController.java:487)
	at org.apache.solr.common.cloud.OnReconnect.stateChanged(OnReconnect.java:36)
	at org.apache.curator.framework.state.ConnectionStateManager.lambda$processEvents$0(ConnectionStateManager.java:256)
	at org.apache.curator.framework.listen.MappingListenerManager.lambda$forEach$0(MappingListenerManager.java:82)
	... 4 more
Caused by: java.lang.Exception: Submitter stack trace
	at org.apache.solr.common.util.ExecutorUtil$MDCAwareThreadPoolExecutor.execute(ExecutorUtil.java:347)
	at org.apache.curator.framework.listen.MappingListenerManager.forEach(MappingListenerManager.java:80)
	at org.apache.curator.framework.listen.StandardListenerManager.forEach(StandardListenerManager.java:81)
	at org.apache.curator.framework.state.ConnectionStateManager.processEvents(ConnectionStateManager.java:256)
	at org.apache.curator.framework.state.ConnectionStateManager.access$000(ConnectionStateManager.java:43)
	at org.apache.curator.framework.state.ConnectionStateManager$1.call(ConnectionStateManager.java:130)
	at java.base/java.util.concurrent.FutureTask.run(FutureTask.java:317)
	... 3 more

org.apache.solr.cloud.ZkShardTerms:org.apache.solr.common.util.ObjectReleaseTracker$ObjectTrackerException: org.apache.solr.cloud.ZkShardTerms
	at org.apache.solr.common.util.ObjectReleaseTracker.track(ObjectReleaseTracker.java:54)
	at org.apache.solr.cloud.ZkShardTerms.<init>(ZkShardTerms.java:107)
	at org.apache.solr.cloud.ZkCollectionTerms.getShard(ZkCollectionTerms.java:42)
	at org.apache.solr.cloud.ZkCollectionTerms.register(ZkCollectionTerms.java:49)
	at org.apache.solr.cloud.ZkController.register(ZkController.java:1279)
	at org.apache.solr.cloud.ZkController$RegisterCoreAsync.call(ZkController.java:273)
	at java.base/java.util.concurrent.FutureTask.run(FutureTask.java:317)
	at org.apache.solr.common.util.ExecutorUtil$MDCAwareThreadPoolExecutor.lambda$execute$0(ExecutorUtil.java:380)
	at java.base/java.util.concurrent.ThreadPoolExecutor.runWorker(ThreadPoolExecutor.java:1144)
	at java.base/java.util.concurrent.ThreadPoolExecutor$Worker.run(ThreadPoolExecutor.java:642)
	at java.base/java.lang.Thread.run(Thread.java:1583)
Caused by: java.lang.Exception: Submitter stack trace
	at org.apache.solr.common.util.ExecutorUtil$MDCAwareThreadPoolExecutor.execute(ExecutorUtil.java:347)
	at java.base/java.util.concurrent.AbstractExecutorService.submit(AbstractExecutorService.java:145)
	at org.apache.solr.cloud.ZkController.onReconnect(ZkController.java:487)
	at org.apache.solr.common.cloud.OnReconnect.stateChanged(OnReconnect.java:36)
	at org.apache.curator.framework.state.ConnectionStateManager.lambda$processEvents$0(ConnectionStateManager.java:256)
	at org.apache.curator.framework.listen.MappingListenerManager.lambda$forEach$0(MappingListenerManager.java:82)
	... 4 more
Caused by: java.lang.Exception: Submitter stack trace
	at org.apache.solr.common.util.ExecutorUtil$MDCAwareThreadPoolExecutor.execute(ExecutorUtil.java:347)
	at org.apache.curator.framework.listen.MappingListenerManager.forEach(MappingListenerManager.java:80)
	at org.apache.curator.framework.listen.StandardListenerManager.forEach(StandardListenerManager.java:81)
	at org.apache.curator.framework.state.ConnectionStateManager.processEvents(ConnectionStateManager.java:256)
	at org.apache.curator.framework.state.ConnectionStateManager.access$000(ConnectionStateManager.java:43)
	at org.apache.curator.framework.state.ConnectionStateManager$1.call(ConnectionStateManager.java:130)
	at java.base/java.util.concurrent.FutureTask.run(FutureTask.java:317)
	... 3 more

org.apache.solr.cloud.ZkShardTerms:org.apache.solr.common.util.ObjectReleaseTracker$ObjectTrackerException: org.apache.solr.cloud.ZkShardTerms
	at org.apache.solr.common.util.ObjectReleaseTracker.track(ObjectReleaseTracker.java:54)
	at org.apache.solr.cloud.ZkShardTerms.<init>(ZkShardTerms.java:107)
	at org.apache.solr.cloud.ZkCollectionTerms.getShard(ZkCollectionTerms.java:42)
	at org.apache.solr.cloud.ZkCollectionTerms.register(ZkCollectionTerms.java:49)
	at org.apache.solr.cloud.ZkController.register(ZkController.java:1279)
	at org.apache.solr.cloud.ZkController$RegisterCoreAsync.call(ZkController.java:273)
	at java.base/java.util.concurrent.FutureTask.run(FutureTask.java:317)
	at org.apache.solr.common.util.ExecutorUtil$MDCAwareThreadPoolExecutor.lambda$execute$0(ExecutorUtil.java:380)
	at java.base/java.util.concurrent.ThreadPoolExecutor.runWorker(ThreadPoolExecutor.java:1144)
	at java.base/java.util.concurrent.ThreadPoolExecutor$Worker.run(ThreadPoolExecutor.java:642)
	at java.base/java.lang.Thread.run(Thread.java:1583)
Caused by: java.lang.Exception: Submitter stack trace
	at org.apache.solr.common.util.ExecutorUtil$MDCAwareThreadPoolExecutor.execute(ExecutorUtil.java:347)
	at java.base/java.util.concurrent.AbstractExecutorService.submit(AbstractExecutorService.java:145)
	at org.apache.solr.cloud.ZkController.onReconnect(ZkController.java:487)
	at org.apache.solr.common.cloud.OnReconnect.stateChanged(OnReconnect.java:36)
	at org.apache.curator.framework.state.ConnectionStateManager.lambda$processEvents$0(ConnectionStateManager.java:256)
	at org.apache.curator.framework.listen.MappingListenerManager.lambda$forEach$0(MappingListenerManager.java:82)
	... 4 more
Caused by: java.lang.Exception: Submitter stack trace
	at org.apache.solr.common.util.ExecutorUtil$MDCAwareThreadPoolExecutor.execute(ExecutorUtil.java:347)
	at org.apache.curator.framework.listen.MappingListenerManager.forEach(MappingListenerManager.java:80)
	at org.apache.curator.framework.listen.StandardListenerManager.forEach(StandardListenerManager.java:81)
	at org.apache.curator.framework.state.ConnectionStateManager.processEvents(ConnectionStateManager.java:256)
	at org.apache.curator.framework.state.ConnectionStateManager.access$000(ConnectionStateManager.java:43)
	at org.apache.curator.framework.state.ConnectionStateManager$1.call(ConnectionStateManager.java:130)
	at java.base/java.util.concurrent.FutureTask.run(FutureTask.java:317)
	... 3 more

>
	at __randomizedtesting.SeedInfo.seed([9A2C4E350779A98]:0)
	at org.junit.Assert.fail(Assert.java:89)
	at org.junit.Assert.failNotNull(Assert.java:756)
	at org.junit.Assert.assertNull(Assert.java:738)
	at org.apache.solr.SolrTestCase$1.afterIfSuccessful(SolrTestCase.java:100)
	at com.carrotsearch.randomizedtesting.rules.StatementAdapter.evaluate(StatementAdapter.java:37)
	at com.carrotsearch.randomizedtesting.rules.StatementAdapter.evaluate(StatementAdapter.java:36)
	at org.apache.lucene.tests.util.AbstractBeforeAfterRule$1.evaluate(AbstractBeforeAfterRule.java:43)
	at com.carrotsearch.randomizedtesting.rules.SystemPropertiesRestoreRule$1.evaluate(SystemPropertiesRestoreRule.java:80)
	at org.junit.rules.RunRules.evaluate(RunRules.java:20)
	at org.apache.lucene.tests.util.AbstractBeforeAfterRule$1.evaluate(AbstractBeforeAfterRule.java:43)
	at com.carrotsearch.randomizedtesting.rules.StatementAdapter.evaluate(StatementAdapter.java:36)
	at org.apache.lucene.tests.util.TestRuleStoreClassName$1.evaluate(TestRuleStoreClassName.java:38)
	at com.carrotsearch.randomizedtesting.rules.NoShadowingOrOverridesOnMethodsRule$1.evaluate(NoShadowingOrOverridesOnMethodsRule.java:40)
	at com.carrotsearch.randomizedtesting.rules.NoShadowingOrOverridesOnMethodsRule$1.evaluate(NoShadowingOrOverridesOnMethodsRule.java:40)
	at com.carrotsearch.randomizedtesting.rules.StatementAdapter.evaluate(StatementAdapter.java:36)
	at com.carrotsearch.randomizedtesting.rules.StatementAdapter.evaluate(StatementAdapter.java:36)
	at org.apache.lucene.tests.util.TestRuleAssertionsRequired$1.evaluate(TestRuleAssertionsRequired.java:53)
	at org.apache.lucene.tests.util.AbstractBeforeAfterRule$1.evaluate(AbstractBeforeAfterRule.java:43)
	at org.apache.lucene.tests.util.TestRuleMarkFailure$1.evaluate(TestRuleMarkFailure.java:44)
	at org.apache.lucene.tests.util.TestRuleIgnoreAfterMaxFailures$1.evaluate(TestRuleIgnoreAfterMaxFailures.java:60)
	at org.apache.lucene.tests.util.TestRuleIgnoreTestSuites$1.evaluate(TestRuleIgnoreTestSuites.java:47)
	at org.junit.rules.RunRules.evaluate(RunRules.java:20)
	at com.carrotsearch.randomizedtesting.rules.StatementAdapter.evaluate(StatementAdapter.java:36)
	at com.carrotsearch.randomizedtesting.ThreadLeakControl$StatementRunner.run(ThreadLeakControl.java:390)
	at com.carrotsearch.randomizedtesting.ThreadLeakControl.lambda$forkTimeoutingTask$0(ThreadLeakControl.java:850)
	at java.base/java.lang.Thread.run(Thread.java:1583)


FAILED:  org.apache.solr.hdfs.cloud.HdfsBasicDistributedZk2Test.classMethod

Error Message:
java.lang.AssertionError: ObjectTracker found 2 object(s) that were not released!!! [ZkShardTerms, ZkCollectionTerms]
org.apache.solr.cloud.ZkShardTerms:org.apache.solr.common.util.ObjectReleaseTracker$ObjectTrackerException: org.apache.solr.cloud.ZkShardTerms
	at org.apache.solr.common.util.ObjectReleaseTracker.track(ObjectReleaseTracker.java:54)
	at org.apache.solr.cloud.ZkShardTerms.<init>(ZkShardTerms.java:107)
	at org.apache.solr.cloud.ZkCollectionTerms.getShard(ZkCollectionTerms.java:42)
	at org.apache.solr.cloud.ZkCollectionTerms.register(ZkCollectionTerms.java:49)
	at org.apache.solr.cloud.ZkController.register(ZkController.java:1279)
	at org.apache.solr.cloud.ZkController$RegisterCoreAsync.call(ZkController.java:273)
	at java.base/java.util.concurrent.FutureTask.run(FutureTask.java:317)
	at org.apache.solr.common.util.ExecutorUtil$MDCAwareThreadPoolExecutor.lambda$execute$0(ExecutorUtil.java:380)
	at java.base/java.util.concurrent.ThreadPoolExecutor.runWorker(ThreadPoolExecutor.java:1144)
	at java.base/java.util.concurrent.ThreadPoolExecutor$Worker.run(ThreadPoolExecutor.java:642)
	at java.base/java.lang.Thread.run(Thread.java:1583)
Caused by: java.lang.Exception: Submitter stack trace
	at org.apache.solr.common.util.ExecutorUtil$MDCAwareThreadPoolExecutor.execute(ExecutorUtil.java:347)
	at java.base/java.util.concurrent.AbstractExecutorService.submit(AbstractExecutorService.java:145)
	at org.apache.solr.cloud.ZkController.onReconnect(ZkController.java:487)
	at org.apache.solr.common.cloud.OnReconnect.stateChanged(OnReconnect.java:36)
	at org.apache.curator.framework.state.ConnectionStateManager.lambda$processEvents$0(ConnectionStateManager.java:256)
	at org.apache.curator.framework.listen.MappingListenerManager.lambda$forEach$0(MappingListenerManager.java:82)
	... 4 more
Caused by: java.lang.Exception: Submitter stack trace
	at org.apache.solr.common.util.ExecutorUtil$MDCAwareThreadPoolExecutor.execute(ExecutorUtil.java:347)
	at org.apache.curator.framework.listen.MappingListenerManager.forEach(MappingListenerManager.java:80)
	at org.apache.curator.framework.listen.StandardListenerManager.forEach(StandardListenerManager.java:81)
	at org.apache.curator.framework.state.ConnectionStateManager.processEvents(ConnectionStateManager.java:256)
	at org.apache.curator.framework.state.ConnectionStateManager.access$000(ConnectionStateManager.java:43)
	at org.apache.curator.framework.state.ConnectionStateManager$1.call(ConnectionStateManager.java:130)
	at java.base/java.util.concurrent.FutureTask.run(FutureTask.java:317)
	... 3 more

org.apache.solr.cloud.ZkCollectionTerms:org.apache.solr.common.util.ObjectReleaseTracker$ObjectTrackerException: org.apache.solr.cloud.ZkCollectionTerms
	at org.apache.solr.common.util.ObjectReleaseTracker.track(ObjectReleaseTracker.java:54)
	at org.apache.solr.cloud.ZkCollectionTerms.<init>(ZkCollectionTerms.java:36)
	at org.apache.solr.cloud.ZkController.getCollectionTerms(ZkController.java:1791)
	at org.apache.solr.cloud.ZkController.register(ZkController.java:1279)
	at org.apache.solr.cloud.ZkController$RegisterCoreAsync.call(ZkController.java:273)
	at java.base/java.util.concurrent.FutureTask.run(FutureTask.java:317)
	at org.apache.solr.common.util.ExecutorUtil$MDCAwareThreadPoolExecutor.lambda$execute$0(ExecutorUtil.java:380)
	at java.base/java.util.concurrent.ThreadPoolExecutor.runWorker(ThreadPoolExecutor.java:1144)
	at java.base/java.util.concurrent.ThreadPoolExecutor$Worker.run(ThreadPoolExecutor.java:642)
	at java.base/java.lang.Thread.run(Thread.java:1583)
Caused by: java.lang.Exception: Submitter stack trace
	at org.apache.solr.common.util.ExecutorUtil$MDCAwareThreadPoolExecutor.execute(ExecutorUtil.java:347)
	at java.base/java.util.concurrent.AbstractExecutorService.submit(AbstractExecutorService.java:145)
	at org.apache.solr.cloud.ZkController.onReconnect(ZkController.java:487)
	at org.apache.solr.common.cloud.OnReconnect.stateChanged(OnReconnect.java:36)
	at org.apache.curator.framework.state.ConnectionStateManager.lambda$processEvents$0(ConnectionStateManager.java:256)
	at org.apache.curator.framework.listen.MappingListenerManager.lambda$forEach$0(MappingListenerManager.java:82)
	... 4 more
Caused by: java.lang.Exception: Submitter stack trace
	at org.apache.solr.common.util.ExecutorUtil$MDCAwareThreadPoolExecutor.execute(ExecutorUtil.java:347)
	at org.apache.curator.framework.listen.MappingListenerManager.forEach(MappingListenerManager.java:80)
	at org.apache.curator.framework.listen.StandardListenerManager.forEach(StandardListenerManager.java:81)
	at org.apache.curator.framework.state.ConnectionStateManager.processEvents(ConnectionStateManager.java:256)
	at org.apache.curator.framework.state.ConnectionStateManager.access$000(ConnectionStateManager.java:43)
	at org.apache.curator.framework.state.ConnectionStateManager$1.call(ConnectionStateManager.java:130)
	at java.base/java.util.concurrent.FutureTask.run(FutureTask.java:317)
	... 3 more

 expected null, but was:<ObjectTracker found 2 object(s) that were not released!!! [ZkShardTerms, ZkCollectionTerms]
org.apache.solr.cloud.ZkShardTerms:org.apache.solr.common.util.ObjectReleaseTracker$ObjectTrackerException: org.apache.solr.cloud.ZkShardTerms
	at org.apache.solr.common.util.ObjectReleaseTracker.track(ObjectReleaseTracker.java:54)
	at org.apache.solr.cloud.ZkShardTerms.<init>(ZkShardTerms.java:107)
	at org.apache.solr.cloud.ZkCollectionTerms.getShard(ZkCollectionTerms.java:42)
	at org.apache.solr.cloud.ZkCollectionTerms.register(ZkCollectionTerms.java:49)
	at org.apache.solr.cloud.ZkController.register(ZkController.java:1279)
	at org.apache.solr.cloud.ZkController$RegisterCoreAsync.call(ZkController.java:273)
	at java.base/java.util.concurrent.FutureTask.run(FutureTask.java:317)
	at org.apache.solr.common.util.ExecutorUtil$MDCAwareThreadPoolExecutor.lambda$execute$0(ExecutorUtil.java:380)
	at java.base/java.util.concurrent.ThreadPoolExecutor.runWorker(ThreadPoolExecutor.java:1144)
	at java.base/java.util.concurrent.ThreadPoolExecutor$Worker.run(ThreadPoolExecutor.java:642)
	at java.base/java.lang.Thread.run(Thread.java:1583)
Caused by: java.lang.Exception: Submitter stack trace
	at org.apache.solr.common.util.ExecutorUtil$MDCAwareThreadPoolExecutor.execute(ExecutorUtil.java:347)
	at java.base/java.util.concurrent.AbstractExecutorService.submit(AbstractExecutorService.java:145)
	at org.apache.solr.cloud.ZkController.onReconnect(ZkController.java:487)
	at org.apache.solr.common.cloud.OnReconnect.stateChanged(OnReconnect.java:36)
	at org.apache.curator.framework.state.ConnectionStateManager.lambda$processEvents$0(ConnectionStateManager.java:256)
	at org.apache.curator.framework.listen.MappingListenerManager.lambda$forEach$0(MappingListenerManager.java:82)
	... 4 more
Caused by: java.lang.Exception: Submitter stack trace
	at org.apache.solr.common.util.ExecutorUtil$MDCAwareThreadPoolExecutor.execute(ExecutorUtil.java:347)
	at org.apache.curator.framework.listen.MappingListenerManager.forEach(MappingListenerManager.java:80)
	at org.apache.curator.framework.listen.StandardListenerManager.forEach(StandardListenerManager.java:81)
	at org.apache.curator.framework.state.ConnectionStateManager.processEvents(ConnectionStateManager.java:256)
	at org.apache.curator.framework.state.ConnectionStateManager.access$000(ConnectionStateManager.java:43)
	at org.apache.curator.framework.state.ConnectionStateManager$1.call(ConnectionStateManager.java:130)
	at java.base/java.util.concurrent.FutureTask.run(FutureTask.java:317)
	... 3 more

org.apache.solr.cloud.ZkCollectionTerms:org.apache.solr.common.util.ObjectReleaseTracker$ObjectTrackerException: org.apache.solr.cloud.ZkCollectionTerms
	at org.apache.solr.common.util.ObjectReleaseTracker.track(ObjectReleaseTracker.java:54)
	at org.apache.solr.cloud.ZkCollectionTerms.<init>(ZkCollectionTerms.java:36)
	at org.apache.solr.cloud.ZkController.getCollectionTerms(ZkController.java:1791)
	at org.apache.solr.cloud.ZkController.register(ZkController.java:1279)
	at org.apache.solr.cloud.ZkController$RegisterCoreAsync.call(ZkController.java:273)
	at java.base/java.util.concurrent.FutureTask.run(FutureTask.java:317)
	at org.apache.solr.common.util.ExecutorUtil$MDCAwareThreadPoolExecutor.lambda$execute$0(ExecutorUtil.java:380)
	at java.base/java.util.concurrent.ThreadPoolExecutor.runWorker(ThreadPoolExecutor.java:1144)
	at java.base/java.util.concurrent.ThreadPoolExecutor$Worker.run(ThreadPoolExecutor.java:642)
	at java.base/java.lang.Thread.run(Thread.java:1583)
Caused by: java.lang.Exception: Submitter stack trace
	at org.apache.solr.common.util.ExecutorUtil$MDCAwareThreadPoolExecutor.execute(ExecutorUtil.java:347)
	at java.base/java.util.concurrent.AbstractExecutorService.submit(AbstractExecutorService.java:145)
	at org.apache.solr.cloud.ZkController.onReconnect(ZkController.java:487)
	at org.apache.solr.common.cloud.OnReconnect.stateChanged(OnReconnect.java:36)
	at org.apache.curator.framework.state.ConnectionStateManager.lambda$processEvents$0(ConnectionStateManager.java:256)
	at org.apache.curator.framework.listen.MappingListenerManager.lambda$forEach$0(MappingListenerManager.java:82)
	... 4 more
Caused by: java.lang.Exception: Submitter stack trace
	at org.apache.solr.common.util.ExecutorUtil$MDCAwareThreadPoolExecutor.execute(ExecutorUtil.java:347)
	at org.apache.curator.framework.listen.MappingListenerManager.forEach(MappingListenerManager.java:80)
	at org.apache.curator.framework.listen.StandardListenerManager.forEach(StandardListenerManager.java:81)
	at org.apache.curator.framework.state.ConnectionStateManager.processEvents(ConnectionStateManager.java:256)
	at org.apache.curator.framework.state.ConnectionStateManager.access$000(ConnectionStateManager.java:43)
	at org.apache.curator.framework.state.ConnectionStateManager$1.call(ConnectionStateManager.java:130)
	at java.base/java.util.concurrent.FutureTask.run(FutureTask.java:317)
	... 3 more

>

Stack Trace:
java.lang.AssertionError: ObjectTracker found 2 object(s) that were not released!!! [ZkShardTerms, ZkCollectionTerms]
org.apache.solr.cloud.ZkShardTerms:org.apache.solr.common.util.ObjectReleaseTracker$ObjectTrackerException: org.apache.solr.cloud.ZkShardTerms
	at org.apache.solr.common.util.ObjectReleaseTracker.track(ObjectReleaseTracker.java:54)
	at org.apache.solr.cloud.ZkShardTerms.<init>(ZkShardTerms.java:107)
	at org.apache.solr.cloud.ZkCollectionTerms.getShard(ZkCollectionTerms.java:42)
	at org.apache.solr.cloud.ZkCollectionTerms.register(ZkCollectionTerms.java:49)
	at org.apache.solr.cloud.ZkController.register(ZkController.java:1279)
	at org.apache.solr.cloud.ZkController$RegisterCoreAsync.call(ZkController.java:273)
	at java.base/java.util.concurrent.FutureTask.run(FutureTask.java:317)
	at org.apache.solr.common.util.ExecutorUtil$MDCAwareThreadPoolExecutor.lambda$execute$0(ExecutorUtil.java:380)
	at java.base/java.util.concurrent.ThreadPoolExecutor.runWorker(ThreadPoolExecutor.java:1144)
	at java.base/java.util.concurrent.ThreadPoolExecutor$Worker.run(ThreadPoolExecutor.java:642)
	at java.base/java.lang.Thread.run(Thread.java:1583)
Caused by: java.lang.Exception: Submitter stack trace
	at org.apache.solr.common.util.ExecutorUtil$MDCAwareThreadPoolExecutor.execute(ExecutorUtil.java:347)
	at java.base/java.util.concurrent.AbstractExecutorService.submit(AbstractExecutorService.java:145)
	at org.apache.solr.cloud.ZkController.onReconnect(ZkController.java:487)
	at org.apache.solr.common.cloud.OnReconnect.stateChanged(OnReconnect.java:36)
	at org.apache.curator.framework.state.ConnectionStateManager.lambda$processEvents$0(ConnectionStateManager.java:256)
	at org.apache.curator.framework.listen.MappingListenerManager.lambda$forEach$0(MappingListenerManager.java:82)
	... 4 more
Caused by: java.lang.Exception: Submitter stack trace
	at org.apache.solr.common.util.ExecutorUtil$MDCAwareThreadPoolExecutor.execute(ExecutorUtil.java:347)
	at org.apache.curator.framework.listen.MappingListenerManager.forEach(MappingListenerManager.java:80)
	at org.apache.curator.framework.listen.StandardListenerManager.forEach(StandardListenerManager.java:81)
	at org.apache.curator.framework.state.ConnectionStateManager.processEvents(ConnectionStateManager.java:256)
	at org.apache.curator.framework.state.ConnectionStateManager.access$000(ConnectionStateManager.java:43)
	at org.apache.curator.framework.state.ConnectionStateManager$1.call(ConnectionStateManager.java:130)
	at java.base/java.util.concurrent.FutureTask.run(FutureTask.java:317)
	... 3 more

org.apache.solr.cloud.ZkCollectionTerms:org.apache.solr.common.util.ObjectReleaseTracker$ObjectTrackerException: org.apache.solr.cloud.ZkCollectionTerms
	at org.apache.solr.common.util.ObjectReleaseTracker.track(ObjectReleaseTracker.java:54)
	at org.apache.solr.cloud.ZkCollectionTerms.<init>(ZkCollectionTerms.java:36)
	at org.apache.solr.cloud.ZkController.getCollectionTerms(ZkController.java:1791)
	at org.apache.solr.cloud.ZkController.register(ZkController.java:1279)
	at org.apache.solr.cloud.ZkController$RegisterCoreAsync.call(ZkController.java:273)
	at java.base/java.util.concurrent.FutureTask.run(FutureTask.java:317)
	at org.apache.solr.common.util.ExecutorUtil$MDCAwareThreadPoolExecutor.lambda$execute$0(ExecutorUtil.java:380)
	at java.base/java.util.concurrent.ThreadPoolExecutor.runWorker(ThreadPoolExecutor.java:1144)
	at java.base/java.util.concurrent.ThreadPoolExecutor$Worker.run(ThreadPoolExecutor.java:642)
	at java.base/java.lang.Thread.run(Thread.java:1583)
Caused by: java.lang.Exception: Submitter stack trace
	at org.apache.solr.common.util.ExecutorUtil$MDCAwareThreadPoolExecutor.execute(ExecutorUtil.java:347)
	at java.base/java.util.concurrent.AbstractExecutorService.submit(AbstractExecutorService.java:145)
	at org.apache.solr.cloud.ZkController.onReconnect(ZkController.java:487)
	at org.apache.solr.common.cloud.OnReconnect.stateChanged(OnReconnect.java:36)
	at org.apache.curator.framework.state.ConnectionStateManager.lambda$processEvents$0(ConnectionStateManager.java:256)
	at org.apache.curator.framework.listen.MappingListenerManager.lambda$forEach$0(MappingListenerManager.java:82)
	... 4 more
Caused by: java.lang.Exception: Submitter stack trace
	at org.apache.solr.common.util.ExecutorUtil$MDCAwareThreadPoolExecutor.execute(ExecutorUtil.java:347)
	at org.apache.curator.framework.listen.MappingListenerManager.forEach(MappingListenerManager.java:80)
	at org.apache.curator.framework.listen.StandardListenerManager.forEach(StandardListenerManager.java:81)
	at org.apache.curator.framework.state.ConnectionStateManager.processEvents(ConnectionStateManager.java:256)
	at org.apache.curator.framework.state.ConnectionStateManager.access$000(ConnectionStateManager.java:43)
	at org.apache.curator.framework.state.ConnectionStateManager$1.call(ConnectionStateManager.java:130)
	at java.base/java.util.concurrent.FutureTask.run(FutureTask.java:317)
	... 3 more

 expected null, but was:<ObjectTracker found 2 object(s) that were not released!!! [ZkShardTerms, ZkCollectionTerms]
org.apache.solr.cloud.ZkShardTerms:org.apache.solr.common.util.ObjectReleaseTracker$ObjectTrackerException: org.apache.solr.cloud.ZkShardTerms
	at org.apache.solr.common.util.ObjectReleaseTracker.track(ObjectReleaseTracker.java:54)
	at org.apache.solr.cloud.ZkShardTerms.<init>(ZkShardTerms.java:107)
	at org.apache.solr.cloud.ZkCollectionTerms.getShard(ZkCollectionTerms.java:42)
	at org.apache.solr.cloud.ZkCollectionTerms.register(ZkCollectionTerms.java:49)
	at org.apache.solr.cloud.ZkController.register(ZkController.java:1279)
	at org.apache.solr.cloud.ZkController$RegisterCoreAsync.call(ZkController.java:273)
	at java.base/java.util.concurrent.FutureTask.run(FutureTask.java:317)
	at org.apache.solr.common.util.ExecutorUtil$MDCAwareThreadPoolExecutor.lambda$execute$0(ExecutorUtil.java:380)
	at java.base/java.util.concurrent.ThreadPoolExecutor.runWorker(ThreadPoolExecutor.java:1144)
	at java.base/java.util.concurrent.ThreadPoolExecutor$Worker.run(ThreadPoolExecutor.java:642)
	at java.base/java.lang.Thread.run(Thread.java:1583)
Caused by: java.lang.Exception: Submitter stack trace
	at org.apache.solr.common.util.ExecutorUtil$MDCAwareThreadPoolExecutor.execute(ExecutorUtil.java:347)
	at java.base/java.util.concurrent.AbstractExecutorService.submit(AbstractExecutorService.java:145)
	at org.apache.solr.cloud.ZkController.onReconnect(ZkController.java:487)
	at org.apache.solr.common.cloud.OnReconnect.stateChanged(OnReconnect.java:36)
	at org.apache.curator.framework.state.ConnectionStateManager.lambda$processEvents$0(ConnectionStateManager.java:256)
	at org.apache.curator.framework.listen.MappingListenerManager.lambda$forEach$0(MappingListenerManager.java:82)
	... 4 more
Caused by: java.lang.Exception: Submitter stack trace
	at org.apache.solr.common.util.ExecutorUtil$MDCAwareThreadPoolExecutor.execute(ExecutorUtil.java:347)
	at org.apache.curator.framework.listen.MappingListenerManager.forEach(MappingListenerManager.java:80)
	at org.apache.curator.framework.listen.StandardListenerManager.forEach(StandardListenerManager.java:81)
	at org.apache.curator.framework.state.ConnectionStateManager.processEvents(ConnectionStateManager.java:256)
	at org.apache.curator.framework.state.ConnectionStateManager.access$000(ConnectionStateManager.java:43)
	at org.apache.curator.framework.state.ConnectionStateManager$1.call(ConnectionStateManager.java:130)
	at java.base/java.util.concurrent.FutureTask.run(FutureTask.java:317)
	... 3 more

org.apache.solr.cloud.ZkCollectionTerms:org.apache.solr.common.util.ObjectReleaseTracker$ObjectTrackerException: org.apache.solr.cloud.ZkCollectionTerms
	at org.apache.solr.common.util.ObjectReleaseTracker.track(ObjectReleaseTracker.java:54)
	at org.apache.solr.cloud.ZkCollectionTerms.<init>(ZkCollectionTerms.java:36)
	at org.apache.solr.cloud.ZkController.getCollectionTerms(ZkController.java:1791)
	at org.apache.solr.cloud.ZkController.register(ZkController.java:1279)
	at org.apache.solr.cloud.ZkController$RegisterCoreAsync.call(ZkController.java:273)
	at java.base/java.util.concurrent.FutureTask.run(FutureTask.java:317)
	at org.apache.solr.common.util.ExecutorUtil$MDCAwareThreadPoolExecutor.lambda$execute$0(ExecutorUtil.java:380)
	at java.base/java.util.concurrent.ThreadPoolExecutor.runWorker(ThreadPoolExecutor.java:1144)
	at java.base/java.util.concurrent.ThreadPoolExecutor$Worker.run(ThreadPoolExecutor.java:642)
	at java.base/java.lang.Thread.run(Thread.java:1583)
Caused by: java.lang.Exception: Submitter stack trace
	at org.apache.solr.common.util.ExecutorUtil$MDCAwareThreadPoolExecutor.execute(ExecutorUtil.java:347)
	at java.base/java.util.concurrent.AbstractExecutorService.submit(AbstractExecutorService.java:145)
	at org.apache.solr.cloud.ZkController.onReconnect(ZkController.java:487)
	at org.apache.solr.common.cloud.OnReconnect.stateChanged(OnReconnect.java:36)
	at org.apache.curator.framework.state.ConnectionStateManager.lambda$processEvents$0(ConnectionStateManager.java:256)
	at org.apache.curator.framework.listen.MappingListenerManager.lambda$forEach$0(MappingListenerManager.java:82)
	... 4 more
Caused by: java.lang.Exception: Submitter stack trace
	at org.apache.solr.common.util.ExecutorUtil$MDCAwareThreadPoolExecutor.execute(ExecutorUtil.java:347)
	at org.apache.curator.framework.listen.MappingListenerManager.forEach(MappingListenerManager.java:80)
	at org.apache.curator.framework.listen.StandardListenerManager.forEach(StandardListenerManager.java:81)
	at org.apache.curator.framework.state.ConnectionStateManager.processEvents(ConnectionStateManager.java:256)
	at org.apache.curator.framework.state.ConnectionStateManager.access$000(ConnectionStateManager.java:43)
	at org.apache.curator.framework.state.ConnectionStateManager$1.call(ConnectionStateManager.java:130)
	at java.base/java.util.concurrent.FutureTask.run(FutureTask.java:317)
	... 3 more

>
	at __randomizedtesting.SeedInfo.seed([9A2C4E350779A98]:0)
	at org.junit.Assert.fail(Assert.java:89)
	at org.junit.Assert.failNotNull(Assert.java:756)
	at org.junit.Assert.assertNull(Assert.java:738)
	at org.apache.solr.SolrTestCase$1.afterIfSuccessful(SolrTestCase.java:100)
	at com.carrotsearch.randomizedtesting.rules.StatementAdapter.evaluate(StatementAdapter.java:37)
	at com.carrotsearch.randomizedtesting.rules.StatementAdapter.evaluate(StatementAdapter.java:36)
	at org.apache.lucene.tests.util.AbstractBeforeAfterRule$1.evaluate(AbstractBeforeAfterRule.java:43)
	at com.carrotsearch.randomizedtesting.rules.SystemPropertiesRestoreRule$1.evaluate(SystemPropertiesRestoreRule.java:80)
	at org.junit.rules.RunRules.evaluate(RunRules.java:20)
	at org.apache.lucene.tests.util.AbstractBeforeAfterRule$1.evaluate(AbstractBeforeAfterRule.java:43)
	at com.carrotsearch.randomizedtesting.rules.StatementAdapter.evaluate(StatementAdapter.java:36)
	at org.apache.lucene.tests.util.TestRuleStoreClassName$1.evaluate(TestRuleStoreClassName.java:38)
	at com.carrotsearch.randomizedtesting.rules.NoShadowingOrOverridesOnMethodsRule$1.evaluate(NoShadowingOrOverridesOnMethodsRule.java:40)
	at com.carrotsearch.randomizedtesting.rules.NoShadowingOrOverridesOnMethodsRule$1.evaluate(NoShadowingOrOverridesOnMethodsRule.java:40)
	at com.carrotsearch.randomizedtesting.rules.StatementAdapter.evaluate(StatementAdapter.java:36)
	at com.carrotsearch.randomizedtesting.rules.StatementAdapter.evaluate(StatementAdapter.java:36)
	at org.apache.lucene.tests.util.TestRuleAssertionsRequired$1.evaluate(TestRuleAssertionsRequired.java:53)
	at org.apache.lucene.tests.util.AbstractBeforeAfterRule$1.evaluate(AbstractBeforeAfterRule.java:43)
	at org.apache.lucene.tests.util.TestRuleMarkFailure$1.evaluate(TestRuleMarkFailure.java:44)
	at org.apache.lucene.tests.util.TestRuleIgnoreAfterMaxFailures$1.evaluate(TestRuleIgnoreAfterMaxFailures.java:60)
	at org.apache.lucene.tests.util.TestRuleIgnoreTestSuites$1.evaluate(TestRuleIgnoreTestSuites.java:47)
	at org.junit.rules.RunRules.evaluate(RunRules.java:20)
	at com.carrotsearch.randomizedtesting.rules.StatementAdapter.evaluate(StatementAdapter.java:36)
	at com.carrotsearch.randomizedtesting.ThreadLeakControl$StatementRunner.run(ThreadLeakControl.java:390)
	at com.carrotsearch.randomizedtesting.ThreadLeakControl.lambda$forkTimeoutingTask$0(ThreadLeakControl.java:850)
	at java.base/java.lang.Thread.run(Thread.java:1583)


FAILED:  org.apache.solr.hdfs.cloud.HdfsBasicDistributedZk2Test.classMethod

Error Message:
java.lang.AssertionError: ObjectTracker found 2 object(s) that were not released!!! [ZkShardTerms, ZkCollectionTerms]
org.apache.solr.cloud.ZkShardTerms:org.apache.solr.common.util.ObjectReleaseTracker$ObjectTrackerException: org.apache.solr.cloud.ZkShardTerms
	at org.apache.solr.common.util.ObjectReleaseTracker.track(ObjectReleaseTracker.java:54)
	at org.apache.solr.cloud.ZkShardTerms.<init>(ZkShardTerms.java:107)
	at org.apache.solr.cloud.ZkCollectionTerms.getShard(ZkCollectionTerms.java:42)
	at org.apache.solr.cloud.ZkCollectionTerms.register(ZkCollectionTerms.java:49)
	at org.apache.solr.cloud.ZkController.register(ZkController.java:1279)
	at org.apache.solr.cloud.ZkController$RegisterCoreAsync.call(ZkController.java:273)
	at java.base/java.util.concurrent.FutureTask.run(FutureTask.java:317)
	at org.apache.solr.common.util.ExecutorUtil$MDCAwareThreadPoolExecutor.lambda$execute$0(ExecutorUtil.java:380)
	at java.base/java.util.concurrent.ThreadPoolExecutor.runWorker(ThreadPoolExecutor.java:1144)
	at java.base/java.util.concurrent.ThreadPoolExecutor$Worker.run(ThreadPoolExecutor.java:642)
	at java.base/java.lang.Thread.run(Thread.java:1583)
Caused by: java.lang.Exception: Submitter stack trace
	at org.apache.solr.common.util.ExecutorUtil$MDCAwareThreadPoolExecutor.execute(ExecutorUtil.java:347)
	at java.base/java.util.concurrent.AbstractExecutorService.submit(AbstractExecutorService.java:145)
	at org.apache.solr.cloud.ZkController.onReconnect(ZkController.java:487)
	at org.apache.solr.common.cloud.OnReconnect.stateChanged(OnReconnect.java:36)
	at org.apache.curator.framework.state.ConnectionStateManager.lambda$processEvents$0(ConnectionStateManager.java:256)
	at org.apache.curator.framework.listen.MappingListenerManager.lambda$forEach$0(MappingListenerManager.java:82)
	... 4 more
Caused by: java.lang.Exception: Submitter stack trace
	at org.apache.solr.common.util.ExecutorUtil$MDCAwareThreadPoolExecutor.execute(ExecutorUtil.java:347)
	at org.apache.curator.framework.listen.MappingListenerManager.forEach(MappingListenerManager.java:80)
	at org.apache.curator.framework.listen.StandardListenerManager.forEach(StandardListenerManager.java:81)
	at org.apache.curator.framework.state.ConnectionStateManager.processEvents(ConnectionStateManager.java:256)
	at org.apache.curator.framework.state.ConnectionStateManager.access$000(ConnectionStateManager.java:43)
	at org.apache.curator.framework.state.ConnectionStateManager$1.call(ConnectionStateManager.java:130)
	at java.base/java.util.concurrent.FutureTask.run(FutureTask.java:317)
	... 3 more

org.apache.solr.cloud.ZkCollectionTerms:org.apache.solr.common.util.ObjectReleaseTracker$ObjectTrackerException: org.apache.solr.cloud.ZkCollectionTerms
	at org.apache.solr.common.util.ObjectReleaseTracker.track(ObjectReleaseTracker.java:54)
	at org.apache.solr.cloud.ZkCollectionTerms.<init>(ZkCollectionTerms.java:36)
	at org.apache.solr.cloud.ZkController.getCollectionTerms(ZkController.java:1791)
	at org.apache.solr.cloud.ZkController.register(ZkController.java:1279)
	at org.apache.solr.cloud.ZkController$RegisterCoreAsync.call(ZkController.java:273)
	at java.base/java.util.concurrent.FutureTask.run(FutureTask.java:317)
	at org.apache.solr.common.util.ExecutorUtil$MDCAwareThreadPoolExecutor.lambda$execute$0(ExecutorUtil.java:380)
	at java.base/java.util.concurrent.ThreadPoolExecutor.runWorker(ThreadPoolExecutor.java:1144)
	at java.base/java.util.concurrent.ThreadPoolExecutor$Worker.run(ThreadPoolExecutor.java:642)
	at java.base/java.lang.Thread.run(Thread.java:1583)
Caused by: java.lang.Exception: Submitter stack trace
	at org.apache.solr.common.util.ExecutorUtil$MDCAwareThreadPoolExecutor.execute(ExecutorUtil.java:347)
	at java.base/java.util.concurrent.AbstractExecutorService.submit(AbstractExecutorService.java:145)
	at org.apache.solr.cloud.ZkController.onReconnect(ZkController.java:487)
	at org.apache.solr.common.cloud.OnReconnect.stateChanged(OnReconnect.java:36)
	at org.apache.curator.framework.state.ConnectionStateManager.lambda$processEvents$0(ConnectionStateManager.java:256)
	at org.apache.curator.framework.listen.MappingListenerManager.lambda$forEach$0(MappingListenerManager.java:82)
	... 4 more
Caused by: java.lang.Exception: Submitter stack trace
	at org.apache.solr.common.util.ExecutorUtil$MDCAwareThreadPoolExecutor.execute(ExecutorUtil.java:347)
	at org.apache.curator.framework.listen.MappingListenerManager.forEach(MappingListenerManager.java:80)
	at org.apache.curator.framework.listen.StandardListenerManager.forEach(StandardListenerManager.java:81)
	at org.apache.curator.framework.state.ConnectionStateManager.processEvents(ConnectionStateManager.java:256)
	at org.apache.curator.framework.state.ConnectionStateManager.access$000(ConnectionStateManager.java:43)
	at org.apache.curator.framework.state.ConnectionStateManager$1.call(ConnectionStateManager.java:130)
	at java.base/java.util.concurrent.FutureTask.run(FutureTask.java:317)
	... 3 more

 expected null, but was:<ObjectTracker found 2 object(s) that were not released!!! [ZkShardTerms, ZkCollectionTerms]
org.apache.solr.cloud.ZkShardTerms:org.apache.solr.common.util.ObjectReleaseTracker$ObjectTrackerException: org.apache.solr.cloud.ZkShardTerms
	at org.apache.solr.common.util.ObjectReleaseTracker.track(ObjectReleaseTracker.java:54)
	at org.apache.solr.cloud.ZkShardTerms.<init>(ZkShardTerms.java:107)
	at org.apache.solr.cloud.ZkCollectionTerms.getShard(ZkCollectionTerms.java:42)
	at org.apache.solr.cloud.ZkCollectionTerms.register(ZkCollectionTerms.java:49)
	at org.apache.solr.cloud.ZkController.register(ZkController.java:1279)
	at org.apache.solr.cloud.ZkController$RegisterCoreAsync.call(ZkController.java:273)
	at java.base/java.util.concurrent.FutureTask.run(FutureTask.java:317)
	at org.apache.solr.common.util.ExecutorUtil$MDCAwareThreadPoolExecutor.lambda$execute$0(ExecutorUtil.java:380)
	at java.base/java.util.concurrent.ThreadPoolExecutor.runWorker(ThreadPoolExecutor.java:1144)
	at java.base/java.util.concurrent.ThreadPoolExecutor$Worker.run(ThreadPoolExecutor.java:642)
	at java.base/java.lang.Thread.run(Thread.java:1583)
Caused by: java.lang.Exception: Submitter stack trace
	at org.apache.solr.common.util.ExecutorUtil$MDCAwareThreadPoolExecutor.execute(ExecutorUtil.java:347)
	at java.base/java.util.concurrent.AbstractExecutorService.submit(AbstractExecutorService.java:145)
	at org.apache.solr.cloud.ZkController.onReconnect(ZkController.java:487)
	at org.apache.solr.common.cloud.OnReconnect.stateChanged(OnReconnect.java:36)
	at org.apache.curator.framework.state.ConnectionStateManager.lambda$processEvents$0(ConnectionStateManager.java:256)
	at org.apache.curator.framework.listen.MappingListenerManager.lambda$forEach$0(MappingListenerManager.java:82)
	... 4 more
Caused by: java.lang.Exception: Submitter stack trace
	at org.apache.solr.common.util.ExecutorUtil$MDCAwareThreadPoolExecutor.execute(ExecutorUtil.java:347)
	at org.apache.curator.framework.listen.MappingListenerManager.forEach(MappingListenerManager.java:80)
	at org.apache.curator.framework.listen.StandardListenerManager.forEach(StandardListenerManager.java:81)
	at org.apache.curator.framework.state.ConnectionStateManager.processEvents(ConnectionStateManager.java:256)
	at org.apache.curator.framework.state.ConnectionStateManager.access$000(ConnectionStateManager.java:43)
	at org.apache.curator.framework.state.ConnectionStateManager$1.call(ConnectionStateManager.java:130)
	at java.base/java.util.concurrent.FutureTask.run(FutureTask.java:317)
	... 3 more

org.apache.solr.cloud.ZkCollectionTerms:org.apache.solr.common.util.ObjectReleaseTracker$ObjectTrackerException: org.apache.solr.cloud.ZkCollectionTerms
	at org.apache.solr.common.util.ObjectReleaseTracker.track(ObjectReleaseTracker.java:54)
	at org.apache.solr.cloud.ZkCollectionTerms.<init>(ZkCollectionTerms.java:36)
	at org.apache.solr.cloud.ZkController.getCollectionTerms(ZkController.java:1791)
	at org.apache.solr.cloud.ZkController.register(ZkController.java:1279)
	at org.apache.solr.cloud.ZkController$RegisterCoreAsync.call(ZkController.java:273)
	at java.base/java.util.concurrent.FutureTask.run(FutureTask.java:317)
	at org.apache.solr.common.util.ExecutorUtil$MDCAwareThreadPoolExecutor.lambda$execute$0(ExecutorUtil.java:380)
	at java.base/java.util.concurrent.ThreadPoolExecutor.runWorker(ThreadPoolExecutor.java:1144)
	at java.base/java.util.concurrent.ThreadPoolExecutor$Worker.run(ThreadPoolExecutor.java:642)
	at java.base/java.lang.Thread.run(Thread.java:1583)
Caused by: java.lang.Exception: Submitter stack trace
	at org.apache.solr.common.util.ExecutorUtil$MDCAwareThreadPoolExecutor.execute(ExecutorUtil.java:347)
	at java.base/java.util.concurrent.AbstractExecutorService.submit(AbstractExecutorService.java:145)
	at org.apache.solr.cloud.ZkController.onReconnect(ZkController.java:487)
	at org.apache.solr.common.cloud.OnReconnect.stateChanged(OnReconnect.java:36)
	at org.apache.curator.framework.state.ConnectionStateManager.lambda$processEvents$0(ConnectionStateManager.java:256)
	at org.apache.curator.framework.listen.MappingListenerManager.lambda$forEach$0(MappingListenerManager.java:82)
	... 4 more
Caused by: java.lang.Exception: Submitter stack trace
	at org.apache.solr.common.util.ExecutorUtil$MDCAwareThreadPoolExecutor.execute(ExecutorUtil.java:347)
	at org.apache.curator.framework.listen.MappingListenerManager.forEach(MappingListenerManager.java:80)
	at org.apache.curator.framework.listen.StandardListenerManager.forEach(StandardListenerManager.java:81)
	at org.apache.curator.framework.state.ConnectionStateManager.processEvents(ConnectionStateManager.java:256)
	at org.apache.curator.framework.state.ConnectionStateManager.access$000(ConnectionStateManager.java:43)
	at org.apache.curator.framework.state.ConnectionStateManager$1.call(ConnectionStateManager.java:130)
	at java.base/java.util.concurrent.FutureTask.run(FutureTask.java:317)
	... 3 more

>

Stack Trace:
java.lang.AssertionError: ObjectTracker found 2 object(s) that were not released!!! [ZkShardTerms, ZkCollectionTerms]
org.apache.solr.cloud.ZkShardTerms:org.apache.solr.common.util.ObjectReleaseTracker$ObjectTrackerException: org.apache.solr.cloud.ZkShardTerms
	at org.apache.solr.common.util.ObjectReleaseTracker.track(ObjectReleaseTracker.java:54)
	at org.apache.solr.cloud.ZkShardTerms.<init>(ZkShardTerms.java:107)
	at org.apache.solr.cloud.ZkCollectionTerms.getShard(ZkCollectionTerms.java:42)
	at org.apache.solr.cloud.ZkCollectionTerms.register(ZkCollectionTerms.java:49)
	at org.apache.solr.cloud.ZkController.register(ZkController.java:1279)
	at org.apache.solr.cloud.ZkController$RegisterCoreAsync.call(ZkController.java:273)
	at java.base/java.util.concurrent.FutureTask.run(FutureTask.java:317)
	at org.apache.solr.common.util.ExecutorUtil$MDCAwareThreadPoolExecutor.lambda$execute$0(ExecutorUtil.java:380)
	at java.base/java.util.concurrent.ThreadPoolExecutor.runWorker(ThreadPoolExecutor.java:1144)
	at java.base/java.util.concurrent.ThreadPoolExecutor$Worker.run(ThreadPoolExecutor.java:642)
	at java.base/java.lang.Thread.run(Thread.java:1583)
Caused by: java.lang.Exception: Submitter stack trace
	at org.apache.solr.common.util.ExecutorUtil$MDCAwareThreadPoolExecutor.execute(ExecutorUtil.java:347)
	at java.base/java.util.concurrent.AbstractExecutorService.submit(AbstractExecutorService.java:145)
	at org.apache.solr.cloud.ZkController.onReconnect(ZkController.java:487)
	at org.apache.solr.common.cloud.OnReconnect.stateChanged(OnReconnect.java:36)
	at org.apache.curator.framework.state.ConnectionStateManager.lambda$processEvents$0(ConnectionStateManager.java:256)
	at org.apache.curator.framework.listen.MappingListenerManager.lambda$forEach$0(MappingListenerManager.java:82)
	... 4 more
Caused by: java.lang.Exception: Submitter stack trace
	at org.apache.solr.common.util.ExecutorUtil$MDCAwareThreadPoolExecutor.execute(ExecutorUtil.java:347)
	at org.apache.curator.framework.listen.MappingListenerManager.forEach(MappingListenerManager.java:80)
	at org.apache.curator.framework.listen.StandardListenerManager.forEach(StandardListenerManager.java:81)
	at org.apache.curator.framework.state.ConnectionStateManager.processEvents(ConnectionStateManager.java:256)
	at org.apache.curator.framework.state.ConnectionStateManager.access$000(ConnectionStateManager.java:43)
	at org.apache.curator.framework.state.ConnectionStateManager$1.call(ConnectionStateManager.java:130)
	at java.base/java.util.concurrent.FutureTask.run(FutureTask.java:317)
	... 3 more

org.apache.solr.cloud.ZkCollectionTerms:org.apache.solr.common.util.ObjectReleaseTracker$ObjectTrackerException: org.apache.solr.cloud.ZkCollectionTerms
	at org.apache.solr.common.util.ObjectReleaseTracker.track(ObjectReleaseTracker.java:54)
	at org.apache.solr.cloud.ZkCollectionTerms.<init>(ZkCollectionTerms.java:36)
	at org.apache.solr.cloud.ZkController.getCollectionTerms(ZkController.java:1791)
	at org.apache.solr.cloud.ZkController.register(ZkController.java:1279)
	at org.apache.solr.cloud.ZkController$RegisterCoreAsync.call(ZkController.java:273)
	at java.base/java.util.concurrent.FutureTask.run(FutureTask.java:317)
	at org.apache.solr.common.util.ExecutorUtil$MDCAwareThreadPoolExecutor.lambda$execute$0(ExecutorUtil.java:380)
	at java.base/java.util.concurrent.ThreadPoolExecutor.runWorker(ThreadPoolExecutor.java:1144)
	at java.base/java.util.concurrent.ThreadPoolExecutor$Worker.run(ThreadPoolExecutor.java:642)
	at java.base/java.lang.Thread.run(Thread.java:1583)
Caused by: java.lang.Exception: Submitter stack trace
	at org.apache.solr.common.util.ExecutorUtil$MDCAwareThreadPoolExecutor.execute(ExecutorUtil.java:347)
	at java.base/java.util.concurrent.AbstractExecutorService.submit(AbstractExecutorService.java:145)
	at org.apache.solr.cloud.ZkController.onReconnect(ZkController.java:487)
	at org.apache.solr.common.cloud.OnReconnect.stateChanged(OnReconnect.java:36)
	at org.apache.curator.framework.state.ConnectionStateManager.lambda$processEvents$0(ConnectionStateManager.java:256)
	at org.apache.curator.framework.listen.MappingListenerManager.lambda$forEach$0(MappingListenerManager.java:82)
	... 4 more
Caused by: java.lang.Exception: Submitter stack trace
	at org.apache.solr.common.util.ExecutorUtil$MDCAwareThreadPoolExecutor.execute(ExecutorUtil.java:347)
	at org.apache.curator.framework.listen.MappingListenerManager.forEach(MappingListenerManager.java:80)
	at org.apache.curator.framework.listen.StandardListenerManager.forEach(StandardListenerManager.java:81)
	at org.apache.curator.framework.state.ConnectionStateManager.processEvents(ConnectionStateManager.java:256)
	at org.apache.curator.framework.state.ConnectionStateManager.access$000(ConnectionStateManager.java:43)
	at org.apache.curator.framework.state.ConnectionStateManager$1.call(ConnectionStateManager.java:130)
	at java.base/java.util.concurrent.FutureTask.run(FutureTask.java:317)
	... 3 more

 expected null, but was:<ObjectTracker found 2 object(s) that were not released!!! [ZkShardTerms, ZkCollectionTerms]
org.apache.solr.cloud.ZkShardTerms:org.apache.solr.common.util.ObjectReleaseTracker$ObjectTrackerException: org.apache.solr.cloud.ZkShardTerms
	at org.apache.solr.common.util.ObjectReleaseTracker.track(ObjectReleaseTracker.java:54)
	at org.apache.solr.cloud.ZkShardTerms.<init>(ZkShardTerms.java:107)
	at org.apache.solr.cloud.ZkCollectionTerms.getShard(ZkCollectionTerms.java:42)
	at org.apache.solr.cloud.ZkCollectionTerms.register(ZkCollectionTerms.java:49)
	at org.apache.solr.cloud.ZkController.register(ZkController.java:1279)
	at org.apache.solr.cloud.ZkController$RegisterCoreAsync.call(ZkController.java:273)
	at java.base/java.util.concurrent.FutureTask.run(FutureTask.java:317)
	at org.apache.solr.common.util.ExecutorUtil$MDCAwareThreadPoolExecutor.lambda$execute$0(ExecutorUtil.java:380)
	at java.base/java.util.concurrent.ThreadPoolExecutor.runWorker(ThreadPoolExecutor.java:1144)
	at java.base/java.util.concurrent.ThreadPoolExecutor$Worker.run(ThreadPoolExecutor.java:642)
	at java.base/java.lang.Thread.run(Thread.java:1583)
Caused by: java.lang.Exception: Submitter stack trace
	at org.apache.solr.common.util.ExecutorUtil$MDCAwareThreadPoolExecutor.execute(ExecutorUtil.java:347)
	at java.base/java.util.concurrent.AbstractExecutorService.submit(AbstractExecutorService.java:145)
	at org.apache.solr.cloud.ZkController.onReconnect(ZkController.java:487)
	at org.apache.solr.common.cloud.OnReconnect.stateChanged(OnReconnect.java:36)
	at org.apache.curator.framework.state.ConnectionStateManager.lambda$processEvents$0(ConnectionStateManager.java:256)
	at org.apache.curator.framework.listen.MappingListenerManager.lambda$forEach$0(MappingListenerManager.java:82)
	... 4 more
Caused by: java.lang.Exception: Submitter stack trace
	at org.apache.solr.common.util.ExecutorUtil$MDCAwareThreadPoolExecutor.execute(ExecutorUtil.java:347)
	at org.apache.curator.framework.listen.MappingListenerManager.forEach(MappingListenerManager.java:80)
	at org.apache.curator.framework.listen.StandardListenerManager.forEach(StandardListenerManager.java:81)
	at org.apache.curator.framework.state.ConnectionStateManager.processEvents(ConnectionStateManager.java:256)
	at org.apache.curator.framework.state.ConnectionStateManager.access$000(ConnectionStateManager.java:43)
	at org.apache.curator.framework.state.ConnectionStateManager$1.call(ConnectionStateManager.java:130)
	at java.base/java.util.concurrent.FutureTask.run(FutureTask.java:317)
	... 3 more

org.apache.solr.cloud.ZkCollectionTerms:org.apache.solr.common.util.ObjectReleaseTracker$ObjectTrackerException: org.apache.solr.cloud.ZkCollectionTerms
	at org.apache.solr.common.util.ObjectReleaseTracker.track(ObjectReleaseTracker.java:54)
	at org.apache.solr.cloud.ZkCollectionTerms.<init>(ZkCollectionTerms.java:36)
	at org.apache.solr.cloud.ZkController.getCollectionTerms(ZkController.java:1791)
	at org.apache.solr.cloud.ZkController.register(ZkController.java:1279)
	at org.apache.solr.cloud.ZkController$RegisterCoreAsync.call(ZkController.java:273)
	at java.base/java.util.concurrent.FutureTask.run(FutureTask.java:317)
	at org.apache.solr.common.util.ExecutorUtil$MDCAwareThreadPoolExecutor.lambda$execute$0(ExecutorUtil.java:380)
	at java.base/java.util.concurrent.ThreadPoolExecutor.runWorker(ThreadPoolExecutor.java:1144)
	at java.base/java.util.concurrent.ThreadPoolExecutor$Worker.run(ThreadPoolExecutor.java:642)
	at java.base/java.lang.Thread.run(Thread.java:1583)
Caused by: java.lang.Exception: Submitter stack trace
	at org.apache.solr.common.util.ExecutorUtil$MDCAwareThreadPoolExecutor.execute(ExecutorUtil.java:347)
	at java.base/java.util.concurrent.AbstractExecutorService.submit(AbstractExecutorService.java:145)
	at org.apache.solr.cloud.ZkController.onReconnect(ZkController.java:487)
	at org.apache.solr.common.cloud.OnReconnect.stateChanged(OnReconnect.java:36)
	at org.apache.curator.framework.state.ConnectionStateManager.lambda$processEvents$0(ConnectionStateManager.java:256)
	at org.apache.curator.framework.listen.MappingListenerManager.lambda$forEach$0(MappingListenerManager.java:82)
	... 4 more
Caused by: java.lang.Exception: Submitter stack trace
	at org.apache.solr.common.util.ExecutorUtil$MDCAwareThreadPoolExecutor.execute(ExecutorUtil.java:347)
	at org.apache.curator.framework.listen.MappingListenerManager.forEach(MappingListenerManager.java:80)
	at org.apache.curator.framework.listen.StandardListenerManager.forEach(StandardListenerManager.java:81)
	at org.apache.curator.framework.state.ConnectionStateManager.processEvents(ConnectionStateManager.java:256)
	at org.apache.curator.framework.state.ConnectionStateManager.access$000(ConnectionStateManager.java:43)
	at org.apache.curator.framework.state.ConnectionStateManager$1.call(ConnectionStateManager.java:130)
	at java.base/java.util.concurrent.FutureTask.run(FutureTask.java:317)
	... 3 more

>
	at __randomizedtesting.SeedInfo.seed([9A2C4E350779A98]:0)
	at org.junit.Assert.fail(Assert.java:89)
	at org.junit.Assert.failNotNull(Assert.java:756)
	at org.junit.Assert.assertNull(Assert.java:738)
	at org.apache.solr.SolrTestCase$1.afterIfSuccess

[...truncated too long message...]

lr:core)
    Test history: https://ge.apache.org/scans/tests?search.rootProjectNames=solr-root&tests.container=org.apache.solr.handler.TestReplicationHandler&tests.test=testUrlAllowList http://fucit.org/solr-jenkins-reports/history-trend-of-recent-failures.html#series/org.apache.solr.handler.TestReplicationHandler.testUrlAllowList
    Test output: /home/jenkins/jenkins-slave/workspace/Solr/Solr-NightlyTests-main/solr/core/build/test-results/test/outputs/OUTPUT-org.apache.solr.handler.TestReplicationHandler.txt
    Reproduce with: ./gradlew :solr:core:test --tests "org.apache.solr.handler.TestReplicationHandler.testUrlAllowList" -Ptests.jvms=4 -Ptests.haltonfailure=false "-Ptests.jvmargs=-XX:TieredStopAtLevel=1 -XX:+UseParallelGC -XX:ActiveProcessorCount=1 -XX:ReservedCodeCacheSize=120m" -Ptests.seed=9A2C4E350779A98 -Ptests.multiplier=2 -Ptests.nightly=true -Ptests.badapples=false -Ptests.file.encoding=ISO-8859-1 -Ptests.linedocsfile=/home/jenkins/jenkins-slave/workspace/Solr/Solr-NightlyTests-main/test-data/enwiki.random.lines.txt

  - org.apache.solr.handler.TestReplicationHandler.doTestIndexAndConfigReplication (:solr:core)
    Test history: https://ge.apache.org/scans/tests?search.rootProjectNames=solr-root&tests.container=org.apache.solr.handler.TestReplicationHandler&tests.test=doTestIndexAndConfigReplication http://fucit.org/solr-jenkins-reports/history-trend-of-recent-failures.html#series/org.apache.solr.handler.TestReplicationHandler.doTestIndexAndConfigReplication
    Test output: /home/jenkins/jenkins-slave/workspace/Solr/Solr-NightlyTests-main/solr/core/build/test-results/test/outputs/OUTPUT-org.apache.solr.handler.TestReplicationHandler.txt
    Reproduce with: ./gradlew :solr:core:test --tests "org.apache.solr.handler.TestReplicationHandler.doTestIndexAndConfigReplication" -Ptests.jvms=4 -Ptests.haltonfailure=false "-Ptests.jvmargs=-XX:TieredStopAtLevel=1 -XX:+UseParallelGC -XX:ActiveProcessorCount=1 -XX:ReservedCodeCacheSize=120m" -Ptests.seed=9A2C4E350779A98 -Ptests.multiplier=2 -Ptests.nightly=true -Ptests.badapples=false -Ptests.file.encoding=ISO-8859-1 -Ptests.linedocsfile=/home/jenkins/jenkins-slave/workspace/Solr/Solr-NightlyTests-main/test-data/enwiki.random.lines.txt

  - org.apache.solr.handler.TestReplicationHandler.doTestIndexFetchWithLeaderUrl (:solr:core)
    Test history: https://ge.apache.org/scans/tests?search.rootProjectNames=solr-root&tests.container=org.apache.solr.handler.TestReplicationHandler&tests.test=doTestIndexFetchWithLeaderUrl http://fucit.org/solr-jenkins-reports/history-trend-of-recent-failures.html#series/org.apache.solr.handler.TestReplicationHandler.doTestIndexFetchWithLeaderUrl
    Test output: /home/jenkins/jenkins-slave/workspace/Solr/Solr-NightlyTests-main/solr/core/build/test-results/test/outputs/OUTPUT-org.apache.solr.handler.TestReplicationHandler.txt
    Reproduce with: ./gradlew :solr:core:test --tests "org.apache.solr.handler.TestReplicationHandler.doTestIndexFetchWithLeaderUrl" -Ptests.jvms=4 -Ptests.haltonfailure=false "-Ptests.jvmargs=-XX:TieredStopAtLevel=1 -XX:+UseParallelGC -XX:ActiveProcessorCount=1 -XX:ReservedCodeCacheSize=120m" -Ptests.seed=9A2C4E350779A98 -Ptests.multiplier=2 -Ptests.nightly=true -Ptests.badapples=false -Ptests.file.encoding=ISO-8859-1 -Ptests.linedocsfile=/home/jenkins/jenkins-slave/workspace/Solr/Solr-NightlyTests-main/test-data/enwiki.random.lines.txt

  - org.apache.solr.handler.TestReplicationHandler.doTestReplicateAfterStartup (:solr:core)
    Test history: https://ge.apache.org/scans/tests?search.rootProjectNames=solr-root&tests.container=org.apache.solr.handler.TestReplicationHandler&tests.test=doTestReplicateAfterStartup http://fucit.org/solr-jenkins-reports/history-trend-of-recent-failures.html#series/org.apache.solr.handler.TestReplicationHandler.doTestReplicateAfterStartup
    Test output: /home/jenkins/jenkins-slave/workspace/Solr/Solr-NightlyTests-main/solr/core/build/test-results/test/outputs/OUTPUT-org.apache.solr.handler.TestReplicationHandler.txt
    Reproduce with: ./gradlew :solr:core:test --tests "org.apache.solr.handler.TestReplicationHandler.doTestReplicateAfterStartup" -Ptests.jvms=4 -Ptests.haltonfailure=false "-Ptests.jvmargs=-XX:TieredStopAtLevel=1 -XX:+UseParallelGC -XX:ActiveProcessorCount=1 -XX:ReservedCodeCacheSize=120m" -Ptests.seed=9A2C4E350779A98 -Ptests.multiplier=2 -Ptests.nightly=true -Ptests.badapples=false -Ptests.file.encoding=ISO-8859-1 -Ptests.linedocsfile=/home/jenkins/jenkins-slave/workspace/Solr/Solr-NightlyTests-main/test-data/enwiki.random.lines.txt

  - org.apache.solr.handler.TestReplicationHandler.doTestReplicateAfterStartupWithNoActivity (:solr:core)
    Test history: https://ge.apache.org/scans/tests?search.rootProjectNames=solr-root&tests.container=org.apache.solr.handler.TestReplicationHandler&tests.test=doTestReplicateAfterStartupWithNoActivity http://fucit.org/solr-jenkins-reports/history-trend-of-recent-failures.html#series/org.apache.solr.handler.TestReplicationHandler.doTestReplicateAfterStartupWithNoActivity
    Test output: /home/jenkins/jenkins-slave/workspace/Solr/Solr-NightlyTests-main/solr/core/build/test-results/test/outputs/OUTPUT-org.apache.solr.handler.TestReplicationHandler.txt
    Reproduce with: ./gradlew :solr:core:test --tests "org.apache.solr.handler.TestReplicationHandler.doTestReplicateAfterStartupWithNoActivity" -Ptests.jvms=4 -Ptests.haltonfailure=false "-Ptests.jvmargs=-XX:TieredStopAtLevel=1 -XX:+UseParallelGC -XX:ActiveProcessorCount=1 -XX:ReservedCodeCacheSize=120m" -Ptests.seed=9A2C4E350779A98 -Ptests.multiplier=2 -Ptests.nightly=true -Ptests.badapples=false -Ptests.file.encoding=ISO-8859-1 -Ptests.linedocsfile=/home/jenkins/jenkins-slave/workspace/Solr/Solr-NightlyTests-main/test-data/enwiki.random.lines.txt

  - org.apache.solr.handler.TestReplicationHandler.doTestIndexAndConfigAliasReplication (:solr:core)
    Test history: https://ge.apache.org/scans/tests?search.rootProjectNames=solr-root&tests.container=org.apache.solr.handler.TestReplicationHandler&tests.test=doTestIndexAndConfigAliasReplication http://fucit.org/solr-jenkins-reports/history-trend-of-recent-failures.html#series/org.apache.solr.handler.TestReplicationHandler.doTestIndexAndConfigAliasReplication
    Test output: /home/jenkins/jenkins-slave/workspace/Solr/Solr-NightlyTests-main/solr/core/build/test-results/test/outputs/OUTPUT-org.apache.solr.handler.TestReplicationHandler.txt
    Reproduce with: ./gradlew :solr:core:test --tests "org.apache.solr.handler.TestReplicationHandler.doTestIndexAndConfigAliasReplication" -Ptests.jvms=4 -Ptests.haltonfailure=false "-Ptests.jvmargs=-XX:TieredStopAtLevel=1 -XX:+UseParallelGC -XX:ActiveProcessorCount=1 -XX:ReservedCodeCacheSize=120m" -Ptests.seed=9A2C4E350779A98 -Ptests.multiplier=2 -Ptests.nightly=true -Ptests.badapples=false -Ptests.file.encoding=ISO-8859-1 -Ptests.linedocsfile=/home/jenkins/jenkins-slave/workspace/Solr/Solr-NightlyTests-main/test-data/enwiki.random.lines.txt

  - org.apache.solr.handler.TestReplicationHandler.doTestReplicateAfterCoreReload (:solr:core)
    Test history: https://ge.apache.org/scans/tests?search.rootProjectNames=solr-root&tests.container=org.apache.solr.handler.TestReplicationHandler&tests.test=doTestReplicateAfterCoreReload http://fucit.org/solr-jenkins-reports/history-trend-of-recent-failures.html#series/org.apache.solr.handler.TestReplicationHandler.doTestReplicateAfterCoreReload
    Test output: /home/jenkins/jenkins-slave/workspace/Solr/Solr-NightlyTests-main/solr/core/build/test-results/test/outputs/OUTPUT-org.apache.solr.handler.TestReplicationHandler.txt
    Reproduce with: ./gradlew :solr:core:test --tests "org.apache.solr.handler.TestReplicationHandler.doTestReplicateAfterCoreReload" -Ptests.jvms=4 -Ptests.haltonfailure=false "-Ptests.jvmargs=-XX:TieredStopAtLevel=1 -XX:+UseParallelGC -XX:ActiveProcessorCount=1 -XX:ReservedCodeCacheSize=120m" -Ptests.seed=9A2C4E350779A98 -Ptests.multiplier=2 -Ptests.nightly=true -Ptests.badapples=false -Ptests.file.encoding=ISO-8859-1 -Ptests.linedocsfile=/home/jenkins/jenkins-slave/workspace/Solr/Solr-NightlyTests-main/test-data/enwiki.random.lines.txt


Deprecated Gradle features were used in this build, making it incompatible with Gradle 9.0.

You can use '--warning-mode all' to show the individual deprecation warnings and determine if they come from your own scripts or plugins.

For more on this, please refer to https://docs.gradle.org/8.10/userguide/command_line_interface.html#sec:command_line_warnings in the Gradle documentation.

BUILD SUCCESSFUL in 2h 3m 23s
153 actionable tasks: 153 executed

Publishing build scan...

The Develocity server (ge.apache.org) rejected the access key with prefix 'eyJraWQiOiJhdXRoLWtleS1pZC01ZTYyNzFkNS05Zjc0LTRmMzgtYWQ4Mi0xNmRkZTA3NjY0MGIiLCJhbGciOiJSUzI1NiIsInR5cCI6IkpXVCJ9.eyJpc19hbm9ueW1vdXMiOmZhbHNlLCJwZXJtaXNzaW9ucyI6WyJWSUVXX1NDQU4iLCJFWFBPUlRfREFUQSIsIlBVQkxJU0hfU0NBTiIsIlBSRURJQ1RJVkVfVEVTVF9TRUxFQ1RJT04iLCJSRUFEX0NBQ0hFIiwiQUNDRVNTX0FMTF9EQVRBIiwiQUNDRVNTX0RBVEFfV0lUSE9VVF9BU1NPQ0lBVEVEX1BST0pFQ1QiLCJNWV9TRVRUSU5HUyIsIlJFQURfVkVSU0lPTiJdLCJhbGxEYXRhUGVybWlzc2lvbnMiOlsiVklFV19TQ0FOIiwiUFJFRElDVElWRV9URVNUX1NFTEVDVElPTiIsIlJFQURfQ0FDSEUiLCJBQ0NFU1NfQUxMX0RBVEEiLCJBQ0NFU1NfREFUQV9XSVRIT1VUX0FTU09DSUFURURfUFJPSkVDVCIsIkVYUE9SVF9EQVRBIiwiUFVCTElTSF9TQ0FOIiwiTVlfU0VUVElOR1MiLCJSRUFEX1ZFUlNJT04iXSwicHJvamVj'.
Your access key has expired - please visit https://ge.apache.org/settings/access-keys to refresh it.

Build step 'Invoke Gradle script' changed build result to SUCCESS
Archiving artifacts
‘**/*.events’ doesn’t match anything: ‘**’ exists but not ‘**/*.events’
No artifacts found that match the file pattern "**/*.events,heapdumps/**,**/hs_err_pid*". Configuration error?
Recording test results
[Checks API] No suitable checks publisher found.
Build step 'Publish JUnit test result report' changed build result to UNSTABLE
Email was triggered for: Unstable (Test Failures)
Sending email for trigger: Unstable (Test Failures)

[JENKINS] Solr » Solr-NightlyTests-main - Build # 1315 - Still Unstable!

Posted by Apache Jenkins Server <je...@builds.apache.org>.
Build: https://ci-builds.apache.org/job/Solr/job/Solr-NightlyTests-main/1315/

25 tests failed.
FAILED:  org.apache.solr.cloud.RecoveryStrategyStressTest.stressTestRecovery

Error Message:
java.lang.Exception: Test abandoned because suite timeout was reached.

Stack Trace:
java.lang.Exception: Test abandoned because suite timeout was reached.
	at __randomizedtesting.SeedInfo.seed([98B72E10A766CD84]:0)


FAILED:  org.apache.solr.cloud.RecoveryStrategyStressTest.classMethod

Error Message:
java.lang.Exception: Suite timeout exceeded (>= 7200000 msec).

Stack Trace:
java.lang.Exception: Suite timeout exceeded (>= 7200000 msec).
	at __randomizedtesting.SeedInfo.seed([98B72E10A766CD84]:0)


FAILED:  org.apache.solr.cloud.RecoveryStrategyStressTest.classMethod

Error Message:
com.carrotsearch.randomizedtesting.UncaughtExceptionError: Captured an uncaught exception in thread: Thread[id=16585, name=updateExecutor-7987-thread-1, state=RUNNABLE, group=TGRP-RecoveryStrategyStressTest]

Stack Trace:
com.carrotsearch.randomizedtesting.UncaughtExceptionError: Captured an uncaught exception in thread: Thread[id=16585, name=updateExecutor-7987-thread-1, state=RUNNABLE, group=TGRP-RecoveryStrategyStressTest]
Caused by: org.apache.solr.common.SolrException: java.lang.InterruptedException
	at __randomizedtesting.SeedInfo.seed([98B72E10A766CD84]:0)
	at app//org.apache.solr.update.DefaultSolrCoreState$2.run(DefaultSolrCoreState.java:354)
	at app//com.codahale.metrics.InstrumentedExecutorService$InstrumentedRunnable.run(InstrumentedExecutorService.java:212)
	at app//org.apache.solr.common.util.ExecutorUtil$MDCAwareThreadPoolExecutor.lambda$execute$0(ExecutorUtil.java:380)
	at java.base@21.0.3/java.util.concurrent.ThreadPoolExecutor.runWorker(ThreadPoolExecutor.java:1144)
	at java.base@21.0.3/java.util.concurrent.ThreadPoolExecutor$Worker.run(ThreadPoolExecutor.java:642)
	at java.base@21.0.3/java.lang.Thread.run(Thread.java:1583)
Caused by: java.lang.InterruptedException
	at java.base/java.util.concurrent.FutureTask.awaitDone(FutureTask.java:471)
	at java.base/java.util.concurrent.FutureTask.get(FutureTask.java:190)
	at org.apache.solr.update.DefaultSolrCoreState$2.run(DefaultSolrCoreState.java:351)
	... 5 more


FAILED:  org.apache.solr.cloud.RecoveryStrategyStressTest.classMethod

Error Message:
com.carrotsearch.randomizedtesting.UncaughtExceptionError: Captured an uncaught exception in thread: Thread[id=15872, name=Thread-1535, state=RUNNABLE, group=TGRP-RecoveryStrategyStressTest]

Stack Trace:
com.carrotsearch.randomizedtesting.UncaughtExceptionError: Captured an uncaught exception in thread: Thread[id=15872, name=Thread-1535, state=RUNNABLE, group=TGRP-RecoveryStrategyStressTest]
Caused by: java.lang.RuntimeException: java.lang.RuntimeException: Timeout waiting for pool org.apache.solr.common.util.ExecutorUtil$MDCAwareThreadPoolExecutor@112763aa[Shutting down, pool size = 1, active threads = 1, queued tasks = 0, completed tasks = 4] to shutdown.
	at __randomizedtesting.SeedInfo.seed([98B72E10A766CD84]:0)
	at org.apache.solr.cloud.RecoveryStrategyStressTest.lambda$stressTestRecovery$1(RecoveryStrategyStressTest.java:80)
	at java.base/java.lang.Thread.run(Thread.java:1583)
Caused by: java.lang.RuntimeException: Timeout waiting for pool org.apache.solr.common.util.ExecutorUtil$MDCAwareThreadPoolExecutor@112763aa[Shutting down, pool size = 1, active threads = 1, queued tasks = 0, completed tasks = 4] to shutdown.
	at org.apache.solr.common.util.ExecutorUtil.awaitTermination(ExecutorUtil.java:165)
	at org.apache.solr.common.util.ExecutorUtil.awaitTermination(ExecutorUtil.java:152)
	at org.apache.solr.common.util.ExecutorUtil.shutdownAndAwaitTermination(ExecutorUtil.java:118)
	at org.apache.solr.core.CoreContainer.shutdown(CoreContainer.java:1407)
	at org.apache.solr.servlet.CoreContainerProvider.close(CoreContainerProvider.java:180)
	at org.apache.solr.servlet.CoreContainerProvider.contextDestroyed(CoreContainerProvider.java:114)
	at org.eclipse.jetty.server.handler.ContextHandler.callContextDestroyed(ContextHandler.java:1059)
	at org.eclipse.jetty.servlet.ServletContextHandler.callContextDestroyed(ServletContextHandler.java:636)
	at org.eclipse.jetty.server.handler.ContextHandler.contextDestroyed(ContextHandler.java:1016)
	at org.eclipse.jetty.servlet.ServletHandler.doStop(ServletHandler.java:306)
	at org.eclipse.jetty.util.component.AbstractLifeCycle.stop(AbstractLifeCycle.java:132)
	at org.eclipse.jetty.util.component.ContainerLifeCycle.stop(ContainerLifeCycle.java:182)
	at org.eclipse.jetty.util.component.ContainerLifeCycle.doStop(ContainerLifeCycle.java:205)
	at org.eclipse.jetty.server.handler.AbstractHandler.doStop(AbstractHandler.java:97)
	at org.eclipse.jetty.server.session.SessionHandler.doStop(SessionHandler.java:497)
	at org.eclipse.jetty.util.component.AbstractLifeCycle.stop(AbstractLifeCycle.java:132)
	at org.eclipse.jetty.util.component.ContainerLifeCycle.stop(ContainerLifeCycle.java:182)
	at org.eclipse.jetty.util.component.ContainerLifeCycle.doStop(ContainerLifeCycle.java:205)
	at org.eclipse.jetty.server.handler.AbstractHandler.doStop(AbstractHandler.java:97)
	at org.eclipse.jetty.server.handler.ContextHandler.stopContext(ContextHandler.java:1039)
	at org.eclipse.jetty.servlet.ServletContextHandler.stopContext(ServletContextHandler.java:399)
	at org.eclipse.jetty.server.handler.ContextHandler.doStop(ContextHandler.java:1087)
	at org.eclipse.jetty.servlet.ServletContextHandler.doStop(ServletContextHandler.java:312)
	at org.eclipse.jetty.util.component.AbstractLifeCycle.stop(AbstractLifeCycle.java:132)
	at org.eclipse.jetty.util.component.ContainerLifeCycle.stop(ContainerLifeCycle.java:182)
	at org.eclipse.jetty.util.component.ContainerLifeCycle.doStop(ContainerLifeCycle.java:205)
	at org.eclipse.jetty.server.handler.AbstractHandler.doStop(AbstractHandler.java:97)
	at org.eclipse.jetty.util.component.AbstractLifeCycle.stop(AbstractLifeCycle.java:132)
	at org.eclipse.jetty.util.component.ContainerLifeCycle.stop(ContainerLifeCycle.java:182)
	at org.eclipse.jetty.util.component.ContainerLifeCycle.doStop(ContainerLifeCycle.java:205)
	at org.eclipse.jetty.server.handler.AbstractHandler.doStop(AbstractHandler.java:97)
	at org.eclipse.jetty.server.handler.gzip.GzipHandler.doStop(GzipHandler.java:227)
	at org.eclipse.jetty.util.component.AbstractLifeCycle.stop(AbstractLifeCycle.java:132)
	at org.eclipse.jetty.util.component.ContainerLifeCycle.stop(ContainerLifeCycle.java:182)
	at org.eclipse.jetty.util.component.ContainerLifeCycle.doStop(ContainerLifeCycle.java:205)
	at org.eclipse.jetty.server.handler.AbstractHandler.doStop(AbstractHandler.java:97)
	at org.eclipse.jetty.server.Server.doStop(Server.java:517)
	at org.eclipse.jetty.util.component.AbstractLifeCycle.stop(AbstractLifeCycle.java:132)
	at org.apache.solr.embedded.JettySolrRunner.stop(JettySolrRunner.java:634)
	at org.apache.solr.cloud.RecoveryStrategyStressTest.lambda$stressTestRecovery$1(RecoveryStrategyStressTest.java:74)
	... 1 more


FAILED:  org.apache.solr.cloud.api.collections.ShardSplitTest.testSplitAfterFailedSplit2

Error Message:
com.carrotsearch.randomizedtesting.UncaughtExceptionError: Captured an uncaught exception in thread: Thread[id=84727, name=zkCallback-54964-thread-2, state=RUNNABLE, group=TGRP-ShardSplitTest]

Stack Trace:
com.carrotsearch.randomizedtesting.UncaughtExceptionError: Captured an uncaught exception in thread: Thread[id=84727, name=zkCallback-54964-thread-2, state=RUNNABLE, group=TGRP-ShardSplitTest]
Caused by: org.apache.solr.common.SolrException: core not found: collection1_shard1_0_replica_n9
	at __randomizedtesting.SeedInfo.seed([98B72E10A766CD84]:0)
	at app//org.apache.solr.handler.admin.PrepRecoveryOp.lambda$execute$0(PrepRecoveryOp.java:94)
	at app//org.apache.solr.common.cloud.ZkStateReader.lambda$waitForState$10(ZkStateReader.java:1645)
	at app//org.apache.solr.common.cloud.ZkStateReader$DocCollectionAndLiveNodesWatcherWrapper.onChange(ZkStateReader.java:2148)
	at app//org.apache.solr.common.cloud.ZkStateReader.lambda$refreshLiveNodes$2(ZkStateReader.java:833)
	at java.base@21.0.3/java.util.concurrent.ConcurrentHashMap$KeySetView.forEach(ConcurrentHashMap.java:4709)
	at app//org.apache.solr.common.cloud.ZkStateReader.refreshLiveNodes(ZkStateReader.java:831)
	at app//org.apache.solr.common.cloud.ZkStateReader$LiveNodeWatcher.refreshAndWatch(ZkStateReader.java:1386)
	at app//org.apache.solr.common.cloud.ZkStateReader$LiveNodeWatcher.process(ZkStateReader.java:1381)
	at app//org.apache.solr.common.cloud.SolrZkClient$ProcessWatchWithExecutor.lambda$process$0(SolrZkClient.java:1179)
	at app//org.apache.solr.common.util.ExecutorUtil$MDCAwareThreadPoolExecutor.lambda$execute$0(ExecutorUtil.java:380)
	at java.base@21.0.3/java.util.concurrent.ThreadPoolExecutor.runWorker(ThreadPoolExecutor.java:1144)
	at java.base@21.0.3/java.util.concurrent.ThreadPoolExecutor$Worker.run(ThreadPoolExecutor.java:642)
	at java.base@21.0.3/java.lang.Thread.run(Thread.java:1583)


FAILED:  org.apache.solr.handler.TestReplicationHandler.doTestReplicateAfterStartupWithNoActivity

Error Message:
java.nio.file.FileAlreadyExistsException: /home/jenkins/jenkins-slave/workspace/Solr/Solr-NightlyTests-main/solr/core/build/tmp/tests-tmp/org.apache.solr.handler.TestReplicationHandler_98B72E10A766CD84-001/solr-instance-005/solr.xml

Stack Trace:
java.nio.file.FileAlreadyExistsException: /home/jenkins/jenkins-slave/workspace/Solr/Solr-NightlyTests-main/solr/core/build/tmp/tests-tmp/org.apache.solr.handler.TestReplicationHandler_98B72E10A766CD84-001/solr-instance-005/solr.xml
	at __randomizedtesting.SeedInfo.seed([98B72E10A766CD84:34A8E00A88E3205C]:0)
	at java.base/sun.nio.fs.UnixFileSystem.copy(UnixFileSystem.java:1030)
	at java.base/sun.nio.fs.UnixFileSystemProvider.copy(UnixFileSystemProvider.java:300)
	at java.base/java.nio.file.Files.copy(Files.java:1304)
	at org.apache.solr.handler.ReplicationTestHelper.createAndStartJetty(ReplicationTestHelper.java:57)
	at org.apache.solr.handler.TestReplicationHandler.createAndStartJetty(TestReplicationHandler.java:163)
	at org.apache.solr.handler.TestReplicationHandler.doTestReplicateAfterStartupWithNoActivity(TestReplicationHandler.java:1192)
	at java.base/jdk.internal.reflect.DirectMethodHandleAccessor.invoke(DirectMethodHandleAccessor.java:103)
	at java.base/java.lang.reflect.Method.invoke(Method.java:580)
	at com.carrotsearch.randomizedtesting.RandomizedRunner.invoke(RandomizedRunner.java:1758)
	at com.carrotsearch.randomizedtesting.RandomizedRunner$8.evaluate(RandomizedRunner.java:946)
	at com.carrotsearch.randomizedtesting.RandomizedRunner$9.evaluate(RandomizedRunner.java:982)
	at com.carrotsearch.randomizedtesting.RandomizedRunner$10.evaluate(RandomizedRunner.java:996)
	at com.carrotsearch.randomizedtesting.rules.SystemPropertiesRestoreRule$1.evaluate(SystemPropertiesRestoreRule.java:80)
	at org.junit.rules.RunRules.evaluate(RunRules.java:20)
	at org.apache.lucene.tests.util.TestRuleSetupTeardownChained$1.evaluate(TestRuleSetupTeardownChained.java:48)
	at org.apache.lucene.tests.util.AbstractBeforeAfterRule$1.evaluate(AbstractBeforeAfterRule.java:43)
	at org.apache.lucene.tests.util.TestRuleThreadAndTestName$1.evaluate(TestRuleThreadAndTestName.java:45)
	at org.apache.lucene.tests.util.TestRuleIgnoreAfterMaxFailures$1.evaluate(TestRuleIgnoreAfterMaxFailures.java:60)
	at org.apache.lucene.tests.util.TestRuleMarkFailure$1.evaluate(TestRuleMarkFailure.java:44)
	at org.junit.rules.RunRules.evaluate(RunRules.java:20)
	at com.carrotsearch.randomizedtesting.rules.StatementAdapter.evaluate(StatementAdapter.java:36)
	at com.carrotsearch.randomizedtesting.ThreadLeakControl$StatementRunner.run(ThreadLeakControl.java:390)
	at com.carrotsearch.randomizedtesting.ThreadLeakControl.forkTimeoutingTask(ThreadLeakControl.java:843)
	at com.carrotsearch.randomizedtesting.ThreadLeakControl$3.evaluate(ThreadLeakControl.java:490)
	at com.carrotsearch.randomizedtesting.RandomizedRunner.runSingleTest(RandomizedRunner.java:955)
	at com.carrotsearch.randomizedtesting.RandomizedRunner$5.evaluate(RandomizedRunner.java:840)
	at com.carrotsearch.randomizedtesting.RandomizedRunner$6.evaluate(RandomizedRunner.java:891)
	at com.carrotsearch.randomizedtesting.RandomizedRunner$7.evaluate(RandomizedRunner.java:902)
	at com.carrotsearch.randomizedtesting.rules.StatementAdapter.evaluate(StatementAdapter.java:36)
	at com.carrotsearch.randomizedtesting.rules.StatementAdapter.evaluate(StatementAdapter.java:36)
	at org.apache.lucene.tests.util.AbstractBeforeAfterRule$1.evaluate(AbstractBeforeAfterRule.java:43)
	at com.carrotsearch.randomizedtesting.rules.SystemPropertiesRestoreRule$1.evaluate(SystemPropertiesRestoreRule.java:80)
	at org.junit.rules.RunRules.evaluate(RunRules.java:20)
	at org.apache.lucene.tests.util.AbstractBeforeAfterRule$1.evaluate(AbstractBeforeAfterRule.java:43)
	at com.carrotsearch.randomizedtesting.rules.StatementAdapter.evaluate(StatementAdapter.java:36)
	at org.apache.lucene.tests.util.TestRuleStoreClassName$1.evaluate(TestRuleStoreClassName.java:38)
	at com.carrotsearch.randomizedtesting.rules.NoShadowingOrOverridesOnMethodsRule$1.evaluate(NoShadowingOrOverridesOnMethodsRule.java:40)
	at com.carrotsearch.randomizedtesting.rules.NoShadowingOrOverridesOnMethodsRule$1.evaluate(NoShadowingOrOverridesOnMethodsRule.java:40)
	at com.carrotsearch.randomizedtesting.rules.StatementAdapter.evaluate(StatementAdapter.java:36)
	at com.carrotsearch.randomizedtesting.rules.StatementAdapter.evaluate(StatementAdapter.java:36)
	at org.apache.lucene.tests.util.TestRuleAssertionsRequired$1.evaluate(TestRuleAssertionsRequired.java:53)
	at org.apache.lucene.tests.util.AbstractBeforeAfterRule$1.evaluate(AbstractBeforeAfterRule.java:43)
	at org.apache.lucene.tests.util.TestRuleMarkFailure$1.evaluate(TestRuleMarkFailure.java:44)
	at org.apache.lucene.tests.util.TestRuleIgnoreAfterMaxFailures$1.evaluate(TestRuleIgnoreAfterMaxFailures.java:60)
	at org.apache.lucene.tests.util.TestRuleIgnoreTestSuites$1.evaluate(TestRuleIgnoreTestSuites.java:47)
	at org.junit.rules.RunRules.evaluate(RunRules.java:20)
	at com.carrotsearch.randomizedtesting.rules.StatementAdapter.evaluate(StatementAdapter.java:36)
	at com.carrotsearch.randomizedtesting.ThreadLeakControl$StatementRunner.run(ThreadLeakControl.java:390)
	at com.carrotsearch.randomizedtesting.ThreadLeakControl.lambda$forkTimeoutingTask$0(ThreadLeakControl.java:850)
	at java.base/java.lang.Thread.run(Thread.java:1583)


FAILED:  org.apache.solr.handler.TestReplicationHandler.doTestReplicateAfterStartup

Error Message:
java.nio.file.FileAlreadyExistsException: /home/jenkins/jenkins-slave/workspace/Solr/Solr-NightlyTests-main/solr/core/build/tmp/tests-tmp/org.apache.solr.handler.TestReplicationHandler_98B72E10A766CD84-001/solr-instance-007/solr.xml

Stack Trace:
java.nio.file.FileAlreadyExistsException: /home/jenkins/jenkins-slave/workspace/Solr/Solr-NightlyTests-main/solr/core/build/tmp/tests-tmp/org.apache.solr.handler.TestReplicationHandler_98B72E10A766CD84-001/solr-instance-007/solr.xml
	at __randomizedtesting.SeedInfo.seed([98B72E10A766CD84:AC58865F535D567B]:0)
	at java.base/sun.nio.fs.UnixFileSystem.copy(UnixFileSystem.java:1030)
	at java.base/sun.nio.fs.UnixFileSystemProvider.copy(UnixFileSystemProvider.java:300)
	at java.base/java.nio.file.Files.copy(Files.java:1304)
	at org.apache.solr.handler.ReplicationTestHelper.createAndStartJetty(ReplicationTestHelper.java:57)
	at org.apache.solr.handler.TestReplicationHandler.createAndStartJetty(TestReplicationHandler.java:163)
	at org.apache.solr.handler.TestReplicationHandler.doTestReplicateAfterStartup(TestReplicationHandler.java:1142)
	at java.base/jdk.internal.reflect.DirectMethodHandleAccessor.invoke(DirectMethodHandleAccessor.java:103)
	at java.base/java.lang.reflect.Method.invoke(Method.java:580)
	at com.carrotsearch.randomizedtesting.RandomizedRunner.invoke(RandomizedRunner.java:1758)
	at com.carrotsearch.randomizedtesting.RandomizedRunner$8.evaluate(RandomizedRunner.java:946)
	at com.carrotsearch.randomizedtesting.RandomizedRunner$9.evaluate(RandomizedRunner.java:982)
	at com.carrotsearch.randomizedtesting.RandomizedRunner$10.evaluate(RandomizedRunner.java:996)
	at com.carrotsearch.randomizedtesting.rules.SystemPropertiesRestoreRule$1.evaluate(SystemPropertiesRestoreRule.java:80)
	at org.junit.rules.RunRules.evaluate(RunRules.java:20)
	at org.apache.lucene.tests.util.TestRuleSetupTeardownChained$1.evaluate(TestRuleSetupTeardownChained.java:48)
	at org.apache.lucene.tests.util.AbstractBeforeAfterRule$1.evaluate(AbstractBeforeAfterRule.java:43)
	at org.apache.lucene.tests.util.TestRuleThreadAndTestName$1.evaluate(TestRuleThreadAndTestName.java:45)
	at org.apache.lucene.tests.util.TestRuleIgnoreAfterMaxFailures$1.evaluate(TestRuleIgnoreAfterMaxFailures.java:60)
	at org.apache.lucene.tests.util.TestRuleMarkFailure$1.evaluate(TestRuleMarkFailure.java:44)
	at org.junit.rules.RunRules.evaluate(RunRules.java:20)
	at com.carrotsearch.randomizedtesting.rules.StatementAdapter.evaluate(StatementAdapter.java:36)
	at com.carrotsearch.randomizedtesting.ThreadLeakControl$StatementRunner.run(ThreadLeakControl.java:390)
	at com.carrotsearch.randomizedtesting.ThreadLeakControl.forkTimeoutingTask(ThreadLeakControl.java:843)
	at com.carrotsearch.randomizedtesting.ThreadLeakControl$3.evaluate(ThreadLeakControl.java:490)
	at com.carrotsearch.randomizedtesting.RandomizedRunner.runSingleTest(RandomizedRunner.java:955)
	at com.carrotsearch.randomizedtesting.RandomizedRunner$5.evaluate(RandomizedRunner.java:840)
	at com.carrotsearch.randomizedtesting.RandomizedRunner$6.evaluate(RandomizedRunner.java:891)
	at com.carrotsearch.randomizedtesting.RandomizedRunner$7.evaluate(RandomizedRunner.java:902)
	at com.carrotsearch.randomizedtesting.rules.StatementAdapter.evaluate(StatementAdapter.java:36)
	at com.carrotsearch.randomizedtesting.rules.StatementAdapter.evaluate(StatementAdapter.java:36)
	at org.apache.lucene.tests.util.AbstractBeforeAfterRule$1.evaluate(AbstractBeforeAfterRule.java:43)
	at com.carrotsearch.randomizedtesting.rules.SystemPropertiesRestoreRule$1.evaluate(SystemPropertiesRestoreRule.java:80)
	at org.junit.rules.RunRules.evaluate(RunRules.java:20)
	at org.apache.lucene.tests.util.AbstractBeforeAfterRule$1.evaluate(AbstractBeforeAfterRule.java:43)
	at com.carrotsearch.randomizedtesting.rules.StatementAdapter.evaluate(StatementAdapter.java:36)
	at org.apache.lucene.tests.util.TestRuleStoreClassName$1.evaluate(TestRuleStoreClassName.java:38)
	at com.carrotsearch.randomizedtesting.rules.NoShadowingOrOverridesOnMethodsRule$1.evaluate(NoShadowingOrOverridesOnMethodsRule.java:40)
	at com.carrotsearch.randomizedtesting.rules.NoShadowingOrOverridesOnMethodsRule$1.evaluate(NoShadowingOrOverridesOnMethodsRule.java:40)
	at com.carrotsearch.randomizedtesting.rules.StatementAdapter.evaluate(StatementAdapter.java:36)
	at com.carrotsearch.randomizedtesting.rules.StatementAdapter.evaluate(StatementAdapter.java:36)
	at org.apache.lucene.tests.util.TestRuleAssertionsRequired$1.evaluate(TestRuleAssertionsRequired.java:53)
	at org.apache.lucene.tests.util.AbstractBeforeAfterRule$1.evaluate(AbstractBeforeAfterRule.java:43)
	at org.apache.lucene.tests.util.TestRuleMarkFailure$1.evaluate(TestRuleMarkFailure.java:44)
	at org.apache.lucene.tests.util.TestRuleIgnoreAfterMaxFailures$1.evaluate(TestRuleIgnoreAfterMaxFailures.java:60)
	at org.apache.lucene.tests.util.TestRuleIgnoreTestSuites$1.evaluate(TestRuleIgnoreTestSuites.java:47)
	at org.junit.rules.RunRules.evaluate(RunRules.java:20)
	at com.carrotsearch.randomizedtesting.rules.StatementAdapter.evaluate(StatementAdapter.java:36)
	at com.carrotsearch.randomizedtesting.ThreadLeakControl$StatementRunner.run(ThreadLeakControl.java:390)
	at com.carrotsearch.randomizedtesting.ThreadLeakControl.lambda$forkTimeoutingTask$0(ThreadLeakControl.java:850)
	at java.base/java.lang.Thread.run(Thread.java:1583)


FAILED:  org.apache.solr.handler.TestReplicationHandler.doTestIndexAndConfigAliasReplication

Error Message:
java.nio.file.FileAlreadyExistsException: /home/jenkins/jenkins-slave/workspace/Solr/Solr-NightlyTests-main/solr/core/build/tmp/tests-tmp/org.apache.solr.handler.TestReplicationHandler_98B72E10A766CD84-001/solr-instance-009/solr.xml

Stack Trace:
java.nio.file.FileAlreadyExistsException: /home/jenkins/jenkins-slave/workspace/Solr/Solr-NightlyTests-main/solr/core/build/tmp/tests-tmp/org.apache.solr.handler.TestReplicationHandler_98B72E10A766CD84-001/solr-instance-009/solr.xml
	at __randomizedtesting.SeedInfo.seed([98B72E10A766CD84:6FC4C048618E6262]:0)
	at java.base/sun.nio.fs.UnixFileSystem.copy(UnixFileSystem.java:1030)
	at java.base/sun.nio.fs.UnixFileSystemProvider.copy(UnixFileSystemProvider.java:300)
	at java.base/java.nio.file.Files.copy(Files.java:1304)
	at org.apache.solr.handler.ReplicationTestHelper.createAndStartJetty(ReplicationTestHelper.java:57)
	at org.apache.solr.handler.TestReplicationHandler.createAndStartJetty(TestReplicationHandler.java:163)
	at org.apache.solr.handler.TestReplicationHandler.doTestIndexAndConfigAliasReplication(TestReplicationHandler.java:1344)
	at java.base/jdk.internal.reflect.DirectMethodHandleAccessor.invoke(DirectMethodHandleAccessor.java:103)
	at java.base/java.lang.reflect.Method.invoke(Method.java:580)
	at com.carrotsearch.randomizedtesting.RandomizedRunner.invoke(RandomizedRunner.java:1758)
	at com.carrotsearch.randomizedtesting.RandomizedRunner$8.evaluate(RandomizedRunner.java:946)
	at com.carrotsearch.randomizedtesting.RandomizedRunner$9.evaluate(RandomizedRunner.java:982)
	at com.carrotsearch.randomizedtesting.RandomizedRunner$10.evaluate(RandomizedRunner.java:996)
	at com.carrotsearch.randomizedtesting.rules.SystemPropertiesRestoreRule$1.evaluate(SystemPropertiesRestoreRule.java:80)
	at org.junit.rules.RunRules.evaluate(RunRules.java:20)
	at org.apache.lucene.tests.util.TestRuleSetupTeardownChained$1.evaluate(TestRuleSetupTeardownChained.java:48)
	at org.apache.lucene.tests.util.AbstractBeforeAfterRule$1.evaluate(AbstractBeforeAfterRule.java:43)
	at org.apache.lucene.tests.util.TestRuleThreadAndTestName$1.evaluate(TestRuleThreadAndTestName.java:45)
	at org.apache.lucene.tests.util.TestRuleIgnoreAfterMaxFailures$1.evaluate(TestRuleIgnoreAfterMaxFailures.java:60)
	at org.apache.lucene.tests.util.TestRuleMarkFailure$1.evaluate(TestRuleMarkFailure.java:44)
	at org.junit.rules.RunRules.evaluate(RunRules.java:20)
	at com.carrotsearch.randomizedtesting.rules.StatementAdapter.evaluate(StatementAdapter.java:36)
	at com.carrotsearch.randomizedtesting.ThreadLeakControl$StatementRunner.run(ThreadLeakControl.java:390)
	at com.carrotsearch.randomizedtesting.ThreadLeakControl.forkTimeoutingTask(ThreadLeakControl.java:843)
	at com.carrotsearch.randomizedtesting.ThreadLeakControl$3.evaluate(ThreadLeakControl.java:490)
	at com.carrotsearch.randomizedtesting.RandomizedRunner.runSingleTest(RandomizedRunner.java:955)
	at com.carrotsearch.randomizedtesting.RandomizedRunner$5.evaluate(RandomizedRunner.java:840)
	at com.carrotsearch.randomizedtesting.RandomizedRunner$6.evaluate(RandomizedRunner.java:891)
	at com.carrotsearch.randomizedtesting.RandomizedRunner$7.evaluate(RandomizedRunner.java:902)
	at com.carrotsearch.randomizedtesting.rules.StatementAdapter.evaluate(StatementAdapter.java:36)
	at com.carrotsearch.randomizedtesting.rules.StatementAdapter.evaluate(StatementAdapter.java:36)
	at org.apache.lucene.tests.util.AbstractBeforeAfterRule$1.evaluate(AbstractBeforeAfterRule.java:43)
	at com.carrotsearch.randomizedtesting.rules.SystemPropertiesRestoreRule$1.evaluate(SystemPropertiesRestoreRule.java:80)
	at org.junit.rules.RunRules.evaluate(RunRules.java:20)
	at org.apache.lucene.tests.util.AbstractBeforeAfterRule$1.evaluate(AbstractBeforeAfterRule.java:43)
	at com.carrotsearch.randomizedtesting.rules.StatementAdapter.evaluate(StatementAdapter.java:36)
	at org.apache.lucene.tests.util.TestRuleStoreClassName$1.evaluate(TestRuleStoreClassName.java:38)
	at com.carrotsearch.randomizedtesting.rules.NoShadowingOrOverridesOnMethodsRule$1.evaluate(NoShadowingOrOverridesOnMethodsRule.java:40)
	at com.carrotsearch.randomizedtesting.rules.NoShadowingOrOverridesOnMethodsRule$1.evaluate(NoShadowingOrOverridesOnMethodsRule.java:40)
	at com.carrotsearch.randomizedtesting.rules.StatementAdapter.evaluate(StatementAdapter.java:36)
	at com.carrotsearch.randomizedtesting.rules.StatementAdapter.evaluate(StatementAdapter.java:36)
	at org.apache.lucene.tests.util.TestRuleAssertionsRequired$1.evaluate(TestRuleAssertionsRequired.java:53)
	at org.apache.lucene.tests.util.AbstractBeforeAfterRule$1.evaluate(AbstractBeforeAfterRule.java:43)
	at org.apache.lucene.tests.util.TestRuleMarkFailure$1.evaluate(TestRuleMarkFailure.java:44)
	at org.apache.lucene.tests.util.TestRuleIgnoreAfterMaxFailures$1.evaluate(TestRuleIgnoreAfterMaxFailures.java:60)
	at org.apache.lucene.tests.util.TestRuleIgnoreTestSuites$1.evaluate(TestRuleIgnoreTestSuites.java:47)
	at org.junit.rules.RunRules.evaluate(RunRules.java:20)
	at com.carrotsearch.randomizedtesting.rules.StatementAdapter.evaluate(StatementAdapter.java:36)
	at com.carrotsearch.randomizedtesting.ThreadLeakControl$StatementRunner.run(ThreadLeakControl.java:390)
	at com.carrotsearch.randomizedtesting.ThreadLeakControl.lambda$forkTimeoutingTask$0(ThreadLeakControl.java:850)
	at java.base/java.lang.Thread.run(Thread.java:1583)


FAILED:  org.apache.solr.handler.TestReplicationHandler.doTestRepeater

Error Message:
java.nio.file.FileAlreadyExistsException: /home/jenkins/jenkins-slave/workspace/Solr/Solr-NightlyTests-main/solr/core/build/tmp/tests-tmp/org.apache.solr.handler.TestReplicationHandler_98B72E10A766CD84-001/solr-instance-014/solr.xml

Stack Trace:
java.nio.file.FileAlreadyExistsException: /home/jenkins/jenkins-slave/workspace/Solr/Solr-NightlyTests-main/solr/core/build/tmp/tests-tmp/org.apache.solr.handler.TestReplicationHandler_98B72E10A766CD84-001/solr-instance-014/solr.xml
	at __randomizedtesting.SeedInfo.seed([98B72E10A766CD84:26BACCD6493C9C0F]:0)
	at java.base/sun.nio.fs.UnixFileSystem.copy(UnixFileSystem.java:1030)
	at java.base/sun.nio.fs.UnixFileSystemProvider.copy(UnixFileSystemProvider.java:300)
	at java.base/java.nio.file.Files.copy(Files.java:1304)
	at org.apache.solr.handler.ReplicationTestHelper.createAndStartJetty(ReplicationTestHelper.java:57)
	at org.apache.solr.handler.TestReplicationHandler.createAndStartJetty(TestReplicationHandler.java:163)
	at org.apache.solr.handler.TestReplicationHandler.doTestRepeater(TestReplicationHandler.java:1060)
	at java.base/jdk.internal.reflect.DirectMethodHandleAccessor.invoke(DirectMethodHandleAccessor.java:103)
	at java.base/java.lang.reflect.Method.invoke(Method.java:580)
	at com.carrotsearch.randomizedtesting.RandomizedRunner.invoke(RandomizedRunner.java:1758)
	at com.carrotsearch.randomizedtesting.RandomizedRunner$8.evaluate(RandomizedRunner.java:946)
	at com.carrotsearch.randomizedtesting.RandomizedRunner$9.evaluate(RandomizedRunner.java:982)
	at com.carrotsearch.randomizedtesting.RandomizedRunner$10.evaluate(RandomizedRunner.java:996)
	at com.carrotsearch.randomizedtesting.rules.SystemPropertiesRestoreRule$1.evaluate(SystemPropertiesRestoreRule.java:80)
	at org.junit.rules.RunRules.evaluate(RunRules.java:20)
	at org.apache.lucene.tests.util.TestRuleSetupTeardownChained$1.evaluate(TestRuleSetupTeardownChained.java:48)
	at org.apache.lucene.tests.util.AbstractBeforeAfterRule$1.evaluate(AbstractBeforeAfterRule.java:43)
	at org.apache.lucene.tests.util.TestRuleThreadAndTestName$1.evaluate(TestRuleThreadAndTestName.java:45)
	at org.apache.lucene.tests.util.TestRuleIgnoreAfterMaxFailures$1.evaluate(TestRuleIgnoreAfterMaxFailures.java:60)
	at org.apache.lucene.tests.util.TestRuleMarkFailure$1.evaluate(TestRuleMarkFailure.java:44)
	at org.junit.rules.RunRules.evaluate(RunRules.java:20)
	at com.carrotsearch.randomizedtesting.rules.StatementAdapter.evaluate(StatementAdapter.java:36)
	at com.carrotsearch.randomizedtesting.ThreadLeakControl$StatementRunner.run(ThreadLeakControl.java:390)
	at com.carrotsearch.randomizedtesting.ThreadLeakControl.forkTimeoutingTask(ThreadLeakControl.java:843)
	at com.carrotsearch.randomizedtesting.ThreadLeakControl$3.evaluate(ThreadLeakControl.java:490)
	at com.carrotsearch.randomizedtesting.RandomizedRunner.runSingleTest(RandomizedRunner.java:955)
	at com.carrotsearch.randomizedtesting.RandomizedRunner$5.evaluate(RandomizedRunner.java:840)
	at com.carrotsearch.randomizedtesting.RandomizedRunner$6.evaluate(RandomizedRunner.java:891)
	at com.carrotsearch.randomizedtesting.RandomizedRunner$7.evaluate(RandomizedRunner.java:902)
	at com.carrotsearch.randomizedtesting.rules.StatementAdapter.evaluate(StatementAdapter.java:36)
	at com.carrotsearch.randomizedtesting.rules.StatementAdapter.evaluate(StatementAdapter.java:36)
	at org.apache.lucene.tests.util.AbstractBeforeAfterRule$1.evaluate(AbstractBeforeAfterRule.java:43)
	at com.carrotsearch.randomizedtesting.rules.SystemPropertiesRestoreRule$1.evaluate(SystemPropertiesRestoreRule.java:80)
	at org.junit.rules.RunRules.evaluate(RunRules.java:20)
	at org.apache.lucene.tests.util.AbstractBeforeAfterRule$1.evaluate(AbstractBeforeAfterRule.java:43)
	at com.carrotsearch.randomizedtesting.rules.StatementAdapter.evaluate(StatementAdapter.java:36)
	at org.apache.lucene.tests.util.TestRuleStoreClassName$1.evaluate(TestRuleStoreClassName.java:38)
	at com.carrotsearch.randomizedtesting.rules.NoShadowingOrOverridesOnMethodsRule$1.evaluate(NoShadowingOrOverridesOnMethodsRule.java:40)
	at com.carrotsearch.randomizedtesting.rules.NoShadowingOrOverridesOnMethodsRule$1.evaluate(NoShadowingOrOverridesOnMethodsRule.java:40)
	at com.carrotsearch.randomizedtesting.rules.StatementAdapter.evaluate(StatementAdapter.java:36)
	at com.carrotsearch.randomizedtesting.rules.StatementAdapter.evaluate(StatementAdapter.java:36)
	at org.apache.lucene.tests.util.TestRuleAssertionsRequired$1.evaluate(TestRuleAssertionsRequired.java:53)
	at org.apache.lucene.tests.util.AbstractBeforeAfterRule$1.evaluate(AbstractBeforeAfterRule.java:43)
	at org.apache.lucene.tests.util.TestRuleMarkFailure$1.evaluate(TestRuleMarkFailure.java:44)
	at org.apache.lucene.tests.util.TestRuleIgnoreAfterMaxFailures$1.evaluate(TestRuleIgnoreAfterMaxFailures.java:60)
	at org.apache.lucene.tests.util.TestRuleIgnoreTestSuites$1.evaluate(TestRuleIgnoreTestSuites.java:47)
	at org.junit.rules.RunRules.evaluate(RunRules.java:20)
	at com.carrotsearch.randomizedtesting.rules.StatementAdapter.evaluate(StatementAdapter.java:36)
	at com.carrotsearch.randomizedtesting.ThreadLeakControl$StatementRunner.run(ThreadLeakControl.java:390)
	at com.carrotsearch.randomizedtesting.ThreadLeakControl.lambda$forkTimeoutingTask$0(ThreadLeakControl.java:850)
	at java.base/java.lang.Thread.run(Thread.java:1583)


FAILED:  org.apache.solr.handler.TestReplicationHandler.doTestStressReplication

Error Message:
java.nio.file.FileAlreadyExistsException: /home/jenkins/jenkins-slave/workspace/Solr/Solr-NightlyTests-main/solr/core/build/tmp/tests-tmp/org.apache.solr.handler.TestReplicationHandler_98B72E10A766CD84-001/solr-instance-016/solr.xml

Stack Trace:
java.nio.file.FileAlreadyExistsException: /home/jenkins/jenkins-slave/workspace/Solr/Solr-NightlyTests-main/solr/core/build/tmp/tests-tmp/org.apache.solr.handler.TestReplicationHandler_98B72E10A766CD84-001/solr-instance-016/solr.xml
	at __randomizedtesting.SeedInfo.seed([98B72E10A766CD84:431C2ED6A24EA437]:0)
	at java.base/sun.nio.fs.UnixFileSystem.copy(UnixFileSystem.java:1030)
	at java.base/sun.nio.fs.UnixFileSystemProvider.copy(UnixFileSystemProvider.java:300)
	at java.base/java.nio.file.Files.copy(Files.java:1304)
	at org.apache.solr.handler.ReplicationTestHelper.createAndStartJetty(ReplicationTestHelper.java:57)
	at org.apache.solr.handler.TestReplicationHandler.createAndStartJetty(TestReplicationHandler.java:163)
	at org.apache.solr.handler.TestReplicationHandler.doTestStressReplication(TestReplicationHandler.java:907)
	at java.base/jdk.internal.reflect.DirectMethodHandleAccessor.invoke(DirectMethodHandleAccessor.java:103)
	at java.base/java.lang.reflect.Method.invoke(Method.java:580)
	at com.carrotsearch.randomizedtesting.RandomizedRunner.invoke(RandomizedRunner.java:1758)
	at com.carrotsearch.randomizedtesting.RandomizedRunner$8.evaluate(RandomizedRunner.java:946)
	at com.carrotsearch.randomizedtesting.RandomizedRunner$9.evaluate(RandomizedRunner.java:982)
	at com.carrotsearch.randomizedtesting.RandomizedRunner$10.evaluate(RandomizedRunner.java:996)
	at com.carrotsearch.randomizedtesting.rules.SystemPropertiesRestoreRule$1.evaluate(SystemPropertiesRestoreRule.java:80)
	at org.junit.rules.RunRules.evaluate(RunRules.java:20)
	at org.apache.lucene.tests.util.TestRuleSetupTeardownChained$1.evaluate(TestRuleSetupTeardownChained.java:48)
	at org.apache.lucene.tests.util.AbstractBeforeAfterRule$1.evaluate(AbstractBeforeAfterRule.java:43)
	at org.apache.lucene.tests.util.TestRuleThreadAndTestName$1.evaluate(TestRuleThreadAndTestName.java:45)
	at org.apache.lucene.tests.util.TestRuleIgnoreAfterMaxFailures$1.evaluate(TestRuleIgnoreAfterMaxFailures.java:60)
	at org.apache.lucene.tests.util.TestRuleMarkFailure$1.evaluate(TestRuleMarkFailure.java:44)
	at org.junit.rules.RunRules.evaluate(RunRules.java:20)
	at com.carrotsearch.randomizedtesting.rules.StatementAdapter.evaluate(StatementAdapter.java:36)
	at com.carrotsearch.randomizedtesting.ThreadLeakControl$StatementRunner.run(ThreadLeakControl.java:390)
	at com.carrotsearch.randomizedtesting.ThreadLeakControl.forkTimeoutingTask(ThreadLeakControl.java:843)
	at com.carrotsearch.randomizedtesting.ThreadLeakControl$3.evaluate(ThreadLeakControl.java:490)
	at com.carrotsearch.randomizedtesting.RandomizedRunner.runSingleTest(RandomizedRunner.java:955)
	at com.carrotsearch.randomizedtesting.RandomizedRunner$5.evaluate(RandomizedRunner.java:840)
	at com.carrotsearch.randomizedtesting.RandomizedRunner$6.evaluate(RandomizedRunner.java:891)
	at com.carrotsearch.randomizedtesting.RandomizedRunner$7.evaluate(RandomizedRunner.java:902)
	at com.carrotsearch.randomizedtesting.rules.StatementAdapter.evaluate(StatementAdapter.java:36)
	at com.carrotsearch.randomizedtesting.rules.StatementAdapter.evaluate(StatementAdapter.java:36)
	at org.apache.lucene.tests.util.AbstractBeforeAfterRule$1.evaluate(AbstractBeforeAfterRule.java:43)
	at com.carrotsearch.randomizedtesting.rules.SystemPropertiesRestoreRule$1.evaluate(SystemPropertiesRestoreRule.java:80)
	at org.junit.rules.RunRules.evaluate(RunRules.java:20)
	at org.apache.lucene.tests.util.AbstractBeforeAfterRule$1.evaluate(AbstractBeforeAfterRule.java:43)
	at com.carrotsearch.randomizedtesting.rules.StatementAdapter.evaluate(StatementAdapter.java:36)
	at org.apache.lucene.tests.util.TestRuleStoreClassName$1.evaluate(TestRuleStoreClassName.java:38)
	at com.carrotsearch.randomizedtesting.rules.NoShadowingOrOverridesOnMethodsRule$1.evaluate(NoShadowingOrOverridesOnMethodsRule.java:40)
	at com.carrotsearch.randomizedtesting.rules.NoShadowingOrOverridesOnMethodsRule$1.evaluate(NoShadowingOrOverridesOnMethodsRule.java:40)
	at com.carrotsearch.randomizedtesting.rules.StatementAdapter.evaluate(StatementAdapter.java:36)
	at com.carrotsearch.randomizedtesting.rules.StatementAdapter.evaluate(StatementAdapter.java:36)
	at org.apache.lucene.tests.util.TestRuleAssertionsRequired$1.evaluate(TestRuleAssertionsRequired.java:53)
	at org.apache.lucene.tests.util.AbstractBeforeAfterRule$1.evaluate(AbstractBeforeAfterRule.java:43)
	at org.apache.lucene.tests.util.TestRuleMarkFailure$1.evaluate(TestRuleMarkFailure.java:44)
	at org.apache.lucene.tests.util.TestRuleIgnoreAfterMaxFailures$1.evaluate(TestRuleIgnoreAfterMaxFailures.java:60)
	at org.apache.lucene.tests.util.TestRuleIgnoreTestSuites$1.evaluate(TestRuleIgnoreTestSuites.java:47)
	at org.junit.rules.RunRules.evaluate(RunRules.java:20)
	at com.carrotsearch.randomizedtesting.rules.StatementAdapter.evaluate(StatementAdapter.java:36)
	at com.carrotsearch.randomizedtesting.ThreadLeakControl$StatementRunner.run(ThreadLeakControl.java:390)
	at com.carrotsearch.randomizedtesting.ThreadLeakControl.lambda$forkTimeoutingTask$0(ThreadLeakControl.java:850)
	at java.base/java.lang.Thread.run(Thread.java:1583)


FAILED:  org.apache.solr.handler.TestReplicationHandler.doTestReplicateAfterCoreReload

Error Message:
java.nio.file.FileAlreadyExistsException: /home/jenkins/jenkins-slave/workspace/Solr/Solr-NightlyTests-main/solr/core/build/tmp/tests-tmp/org.apache.solr.handler.TestReplicationHandler_98B72E10A766CD84-001/solr-instance-019/solr.xml

Stack Trace:
java.nio.file.FileAlreadyExistsException: /home/jenkins/jenkins-slave/workspace/Solr/Solr-NightlyTests-main/solr/core/build/tmp/tests-tmp/org.apache.solr.handler.TestReplicationHandler_98B72E10A766CD84-001/solr-instance-019/solr.xml
	at __randomizedtesting.SeedInfo.seed([98B72E10A766CD84:BD603520D72EC387]:0)
	at java.base/sun.nio.fs.UnixFileSystem.copy(UnixFileSystem.java:1030)
	at java.base/sun.nio.fs.UnixFileSystemProvider.copy(UnixFileSystemProvider.java:300)
	at java.base/java.nio.file.Files.copy(Files.java:1304)
	at org.apache.solr.handler.ReplicationTestHelper.createAndStartJetty(ReplicationTestHelper.java:57)
	at org.apache.solr.handler.TestReplicationHandler.createAndStartJetty(TestReplicationHandler.java:163)
	at org.apache.solr.handler.TestReplicationHandler.doTestReplicateAfterCoreReload(TestReplicationHandler.java:1249)
	at java.base/jdk.internal.reflect.DirectMethodHandleAccessor.invoke(DirectMethodHandleAccessor.java:103)
	at java.base/java.lang.reflect.Method.invoke(Method.java:580)
	at com.carrotsearch.randomizedtesting.RandomizedRunner.invoke(RandomizedRunner.java:1758)
	at com.carrotsearch.randomizedtesting.RandomizedRunner$8.evaluate(RandomizedRunner.java:946)
	at com.carrotsearch.randomizedtesting.RandomizedRunner$9.evaluate(RandomizedRunner.java:982)
	at com.carrotsearch.randomizedtesting.RandomizedRunner$10.evaluate(RandomizedRunner.java:996)
	at com.carrotsearch.randomizedtesting.rules.SystemPropertiesRestoreRule$1.evaluate(SystemPropertiesRestoreRule.java:80)
	at org.junit.rules.RunRules.evaluate(RunRules.java:20)
	at org.apache.lucene.tests.util.TestRuleSetupTeardownChained$1.evaluate(TestRuleSetupTeardownChained.java:48)
	at org.apache.lucene.tests.util.AbstractBeforeAfterRule$1.evaluate(AbstractBeforeAfterRule.java:43)
	at org.apache.lucene.tests.util.TestRuleThreadAndTestName$1.evaluate(TestRuleThreadAndTestName.java:45)
	at org.apache.lucene.tests.util.TestRuleIgnoreAfterMaxFailures$1.evaluate(TestRuleIgnoreAfterMaxFailures.java:60)
	at org.apache.lucene.tests.util.TestRuleMarkFailure$1.evaluate(TestRuleMarkFailure.java:44)
	at org.junit.rules.RunRules.evaluate(RunRules.java:20)
	at com.carrotsearch.randomizedtesting.rules.StatementAdapter.evaluate(StatementAdapter.java:36)
	at com.carrotsearch.randomizedtesting.ThreadLeakControl$StatementRunner.run(ThreadLeakControl.java:390)
	at com.carrotsearch.randomizedtesting.ThreadLeakControl.forkTimeoutingTask(ThreadLeakControl.java:843)
	at com.carrotsearch.randomizedtesting.ThreadLeakControl$3.evaluate(ThreadLeakControl.java:490)
	at com.carrotsearch.randomizedtesting.RandomizedRunner.runSingleTest(RandomizedRunner.java:955)
	at com.carrotsearch.randomizedtesting.RandomizedRunner$5.evaluate(RandomizedRunner.java:840)
	at com.carrotsearch.randomizedtesting.RandomizedRunner$6.evaluate(RandomizedRunner.java:891)
	at com.carrotsearch.randomizedtesting.RandomizedRunner$7.evaluate(RandomizedRunner.java:902)
	at com.carrotsearch.randomizedtesting.rules.StatementAdapter.evaluate(StatementAdapter.java:36)
	at com.carrotsearch.randomizedtesting.rules.StatementAdapter.evaluate(StatementAdapter.java:36)
	at org.apache.lucene.tests.util.AbstractBeforeAfterRule$1.evaluate(AbstractBeforeAfterRule.java:43)
	at com.carrotsearch.randomizedtesting.rules.SystemPropertiesRestoreRule$1.evaluate(SystemPropertiesRestoreRule.java:80)
	at org.junit.rules.RunRules.evaluate(RunRules.java:20)
	at org.apache.lucene.tests.util.AbstractBeforeAfterRule$1.evaluate(AbstractBeforeAfterRule.java:43)
	at com.carrotsearch.randomizedtesting.rules.StatementAdapter.evaluate(StatementAdapter.java:36)
	at org.apache.lucene.tests.util.TestRuleStoreClassName$1.evaluate(TestRuleStoreClassName.java:38)
	at com.carrotsearch.randomizedtesting.rules.NoShadowingOrOverridesOnMethodsRule$1.evaluate(NoShadowingOrOverridesOnMethodsRule.java:40)
	at com.carrotsearch.randomizedtesting.rules.NoShadowingOrOverridesOnMethodsRule$1.evaluate(NoShadowingOrOverridesOnMethodsRule.java:40)
	at com.carrotsearch.randomizedtesting.rules.StatementAdapter.evaluate(StatementAdapter.java:36)
	at com.carrotsearch.randomizedtesting.rules.StatementAdapter.evaluate(StatementAdapter.java:36)
	at org.apache.lucene.tests.util.TestRuleAssertionsRequired$1.evaluate(TestRuleAssertionsRequired.java:53)
	at org.apache.lucene.tests.util.AbstractBeforeAfterRule$1.evaluate(AbstractBeforeAfterRule.java:43)
	at org.apache.lucene.tests.util.TestRuleMarkFailure$1.evaluate(TestRuleMarkFailure.java:44)
	at org.apache.lucene.tests.util.TestRuleIgnoreAfterMaxFailures$1.evaluate(TestRuleIgnoreAfterMaxFailures.java:60)
	at org.apache.lucene.tests.util.TestRuleIgnoreTestSuites$1.evaluate(TestRuleIgnoreTestSuites.java:47)
	at org.junit.rules.RunRules.evaluate(RunRules.java:20)
	at com.carrotsearch.randomizedtesting.rules.StatementAdapter.evaluate(StatementAdapter.java:36)
	at com.carrotsearch.randomizedtesting.ThreadLeakControl$StatementRunner.run(ThreadLeakControl.java:390)
	at com.carrotsearch.randomizedtesting.ThreadLeakControl.lambda$forkTimeoutingTask$0(ThreadLeakControl.java:850)
	at java.base/java.lang.Thread.run(Thread.java:1583)


FAILED:  org.apache.solr.handler.TestReplicationHandler.testRateLimitedReplication

Error Message:
java.nio.file.FileAlreadyExistsException: /home/jenkins/jenkins-slave/workspace/Solr/Solr-NightlyTests-main/solr/core/build/tmp/tests-tmp/org.apache.solr.handler.TestReplicationHandler_98B72E10A766CD84-001/solr-instance-023/solr.xml

Stack Trace:
java.nio.file.FileAlreadyExistsException: /home/jenkins/jenkins-slave/workspace/Solr/Solr-NightlyTests-main/solr/core/build/tmp/tests-tmp/org.apache.solr.handler.TestReplicationHandler_98B72E10A766CD84-001/solr-instance-023/solr.xml
	at __randomizedtesting.SeedInfo.seed([98B72E10A766CD84:1E235BE5A8D44C69]:0)
	at java.base/sun.nio.fs.UnixFileSystem.copy(UnixFileSystem.java:1030)
	at java.base/sun.nio.fs.UnixFileSystemProvider.copy(UnixFileSystemProvider.java:300)
	at java.base/java.nio.file.Files.copy(Files.java:1304)
	at org.apache.solr.handler.ReplicationTestHelper.createAndStartJetty(ReplicationTestHelper.java:57)
	at org.apache.solr.handler.TestReplicationHandler.createAndStartJetty(TestReplicationHandler.java:163)
	at org.apache.solr.handler.TestReplicationHandler.testRateLimitedReplication(TestReplicationHandler.java:1399)
	at java.base/jdk.internal.reflect.DirectMethodHandleAccessor.invoke(DirectMethodHandleAccessor.java:103)
	at java.base/java.lang.reflect.Method.invoke(Method.java:580)
	at com.carrotsearch.randomizedtesting.RandomizedRunner.invoke(RandomizedRunner.java:1758)
	at com.carrotsearch.randomizedtesting.RandomizedRunner$8.evaluate(RandomizedRunner.java:946)
	at com.carrotsearch.randomizedtesting.RandomizedRunner$9.evaluate(RandomizedRunner.java:982)
	at com.carrotsearch.randomizedtesting.RandomizedRunner$10.evaluate(RandomizedRunner.java:996)
	at com.carrotsearch.randomizedtesting.rules.SystemPropertiesRestoreRule$1.evaluate(SystemPropertiesRestoreRule.java:80)
	at org.junit.rules.RunRules.evaluate(RunRules.java:20)
	at org.apache.lucene.tests.util.TestRuleSetupTeardownChained$1.evaluate(TestRuleSetupTeardownChained.java:48)
	at org.apache.lucene.tests.util.AbstractBeforeAfterRule$1.evaluate(AbstractBeforeAfterRule.java:43)
	at org.apache.lucene.tests.util.TestRuleThreadAndTestName$1.evaluate(TestRuleThreadAndTestName.java:45)
	at org.apache.lucene.tests.util.TestRuleIgnoreAfterMaxFailures$1.evaluate(TestRuleIgnoreAfterMaxFailures.java:60)
	at org.apache.lucene.tests.util.TestRuleMarkFailure$1.evaluate(TestRuleMarkFailure.java:44)
	at org.junit.rules.RunRules.evaluate(RunRules.java:20)
	at com.carrotsearch.randomizedtesting.rules.StatementAdapter.evaluate(StatementAdapter.java:36)
	at com.carrotsearch.randomizedtesting.ThreadLeakControl$StatementRunner.run(ThreadLeakControl.java:390)
	at com.carrotsearch.randomizedtesting.ThreadLeakControl.forkTimeoutingTask(ThreadLeakControl.java:843)
	at com.carrotsearch.randomizedtesting.ThreadLeakControl$3.evaluate(ThreadLeakControl.java:490)
	at com.carrotsearch.randomizedtesting.RandomizedRunner.runSingleTest(RandomizedRunner.java:955)
	at com.carrotsearch.randomizedtesting.RandomizedRunner$5.evaluate(RandomizedRunner.java:840)
	at com.carrotsearch.randomizedtesting.RandomizedRunner$6.evaluate(RandomizedRunner.java:891)
	at com.carrotsearch.randomizedtesting.RandomizedRunner$7.evaluate(RandomizedRunner.java:902)
	at com.carrotsearch.randomizedtesting.rules.StatementAdapter.evaluate(StatementAdapter.java:36)
	at com.carrotsearch.randomizedtesting.rules.StatementAdapter.evaluate(StatementAdapter.java:36)
	at org.apache.lucene.tests.util.AbstractBeforeAfterRule$1.evaluate(AbstractBeforeAfterRule.java:43)
	at com.carrotsearch.randomizedtesting.rules.SystemPropertiesRestoreRule$1.evaluate(SystemPropertiesRestoreRule.java:80)
	at org.junit.rules.RunRules.evaluate(RunRules.java:20)
	at org.apache.lucene.tests.util.AbstractBeforeAfterRule$1.evaluate(AbstractBeforeAfterRule.java:43)
	at com.carrotsearch.randomizedtesting.rules.StatementAdapter.evaluate(StatementAdapter.java:36)
	at org.apache.lucene.tests.util.TestRuleStoreClassName$1.evaluate(TestRuleStoreClassName.java:38)
	at com.carrotsearch.randomizedtesting.rules.NoShadowingOrOverridesOnMethodsRule$1.evaluate(NoShadowingOrOverridesOnMethodsRule.java:40)
	at com.carrotsearch.randomizedtesting.rules.NoShadowingOrOverridesOnMethodsRule$1.evaluate(NoShadowingOrOverridesOnMethodsRule.java:40)
	at com.carrotsearch.randomizedtesting.rules.StatementAdapter.evaluate(StatementAdapter.java:36)
	at com.carrotsearch.randomizedtesting.rules.StatementAdapter.evaluate(StatementAdapter.java:36)
	at org.apache.lucene.tests.util.TestRuleAssertionsRequired$1.evaluate(TestRuleAssertionsRequired.java:53)
	at org.apache.lucene.tests.util.AbstractBeforeAfterRule$1.evaluate(AbstractBeforeAfterRule.java:43)
	at org.apache.lucene.tests.util.TestRuleMarkFailure$1.evaluate(TestRuleMarkFailure.java:44)
	at org.apache.lucene.tests.util.TestRuleIgnoreAfterMaxFailures$1.evaluate(TestRuleIgnoreAfterMaxFailures.java:60)
	at org.apache.lucene.tests.util.TestRuleIgnoreTestSuites$1.evaluate(TestRuleIgnoreTestSuites.java:47)
	at org.junit.rules.RunRules.evaluate(RunRules.java:20)
	at com.carrotsearch.randomizedtesting.rules.StatementAdapter.evaluate(StatementAdapter.java:36)
	at com.carrotsearch.randomizedtesting.ThreadLeakControl$StatementRunner.run(ThreadLeakControl.java:390)
	at com.carrotsearch.randomizedtesting.ThreadLeakControl.lambda$forkTimeoutingTask$0(ThreadLeakControl.java:850)
	at java.base/java.lang.Thread.run(Thread.java:1583)


FAILED:  org.apache.solr.handler.TestReplicationHandler.doTestDetails

Error Message:
java.nio.file.FileAlreadyExistsException: /home/jenkins/jenkins-slave/workspace/Solr/Solr-NightlyTests-main/solr/core/build/tmp/tests-tmp/org.apache.solr.handler.TestReplicationHandler_98B72E10A766CD84-001/solr-instance-028/solr.xml

Stack Trace:
java.nio.file.FileAlreadyExistsException: /home/jenkins/jenkins-slave/workspace/Solr/Solr-NightlyTests-main/solr/core/build/tmp/tests-tmp/org.apache.solr.handler.TestReplicationHandler_98B72E10A766CD84-001/solr-instance-028/solr.xml
	at __randomizedtesting.SeedInfo.seed([98B72E10A766CD84:E2EA0D65313EE40C]:0)
	at java.base/sun.nio.fs.UnixFileSystem.copy(UnixFileSystem.java:1030)
	at java.base/sun.nio.fs.UnixFileSystemProvider.copy(UnixFileSystemProvider.java:300)
	at java.base/java.nio.file.Files.copy(Files.java:1304)
	at org.apache.solr.handler.ReplicationTestHelper.createAndStartJetty(ReplicationTestHelper.java:57)
	at org.apache.solr.handler.TestReplicationHandler.createAndStartJetty(TestReplicationHandler.java:163)
	at org.apache.solr.handler.TestReplicationHandler.doTestDetails(TestReplicationHandler.java:284)
	at java.base/jdk.internal.reflect.DirectMethodHandleAccessor.invoke(DirectMethodHandleAccessor.java:103)
	at java.base/java.lang.reflect.Method.invoke(Method.java:580)
	at com.carrotsearch.randomizedtesting.RandomizedRunner.invoke(RandomizedRunner.java:1758)
	at com.carrotsearch.randomizedtesting.RandomizedRunner$8.evaluate(RandomizedRunner.java:946)
	at com.carrotsearch.randomizedtesting.RandomizedRunner$9.evaluate(RandomizedRunner.java:982)
	at com.carrotsearch.randomizedtesting.RandomizedRunner$10.evaluate(RandomizedRunner.java:996)
	at com.carrotsearch.randomizedtesting.rules.SystemPropertiesRestoreRule$1.evaluate(SystemPropertiesRestoreRule.java:80)
	at org.junit.rules.RunRules.evaluate(RunRules.java:20)
	at org.apache.lucene.tests.util.TestRuleSetupTeardownChained$1.evaluate(TestRuleSetupTeardownChained.java:48)
	at org.apache.lucene.tests.util.AbstractBeforeAfterRule$1.evaluate(AbstractBeforeAfterRule.java:43)
	at org.apache.lucene.tests.util.TestRuleThreadAndTestName$1.evaluate(TestRuleThreadAndTestName.java:45)
	at org.apache.lucene.tests.util.TestRuleIgnoreAfterMaxFailures$1.evaluate(TestRuleIgnoreAfterMaxFailures.java:60)
	at org.apache.lucene.tests.util.TestRuleMarkFailure$1.evaluate(TestRuleMarkFailure.java:44)
	at org.junit.rules.RunRules.evaluate(RunRules.java:20)
	at com.carrotsearch.randomizedtesting.rules.StatementAdapter.evaluate(StatementAdapter.java:36)
	at com.carrotsearch.randomizedtesting.ThreadLeakControl$StatementRunner.run(ThreadLeakControl.java:390)
	at com.carrotsearch.randomizedtesting.ThreadLeakControl.forkTimeoutingTask(ThreadLeakControl.java:843)
	at com.carrotsearch.randomizedtesting.ThreadLeakControl$3.evaluate(ThreadLeakControl.java:490)
	at com.carrotsearch.randomizedtesting.RandomizedRunner.runSingleTest(RandomizedRunner.java:955)
	at com.carrotsearch.randomizedtesting.RandomizedRunner$5.evaluate(RandomizedRunner.java:840)
	at com.carrotsearch.randomizedtesting.RandomizedRunner$6.evaluate(RandomizedRunner.java:891)
	at com.carrotsearch.randomizedtesting.RandomizedRunner$7.evaluate(RandomizedRunner.java:902)
	at com.carrotsearch.randomizedtesting.rules.StatementAdapter.evaluate(StatementAdapter.java:36)
	at com.carrotsearch.randomizedtesting.rules.StatementAdapter.evaluate(StatementAdapter.java:36)
	at org.apache.lucene.tests.util.AbstractBeforeAfterRule$1.evaluate(AbstractBeforeAfterRule.java:43)
	at com.carrotsearch.randomizedtesting.rules.SystemPropertiesRestoreRule$1.evaluate(SystemPropertiesRestoreRule.java:80)
	at org.junit.rules.RunRules.evaluate(RunRules.java:20)
	at org.apache.lucene.tests.util.AbstractBeforeAfterRule$1.evaluate(AbstractBeforeAfterRule.java:43)
	at com.carrotsearch.randomizedtesting.rules.StatementAdapter.evaluate(StatementAdapter.java:36)
	at org.apache.lucene.tests.util.TestRuleStoreClassName$1.evaluate(TestRuleStoreClassName.java:38)
	at com.carrotsearch.randomizedtesting.rules.NoShadowingOrOverridesOnMethodsRule$1.evaluate(NoShadowingOrOverridesOnMethodsRule.java:40)
	at com.carrotsearch.randomizedtesting.rules.NoShadowingOrOverridesOnMethodsRule$1.evaluate(NoShadowingOrOverridesOnMethodsRule.java:40)
	at com.carrotsearch.randomizedtesting.rules.StatementAdapter.evaluate(StatementAdapter.java:36)
	at com.carrotsearch.randomizedtesting.rules.StatementAdapter.evaluate(StatementAdapter.java:36)
	at org.apache.lucene.tests.util.TestRuleAssertionsRequired$1.evaluate(TestRuleAssertionsRequired.java:53)
	at org.apache.lucene.tests.util.AbstractBeforeAfterRule$1.evaluate(AbstractBeforeAfterRule.java:43)
	at org.apache.lucene.tests.util.TestRuleMarkFailure$1.evaluate(TestRuleMarkFailure.java:44)
	at org.apache.lucene.tests.util.TestRuleIgnoreAfterMaxFailures$1.evaluate(TestRuleIgnoreAfterMaxFailures.java:60)
	at org.apache.lucene.tests.util.TestRuleIgnoreTestSuites$1.evaluate(TestRuleIgnoreTestSuites.java:47)
	at org.junit.rules.RunRules.evaluate(RunRules.java:20)
	at com.carrotsearch.randomizedtesting.rules.StatementAdapter.evaluate(StatementAdapter.java:36)
	at com.carrotsearch.randomizedtesting.ThreadLeakControl$StatementRunner.run(ThreadLeakControl.java:390)
	at com.carrotsearch.randomizedtesting.ThreadLeakControl.lambda$forkTimeoutingTask$0(ThreadLeakControl.java:850)
	at java.base/java.lang.Thread.run(Thread.java:1583)


FAILED:  org.apache.solr.handler.TestReplicationHandler.doTestIndexAndConfigReplication

Error Message:
java.nio.file.FileAlreadyExistsException: /home/jenkins/jenkins-slave/workspace/Solr/Solr-NightlyTests-main/solr/core/build/tmp/tests-tmp/org.apache.solr.handler.TestReplicationHandler_98B72E10A766CD84-001/solr-instance-029/solr.xml

Stack Trace:
java.nio.file.FileAlreadyExistsException: /home/jenkins/jenkins-slave/workspace/Solr/Solr-NightlyTests-main/solr/core/build/tmp/tests-tmp/org.apache.solr.handler.TestReplicationHandler_98B72E10A766CD84-001/solr-instance-029/solr.xml
	at __randomizedtesting.SeedInfo.seed([98B72E10A766CD84:8CFF75458461709A]:0)
	at java.base/sun.nio.fs.UnixFileSystem.copy(UnixFileSystem.java:1030)
	at java.base/sun.nio.fs.UnixFileSystemProvider.copy(UnixFileSystemProvider.java:300)
	at java.base/java.nio.file.Files.copy(Files.java:1304)
	at org.apache.solr.handler.ReplicationTestHelper.createAndStartJetty(ReplicationTestHelper.java:57)
	at org.apache.solr.handler.TestReplicationHandler.createAndStartJetty(TestReplicationHandler.java:163)
	at org.apache.solr.handler.TestReplicationHandler.doTestIndexAndConfigReplication(TestReplicationHandler.java:522)
	at java.base/jdk.internal.reflect.DirectMethodHandleAccessor.invoke(DirectMethodHandleAccessor.java:103)
	at java.base/java.lang.reflect.Method.invoke(Method.java:580)
	at com.carrotsearch.randomizedtesting.RandomizedRunner.invoke(RandomizedRunner.java:1758)
	at com.carrotsearch.randomizedtesting.RandomizedRunner$8.evaluate(RandomizedRunner.java:946)
	at com.carrotsearch.randomizedtesting.RandomizedRunner$9.evaluate(RandomizedRunner.java:982)
	at com.carrotsearch.randomizedtesting.RandomizedRunner$10.evaluate(RandomizedRunner.java:996)
	at com.carrotsearch.randomizedtesting.rules.SystemPropertiesRestoreRule$1.evaluate(SystemPropertiesRestoreRule.java:80)
	at org.junit.rules.RunRules.evaluate(RunRules.java:20)
	at org.apache.lucene.tests.util.TestRuleSetupTeardownChained$1.evaluate(TestRuleSetupTeardownChained.java:48)
	at org.apache.lucene.tests.util.AbstractBeforeAfterRule$1.evaluate(AbstractBeforeAfterRule.java:43)
	at org.apache.lucene.tests.util.TestRuleThreadAndTestName$1.evaluate(TestRuleThreadAndTestName.java:45)
	at org.apache.lucene.tests.util.TestRuleIgnoreAfterMaxFailures$1.evaluate(TestRuleIgnoreAfterMaxFailures.java:60)
	at org.apache.lucene.tests.util.TestRuleMarkFailure$1.evaluate(TestRuleMarkFailure.java:44)
	at org.junit.rules.RunRules.evaluate(RunRules.java:20)
	at com.carrotsearch.randomizedtesting.rules.StatementAdapter.evaluate(StatementAdapter.java:36)
	at com.carrotsearch.randomizedtesting.ThreadLeakControl$StatementRunner.run(ThreadLeakControl.java:390)
	at com.carrotsearch.randomizedtesting.ThreadLeakControl.forkTimeoutingTask(ThreadLeakControl.java:843)
	at com.carrotsearch.randomizedtesting.ThreadLeakControl$3.evaluate(ThreadLeakControl.java:490)
	at com.carrotsearch.randomizedtesting.RandomizedRunner.runSingleTest(RandomizedRunner.java:955)
	at com.carrotsearch.randomizedtesting.RandomizedRunner$5.evaluate(RandomizedRunner.java:840)
	at com.carrotsearch.randomizedtesting.RandomizedRunner$6.evaluate(RandomizedRunner.java:891)
	at com.carrotsearch.randomizedtesting.RandomizedRunner$7.evaluate(RandomizedRunner.java:902)
	at com.carrotsearch.randomizedtesting.rules.StatementAdapter.evaluate(StatementAdapter.java:36)
	at com.carrotsearch.randomizedtesting.rules.StatementAdapter.evaluate(StatementAdapter.java:36)
	at org.apache.lucene.tests.util.AbstractBeforeAfterRule$1.evaluate(AbstractBeforeAfterRule.java:43)
	at com.carrotsearch.randomizedtesting.rules.SystemPropertiesRestoreRule$1.evaluate(SystemPropertiesRestoreRule.java:80)
	at org.junit.rules.RunRules.evaluate(RunRules.java:20)
	at org.apache.lucene.tests.util.AbstractBeforeAfterRule$1.evaluate(AbstractBeforeAfterRule.java:43)
	at com.carrotsearch.randomizedtesting.rules.StatementAdapter.evaluate(StatementAdapter.java:36)
	at org.apache.lucene.tests.util.TestRuleStoreClassName$1.evaluate(TestRuleStoreClassName.java:38)
	at com.carrotsearch.randomizedtesting.rules.NoShadowingOrOverridesOnMethodsRule$1.evaluate(NoShadowingOrOverridesOnMethodsRule.java:40)
	at com.carrotsearch.randomizedtesting.rules.NoShadowingOrOverridesOnMethodsRule$1.evaluate(NoShadowingOrOverridesOnMethodsRule.java:40)
	at com.carrotsearch.randomizedtesting.rules.StatementAdapter.evaluate(StatementAdapter.java:36)
	at com.carrotsearch.randomizedtesting.rules.StatementAdapter.evaluate(StatementAdapter.java:36)
	at org.apache.lucene.tests.util.TestRuleAssertionsRequired$1.evaluate(TestRuleAssertionsRequired.java:53)
	at org.apache.lucene.tests.util.AbstractBeforeAfterRule$1.evaluate(AbstractBeforeAfterRule.java:43)
	at org.apache.lucene.tests.util.TestRuleMarkFailure$1.evaluate(TestRuleMarkFailure.java:44)
	at org.apache.lucene.tests.util.TestRuleIgnoreAfterMaxFailures$1.evaluate(TestRuleIgnoreAfterMaxFailures.java:60)
	at org.apache.lucene.tests.util.TestRuleIgnoreTestSuites$1.evaluate(TestRuleIgnoreTestSuites.java:47)
	at org.junit.rules.RunRules.evaluate(RunRules.java:20)
	at com.carrotsearch.randomizedtesting.rules.StatementAdapter.evaluate(StatementAdapter.java:36)
	at com.carrotsearch.randomizedtesting.ThreadLeakControl$StatementRunner.run(ThreadLeakControl.java:390)
	at com.carrotsearch.randomizedtesting.ThreadLeakControl.lambda$forkTimeoutingTask$0(ThreadLeakControl.java:850)
	at java.base/java.lang.Thread.run(Thread.java:1583)


FAILED:  org.apache.solr.handler.TestReplicationHandler.testUrlAllowList

Error Message:
junit.framework.AssertionFailedError: Unexpected exception type, expected SolrException but got java.nio.file.FileAlreadyExistsException: /home/jenkins/jenkins-slave/workspace/Solr/Solr-NightlyTests-main/solr/core/build/tmp/tests-tmp/org.apache.solr.handler.TestReplicationHandler_98B72E10A766CD84-001/solr-instance-036/solr.xml

Stack Trace:
junit.framework.AssertionFailedError: Unexpected exception type, expected SolrException but got java.nio.file.FileAlreadyExistsException: /home/jenkins/jenkins-slave/workspace/Solr/Solr-NightlyTests-main/solr/core/build/tmp/tests-tmp/org.apache.solr.handler.TestReplicationHandler_98B72E10A766CD84-001/solr-instance-036/solr.xml
	at __randomizedtesting.SeedInfo.seed([98B72E10A766CD84:6CB0904762314C9E]:0)
	at org.apache.lucene.tests.util.LuceneTestCase.expectThrows(LuceneTestCase.java:2890)
	at org.apache.lucene.tests.util.LuceneTestCase.expectThrows(LuceneTestCase.java:2871)
	at org.apache.solr.handler.TestReplicationHandler.testUrlAllowList(TestReplicationHandler.java:262)
	at java.base/jdk.internal.reflect.DirectMethodHandleAccessor.invoke(DirectMethodHandleAccessor.java:103)
	at java.base/java.lang.reflect.Method.invoke(Method.java:580)
	at com.carrotsearch.randomizedtesting.RandomizedRunner.invoke(RandomizedRunner.java:1758)
	at com.carrotsearch.randomizedtesting.RandomizedRunner$8.evaluate(RandomizedRunner.java:946)
	at com.carrotsearch.randomizedtesting.RandomizedRunner$9.evaluate(RandomizedRunner.java:982)
	at com.carrotsearch.randomizedtesting.RandomizedRunner$10.evaluate(RandomizedRunner.java:996)
	at com.carrotsearch.randomizedtesting.rules.SystemPropertiesRestoreRule$1.evaluate(SystemPropertiesRestoreRule.java:80)
	at org.junit.rules.RunRules.evaluate(RunRules.java:20)
	at org.apache.lucene.tests.util.TestRuleSetupTeardownChained$1.evaluate(TestRuleSetupTeardownChained.java:48)
	at org.apache.lucene.tests.util.AbstractBeforeAfterRule$1.evaluate(AbstractBeforeAfterRule.java:43)
	at org.apache.lucene.tests.util.TestRuleThreadAndTestName$1.evaluate(TestRuleThreadAndTestName.java:45)
	at org.apache.lucene.tests.util.TestRuleIgnoreAfterMaxFailures$1.evaluate(TestRuleIgnoreAfterMaxFailures.java:60)
	at org.apache.lucene.tests.util.TestRuleMarkFailure$1.evaluate(TestRuleMarkFailure.java:44)
	at org.junit.rules.RunRules.evaluate(RunRules.java:20)
	at com.carrotsearch.randomizedtesting.rules.StatementAdapter.evaluate(StatementAdapter.java:36)
	at com.carrotsearch.randomizedtesting.ThreadLeakControl$StatementRunner.run(ThreadLeakControl.java:390)
	at com.carrotsearch.randomizedtesting.ThreadLeakControl.forkTimeoutingTask(ThreadLeakControl.java:843)
	at com.carrotsearch.randomizedtesting.ThreadLeakControl$3.evaluate(ThreadLeakControl.java:490)
	at com.carrotsearch.randomizedtesting.RandomizedRunner.runSingleTest(RandomizedRunner.java:955)
	at com.carrotsearch.randomizedtesting.RandomizedRunner$5.evaluate(RandomizedRunner.java:840)
	at com.carrotsearch.randomizedtesting.RandomizedRunner$6.evaluate(RandomizedRunner.java:891)
	at com.carrotsearch.randomizedtesting.RandomizedRunner$7.evaluate(RandomizedRunner.java:902)
	at com.carrotsearch.randomizedtesting.rules.StatementAdapter.evaluate(StatementAdapter.java:36)
	at com.carrotsearch.randomizedtesting.rules.StatementAdapter.evaluate(StatementAdapter.java:36)
	at org.apache.lucene.tests.util.AbstractBeforeAfterRule$1.evaluate(AbstractBeforeAfterRule.java:43)
	at com.carrotsearch.randomizedtesting.rules.SystemPropertiesRestoreRule$1.evaluate(SystemPropertiesRestoreRule.java:80)
	at org.junit.rules.RunRules.evaluate(RunRules.java:20)
	at org.apache.lucene.tests.util.AbstractBeforeAfterRule$1.evaluate(AbstractBeforeAfterRule.java:43)
	at com.carrotsearch.randomizedtesting.rules.StatementAdapter.evaluate(StatementAdapter.java:36)
	at org.apache.lucene.tests.util.TestRuleStoreClassName$1.evaluate(TestRuleStoreClassName.java:38)
	at com.carrotsearch.randomizedtesting.rules.NoShadowingOrOverridesOnMethodsRule$1.evaluate(NoShadowingOrOverridesOnMethodsRule.java:40)
	at com.carrotsearch.randomizedtesting.rules.NoShadowingOrOverridesOnMethodsRule$1.evaluate(NoShadowingOrOverridesOnMethodsRule.java:40)
	at com.carrotsearch.randomizedtesting.rules.StatementAdapter.evaluate(StatementAdapter.java:36)
	at com.carrotsearch.randomizedtesting.rules.StatementAdapter.evaluate(StatementAdapter.java:36)
	at org.apache.lucene.tests.util.TestRuleAssertionsRequired$1.evaluate(TestRuleAssertionsRequired.java:53)
	at org.apache.lucene.tests.util.AbstractBeforeAfterRule$1.evaluate(AbstractBeforeAfterRule.java:43)
	at org.apache.lucene.tests.util.TestRuleMarkFailure$1.evaluate(TestRuleMarkFailure.java:44)
	at org.apache.lucene.tests.util.TestRuleIgnoreAfterMaxFailures$1.evaluate(TestRuleIgnoreAfterMaxFailures.java:60)
	at org.apache.lucene.tests.util.TestRuleIgnoreTestSuites$1.evaluate(TestRuleIgnoreTestSuites.java:47)
	at org.junit.rules.RunRules.evaluate(RunRules.java:20)
	at com.carrotsearch.randomizedtesting.rules.StatementAdapter.evaluate(StatementAdapter.java:36)
	at com.carrotsearch.randomizedtesting.ThreadLeakControl$StatementRunner.run(ThreadLeakControl.java:390)
	at com.carrotsearch.randomizedtesting.ThreadLeakControl.lambda$forkTimeoutingTask$0(ThreadLeakControl.java:850)
	at java.base/java.lang.Thread.run(Thread.java:1583)
Caused by: java.nio.file.FileAlreadyExistsException: /home/jenkins/jenkins-slave/workspace/Solr/Solr-NightlyTests-main/solr/core/build/tmp/tests-tmp/org.apache.solr.handler.TestReplicationHandler_98B72E10A766CD84-001/solr-instance-036/solr.xml
	at java.base/sun.nio.fs.UnixFileSystem.copy(UnixFileSystem.java:1030)
	at java.base/sun.nio.fs.UnixFileSystemProvider.copy(UnixFileSystemProvider.java:300)
	at java.base/java.nio.file.Files.copy(Files.java:1304)
	at org.apache.solr.handler.ReplicationTestHelper.createAndStartJetty(ReplicationTestHelper.java:57)
	at org.apache.solr.handler.TestReplicationHandler.createAndStartJetty(TestReplicationHandler.java:163)
	at org.apache.solr.handler.TestReplicationHandler.doTestDetails(TestReplicationHandler.java:284)
	at org.apache.lucene.tests.util.LuceneTestCase._expectThrows(LuceneTestCase.java:3043)
	at org.apache.lucene.tests.util.LuceneTestCase.expectThrows(LuceneTestCase.java:2880)
	... 46 more


FAILED:  org.apache.solr.handler.TestReplicationHandler.doTestIndexFetchWithLeaderUrl

Error Message:
java.nio.file.FileAlreadyExistsException: /home/jenkins/jenkins-slave/workspace/Solr/Solr-NightlyTests-main/solr/core/build/tmp/tests-tmp/org.apache.solr.handler.TestReplicationHandler_98B72E10A766CD84-001/solr-instance-046/solr.xml

Stack Trace:
java.nio.file.FileAlreadyExistsException: /home/jenkins/jenkins-slave/workspace/Solr/Solr-NightlyTests-main/solr/core/build/tmp/tests-tmp/org.apache.solr.handler.TestReplicationHandler_98B72E10A766CD84-001/solr-instance-046/solr.xml
	at __randomizedtesting.SeedInfo.seed([98B72E10A766CD84:365D38E1DDD85051]:0)
	at java.base/sun.nio.fs.UnixFileSystem.copy(UnixFileSystem.java:1030)
	at java.base/sun.nio.fs.UnixFileSystemProvider.copy(UnixFileSystemProvider.java:300)
	at java.base/java.nio.file.Files.copy(Files.java:1304)
	at org.apache.solr.handler.ReplicationTestHelper.createAndStartJetty(ReplicationTestHelper.java:57)
	at org.apache.solr.handler.TestReplicationHandler.createAndStartJetty(TestReplicationHandler.java:163)
	at org.apache.solr.handler.TestReplicationHandler.doTestIndexFetchWithLeaderUrl(TestReplicationHandler.java:760)
	at java.base/jdk.internal.reflect.DirectMethodHandleAccessor.invoke(DirectMethodHandleAccessor.java:103)
	at java.base/java.lang.reflect.Method.invoke(Method.java:580)
	at com.carrotsearch.randomizedtesting.RandomizedRunner.invoke(RandomizedRunner.java:1758)
	at com.carrotsearch.randomizedtesting.RandomizedRunner$8.evaluate(RandomizedRunner.java:946)
	at com.carrotsearch.randomizedtesting.RandomizedRunner$9.evaluate(RandomizedRunner.java:982)
	at com.carrotsearch.randomizedtesting.RandomizedRunner$10.evaluate(RandomizedRunner.java:996)
	at com.carrotsearch.randomizedtesting.rules.SystemPropertiesRestoreRule$1.evaluate(SystemPropertiesRestoreRule.java:80)
	at org.junit.rules.RunRules.evaluate(RunRules.java:20)
	at org.apache.lucene.tests.util.TestRuleSetupTeardownChained$1.evaluate(TestRuleSetupTeardownChained.java:48)
	at org.apache.lucene.tests.util.AbstractBeforeAfterRule$1.evaluate(AbstractBeforeAfterRule.java:43)
	at org.apache.lucene.tests.util.TestRuleThreadAndTestName$1.evaluate(TestRuleThreadAndTestName.java:45)
	at org.apache.lucene.tests.util.TestRuleIgnoreAfterMaxFailures$1.evaluate(TestRuleIgnoreAfterMaxFailures.java:60)
	at org.apache.lucene.tests.util.TestRuleMarkFailure$1.evaluate(TestRuleMarkFailure.java:44)
	at org.junit.rules.RunRules.evaluate(RunRules.java:20)
	at com.carrotsearch.randomizedtesting.rules.StatementAdapter.evaluate(StatementAdapter.java:36)
	at com.carrotsearch.randomizedtesting.ThreadLeakControl$StatementRunner.run(ThreadLeakControl.java:390)
	at com.carrotsearch.randomizedtesting.ThreadLeakControl.forkTimeoutingTask(ThreadLeakControl.java:843)
	at com.carrotsearch.randomizedtesting.ThreadLeakControl$3.evaluate(ThreadLeakControl.java:490)
	at com.carrotsearch.randomizedtesting.RandomizedRunner.runSingleTest(RandomizedRunner.java:955)
	at com.carrotsearch.randomizedtesting.RandomizedRunner$5.evaluate(RandomizedRunner.java:840)
	at com.carrotsearch.randomizedtesting.RandomizedRunner$6.evaluate(RandomizedRunner.java:891)
	at com.carrotsearch.randomizedtesting.RandomizedRunner$7.evaluate(RandomizedRunner.java:902)
	at com.carrotsearch.randomizedtesting.rules.StatementAdapter.evaluate(StatementAdapter.java:36)
	at com.carrotsearch.randomizedtesting.rules.StatementAdapter.evaluate(StatementAdapter.java:36)
	at org.apache.lucene.tests.util.AbstractBeforeAfterRule$1.evaluate(AbstractBeforeAfterRule.java:43)
	at com.carrotsearch.randomizedtesting.rules.SystemPropertiesRestoreRule$1.evaluate(SystemPropertiesRestoreRule.java:80)
	at org.junit.rules.RunRules.evaluate(RunRules.java:20)
	at org.apache.lucene.tests.util.AbstractBeforeAfterRule$1.evaluate(AbstractBeforeAfterRule.java:43)
	at com.carrotsearch.randomizedtesting.rules.StatementAdapter.evaluate(StatementAdapter.java:36)
	at org.apache.lucene.tests.util.TestRuleStoreClassName$1.evaluate(TestRuleStoreClassName.java:38)
	at com.carrotsearch.randomizedtesting.rules.NoShadowingOrOverridesOnMethodsRule$1.evaluate(NoShadowingOrOverridesOnMethodsRule.java:40)
	at com.carrotsearch.randomizedtesting.rules.NoShadowingOrOverridesOnMethodsRule$1.evaluate(NoShadowingOrOverridesOnMethodsRule.java:40)
	at com.carrotsearch.randomizedtesting.rules.StatementAdapter.evaluate(StatementAdapter.java:36)
	at com.carrotsearch.randomizedtesting.rules.StatementAdapter.evaluate(StatementAdapter.java:36)
	at org.apache.lucene.tests.util.TestRuleAssertionsRequired$1.evaluate(TestRuleAssertionsRequired.java:53)
	at org.apache.lucene.tests.util.AbstractBeforeAfterRule$1.evaluate(AbstractBeforeAfterRule.java:43)
	at org.apache.lucene.tests.util.TestRuleMarkFailure$1.evaluate(TestRuleMarkFailure.java:44)
	at org.apache.lucene.tests.util.TestRuleIgnoreAfterMaxFailures$1.evaluate(TestRuleIgnoreAfterMaxFailures.java:60)
	at org.apache.lucene.tests.util.TestRuleIgnoreTestSuites$1.evaluate(TestRuleIgnoreTestSuites.java:47)
	at org.junit.rules.RunRules.evaluate(RunRules.java:20)
	at com.carrotsearch.randomizedtesting.rules.StatementAdapter.evaluate(StatementAdapter.java:36)
	at com.carrotsearch.randomizedtesting.ThreadLeakControl$StatementRunner.run(ThreadLeakControl.java:390)
	at com.carrotsearch.randomizedtesting.ThreadLeakControl.lambda$forkTimeoutingTask$0(ThreadLeakControl.java:850)
	at java.base/java.lang.Thread.run(Thread.java:1583)


FAILED:  org.apache.solr.hdfs.cloud.HdfsChaosMonkeyNothingIsSafeTest.test

Error Message:
org.apache.solr.common.SolrException: Could not find a healthy node to handle the request.

Stack Trace:
org.apache.solr.common.SolrException: Could not find a healthy node to handle the request.
	at __randomizedtesting.SeedInfo.seed([98B72E10A766CD84:10E311CA099AA07C]:0)
	at app//org.apache.solr.client.solrj.impl.CloudSolrClient.sendRequest(CloudSolrClient.java:1132)
	at app//org.apache.solr.client.solrj.impl.CloudSolrClient.requestWithRetryOnStaleState(CloudSolrClient.java:834)
	at app//org.apache.solr.client.solrj.impl.CloudSolrClient.requestWithRetryOnStaleState(CloudSolrClient.java:970)
	at app//org.apache.solr.client.solrj.impl.CloudSolrClient.requestWithRetryOnStaleState(CloudSolrClient.java:970)
	at app//org.apache.solr.client.solrj.impl.CloudSolrClient.requestWithRetryOnStaleState(CloudSolrClient.java:970)
	at app//org.apache.solr.client.solrj.impl.CloudSolrClient.requestWithRetryOnStaleState(CloudSolrClient.java:970)
	at app//org.apache.solr.client.solrj.impl.CloudSolrClient.requestWithRetryOnStaleState(CloudSolrClient.java:970)
	at app//org.apache.solr.client.solrj.impl.CloudSolrClient.request(CloudSolrClient.java:766)
	at app//org.apache.solr.client.solrj.SolrRequest.process(SolrRequest.java:253)
	at app//org.apache.solr.client.solrj.SolrClient.commit(SolrClient.java:467)
	at app//org.apache.solr.client.solrj.SolrClient.commit(SolrClient.java:443)
	at app//org.apache.solr.cloud.AbstractFullDistribZkTestBase.commit(AbstractFullDistribZkTestBase.java:2009)
	at app//org.apache.solr.cloud.AbstractChaosMonkeyNothingIsSafeTestBase.test(AbstractChaosMonkeyNothingIsSafeTestBase.java:247)
	at java.base@21.0.3/jdk.internal.reflect.DirectMethodHandleAccessor.invoke(DirectMethodHandleAccessor.java:103)
	at java.base@21.0.3/java.lang.reflect.Method.invoke(Method.java:580)
	at app//com.carrotsearch.randomizedtesting.RandomizedRunner.invoke(RandomizedRunner.java:1758)
	at app//com.carrotsearch.randomizedtesting.RandomizedRunner$8.evaluate(RandomizedRunner.java:946)
	at app//com.carrotsearch.randomizedtesting.RandomizedRunner$9.evaluate(RandomizedRunner.java:982)
	at app//com.carrotsearch.randomizedtesting.RandomizedRunner$10.evaluate(RandomizedRunner.java:996)
	at app//org.apache.solr.BaseDistributedSearchTestCase$ShardsRepeatRule$ShardsFixedStatement.callStatement(BaseDistributedSearchTestCase.java:1070)
	at app//org.apache.solr.BaseDistributedSearchTestCase$ShardsRepeatRule$ShardsStatement.evaluate(BaseDistributedSearchTestCase.java:1041)
	at app//com.carrotsearch.randomizedtesting.rules.SystemPropertiesRestoreRule$1.evaluate(SystemPropertiesRestoreRule.java:80)
	at app//org.junit.rules.RunRules.evaluate(RunRules.java:20)
	at app//org.apache.lucene.tests.util.TestRuleSetupTeardownChained$1.evaluate(TestRuleSetupTeardownChained.java:48)
	at app//org.apache.lucene.tests.util.AbstractBeforeAfterRule$1.evaluate(AbstractBeforeAfterRule.java:43)
	at app//org.apache.lucene.tests.util.TestRuleThreadAndTestName$1.evaluate(TestRuleThreadAndTestName.java:45)
	at app//org.apache.lucene.tests.util.TestRuleIgnoreAfterMaxFailures$1.evaluate(TestRuleIgnoreAfterMaxFailures.java:60)
	at app//org.apache.lucene.tests.util.TestRuleMarkFailure$1.evaluate(TestRuleMarkFailure.java:44)
	at app//org.junit.rules.RunRules.evaluate(RunRules.java:20)
	at app//com.carrotsearch.randomizedtesting.rules.StatementAdapter.evaluate(StatementAdapter.java:36)
	at app//com.carrotsearch.randomizedtesting.ThreadLeakControl$StatementRunner.run(ThreadLeakControl.java:390)
	at app//com.carrotsearch.randomizedtesting.ThreadLeakControl.forkTimeoutingTask(ThreadLeakControl.java:843)
	at app//com.carrotsearch.randomizedtesting.ThreadLeakControl$3.evaluate(ThreadLeakControl.java:490)
	at app//com.carrotsearch.randomizedtesting.RandomizedRunner.runSingleTest(RandomizedRunner.java:955)
	at app//com.carrotsearch.randomizedtesting.RandomizedRunner$5.evaluate(RandomizedRunner.java:840)
	at app//com.carrotsearch.randomizedtesting.RandomizedRunner$6.evaluate(RandomizedRunner.java:891)
	at app//com.carrotsearch.randomizedtesting.RandomizedRunner$7.evaluate(RandomizedRunner.java:902)
	at app//com.carrotsearch.randomizedtesting.rules.StatementAdapter.evaluate(StatementAdapter.java:36)
	at app//com.carrotsearch.randomizedtesting.rules.StatementAdapter.evaluate(StatementAdapter.java:36)
	at app//org.apache.lucene.tests.util.AbstractBeforeAfterRule$1.evaluate(AbstractBeforeAfterRule.java:43)
	at app//com.carrotsearch.randomizedtesting.rules.SystemPropertiesRestoreRule$1.evaluate(SystemPropertiesRestoreRule.java:80)
	at app//org.junit.rules.RunRules.evaluate(RunRules.java:20)
	at app//org.apache.lucene.tests.util.AbstractBeforeAfterRule$1.evaluate(AbstractBeforeAfterRule.java:43)
	at app//com.carrotsearch.randomizedtesting.rules.StatementAdapter.evaluate(StatementAdapter.java:36)
	at app//org.apache.lucene.tests.util.TestRuleStoreClassName$1.evaluate(TestRuleStoreClassName.java:38)
	at app//com.carrotsearch.randomizedtesting.rules.NoShadowingOrOverridesOnMethodsRule$1.evaluate(NoShadowingOrOverridesOnMethodsRule.java:40)
	at app//com.carrotsearch.randomizedtesting.rules.NoShadowingOrOverridesOnMethodsRule$1.evaluate(NoShadowingOrOverridesOnMethodsRule.java:40)
	at app//com.carrotsearch.randomizedtesting.rules.StatementAdapter.evaluate(StatementAdapter.java:36)
	at app//com.carrotsearch.randomizedtesting.rules.StatementAdapter.evaluate(StatementAdapter.java:36)
	at app//org.apache.lucene.tests.util.TestRuleAssertionsRequired$1.evaluate(TestRuleAssertionsRequired.java:53)
	at app//org.apache.lucene.tests.util.AbstractBeforeAfterRule$1.evaluate(AbstractBeforeAfterRule.java:43)
	at app//org.apache.lucene.tests.util.TestRuleMarkFailure$1.evaluate(TestRuleMarkFailure.java:44)
	at app//org.apache.lucene.tests.util.TestRuleIgnoreAfterMaxFailures$1.evaluate(TestRuleIgnoreAfterMaxFailures.java:60)
	at app//org.apache.lucene.tests.util.TestRuleIgnoreTestSuites$1.evaluate(TestRuleIgnoreTestSuites.java:47)
	at app//org.junit.rules.RunRules.evaluate(RunRules.java:20)
	at app//com.carrotsearch.randomizedtesting.rules.StatementAdapter.evaluate(StatementAdapter.java:36)
	at app//com.carrotsearch.randomizedtesting.ThreadLeakControl$StatementRunner.run(ThreadLeakControl.java:390)
	at app//com.carrotsearch.randomizedtesting.ThreadLeakControl.lambda$forkTimeoutingTask$0(ThreadLeakControl.java:850)
	at java.base@21.0.3/java.lang.Thread.run(Thread.java:1583)


FAILED:  org.apache.solr.hdfs.cloud.HdfsChaosMonkeyNothingIsSafeTest.test

Error Message:
org.apache.solr.common.SolrException: Could not find a healthy node to handle the request.

Stack Trace:
org.apache.solr.common.SolrException: Could not find a healthy node to handle the request.
	at __randomizedtesting.SeedInfo.seed([98B72E10A766CD84:10E311CA099AA07C]:0)
	at app//org.apache.solr.client.solrj.impl.CloudSolrClient.sendRequest(CloudSolrClient.java:1132)
	at app//org.apache.solr.client.solrj.impl.CloudSolrClient.requestWithRetryOnStaleState(CloudSolrClient.java:834)
	at app//org.apache.solr.client.solrj.impl.CloudSolrClient.requestWithRetryOnStaleState(CloudSolrClient.java:970)
	at app//org.apache.solr.client.solrj.impl.CloudSolrClient.requestWithRetryOnStaleState(CloudSolrClient.java:970)
	at app//org.apache.solr.client.solrj.impl.CloudSolrClient.requestWithRetryOnStaleState(CloudSolrClient.java:970)
	at app//org.apache.solr.client.solrj.impl.CloudSolrClient.requestWithRetryOnStaleState(CloudSolrClient.java:970)
	at app//org.apache.solr.client.solrj.impl.CloudSolrClient.requestWithRetryOnStaleState(CloudSolrClient.java:970)
	at app//org.apache.solr.client.solrj.impl.CloudSolrClient.request(CloudSolrClient.java:766)
	at app//org.apache.solr.client.solrj.SolrRequest.process(SolrRequest.java:253)
	at app//org.apache.solr.client.solrj.SolrClient.commit(SolrClient.java:467)
	at app//org.apache.solr.client.solrj.SolrClient.commit(SolrClient.java:443)
	at app//org.apache.solr.cloud.AbstractFullDistribZkTestBase.commit(AbstractFullDistribZkTestBase.java:2009)
	at app//org.apache.solr.cloud.AbstractChaosMonkeyNothingIsSafeTestBase.test(AbstractChaosMonkeyNothingIsSafeTestBase.java:247)
	at java.base@21.0.3/jdk.internal.reflect.DirectMethodHandleAccessor.invoke(DirectMethodHandleAccessor.java:103)
	at java.base@21.0.3/java.lang.reflect.Method.invoke(Method.java:580)
	at app//com.carrotsearch.randomizedtesting.RandomizedRunner.invoke(RandomizedRunner.java:1758)
	at app//com.carrotsearch.randomizedtesting.RandomizedRunner$8.evaluate(RandomizedRunner.java:946)
	at app//com.carrotsearch.randomizedtesting.RandomizedRunner$9.evaluate(RandomizedRunner.java:982)
	at app//com.carrotsearch.randomizedtesting.RandomizedRunner$10.evaluate(RandomizedRunner.java:996)
	at app//org.apache.solr.BaseDistributedSearchTestCase$ShardsRepeatRule$ShardsFixedStatement.callStatement(BaseDistributedSearchTestCase.java:1070)
	at app//org.apache.solr.BaseDistributedSearchTestCase$ShardsRepeatRule$ShardsStatement.evaluate(BaseDistributedSearchTestCase.java:1041)
	at app//com.carrotsearch.randomizedtesting.rules.SystemPropertiesRestoreRule$1.evaluate(SystemPropertiesRestoreRule.java:80)
	at app//org.junit.rules.RunRules.evaluate(RunRules.java:20)
	at app//org.apache.lucene.tests.util.TestRuleSetupTeardownChained$1.evaluate(TestRuleSetupTeardownChained.java:48)
	at app//org.apache.lucene.tests.util.AbstractBeforeAfterRule$1.evaluate(AbstractBeforeAfterRule.java:43)
	at app//org.apache.lucene.tests.util.TestRuleThreadAndTestName$1.evaluate(TestRuleThreadAndTestName.java:45)
	at app//org.apache.lucene.tests.util.TestRuleIgnoreAfterMaxFailures$1.evaluate(TestRuleIgnoreAfterMaxFailures.java:60)
	at app//org.apache.lucene.tests.util.TestRuleMarkFailure$1.evaluate(TestRuleMarkFailure.java:44)
	at app//org.junit.rules.RunRules.evaluate(RunRules.java:20)
	at app//com.carrotsearch.randomizedtesting.rules.StatementAdapter.evaluate(StatementAdapter.java:36)
	at app//com.carrotsearch.randomizedtesting.ThreadLeakControl$StatementRunner.run(ThreadLeakControl.java:390)
	at app//com.carrotsearch.randomizedtesting.ThreadLeakControl.forkTimeoutingTask(ThreadLeakControl.java:843)
	at app//com.carrotsearch.randomizedtesting.ThreadLeakControl$3.evaluate(ThreadLeakControl.java:490)
	at app//com.carrotsearch.randomizedtesting.RandomizedRunner.runSingleTest(RandomizedRunner.java:955)
	at app//com.carrotsearch.randomizedtesting.RandomizedRunner$5.evaluate(RandomizedRunner.java:840)
	at app//com.carrotsearch.randomizedtesting.RandomizedRunner$6.evaluate(RandomizedRunner.java:891)
	at app//com.carrotsearch.randomizedtesting.RandomizedRunner$7.evaluate(RandomizedRunner.java:902)
	at app//com.carrotsearch.randomizedtesting.rules.StatementAdapter.evaluate(StatementAdapter.java:36)
	at app//com.carrotsearch.randomizedtesting.rules.StatementAdapter.evaluate(StatementAdapter.java:36)
	at app//org.apache.lucene.tests.util.AbstractBeforeAfterRule$1.evaluate(AbstractBeforeAfterRule.java:43)
	at app//com.carrotsearch.randomizedtesting.rules.SystemPropertiesRestoreRule$1.evaluate(SystemPropertiesRestoreRule.java:80)
	at app//org.junit.rules.RunRules.evaluate(RunRules.java:20)
	at app//org.apache.lucene.tests.util.AbstractBeforeAfterRule$1.evaluate(AbstractBeforeAfterRule.java:43)
	at app//com.carrotsearch.randomizedtesting.rules.StatementAdapter.evaluate(StatementAdapter.java:36)
	at app//org.apache.lucene.tests.util.TestRuleStoreClassName$1.evaluate(TestRuleStoreClassName.java:38)
	at app//com.carrotsearch.randomizedtesting.rules.NoShadowingOrOverridesOnMethodsRule$1.evaluate(NoShadowingOrOverridesOnMethodsRule.java:40)
	at app//com.carrotsearch.randomizedtesting.rules.NoShadowingOrOverridesOnMethodsRule$1.evaluate(NoShadowingOrOverridesOnMethodsRule.java:40)
	at app//com.carrotsearch.randomizedtesting.rules.StatementAdapter.evaluate(StatementAdapter.java:36)
	at app//com.carrotsearch.randomizedtesting.rules.StatementAdapter.evaluate(StatementAdapter.java:36)
	at app//org.apache.lucene.tests.util.TestRuleAssertionsRequired$1.evaluate(TestRuleAssertionsRequired.java:53)
	at app//org.apache.lucene.tests.util.AbstractBeforeAfterRule$1.evaluate(AbstractBeforeAfterRule.java:43)
	at app//org.apache.lucene.tests.util.TestRuleMarkFailure$1.evaluate(TestRuleMarkFailure.java:44)
	at app//org.apache.lucene.tests.util.TestRuleIgnoreAfterMaxFailures$1.evaluate(TestRuleIgnoreAfterMaxFailures.java:60)
	at app//org.apache.lucene.tests.util.TestRuleIgnoreTestSuites$1.evaluate(TestRuleIgnoreTestSuites.java:47)
	at app//org.junit.rules.RunRules.evaluate(RunRules.java:20)
	at app//com.carrotsearch.randomizedtesting.rules.StatementAdapter.evaluate(StatementAdapter.java:36)
	at app//com.carrotsearch.randomizedtesting.ThreadLeakControl$StatementRunner.run(ThreadLeakControl.java:390)
	at app//com.carrotsearch.randomizedtesting.ThreadLeakControl.lambda$forkTimeoutingTask$0(ThreadLeakControl.java:850)
	at java.base@21.0.3/java.lang.Thread.run(Thread.java:1583)


FAILED:  org.apache.solr.hdfs.cloud.HdfsChaosMonkeyNothingIsSafeTest.test

Error Message:
org.apache.solr.common.SolrException: Could not find a healthy node to handle the request.

Stack Trace:
org.apache.solr.common.SolrException: Could not find a healthy node to handle the request.
	at __randomizedtesting.SeedInfo.seed([98B72E10A766CD84:10E311CA099AA07C]:0)
	at app//org.apache.solr.client.solrj.impl.CloudSolrClient.sendRequest(CloudSolrClient.java:1132)
	at app//org.apache.solr.client.solrj.impl.CloudSolrClient.requestWithRetryOnStaleState(CloudSolrClient.java:834)
	at app//org.apache.solr.client.solrj.impl.CloudSolrClient.requestWithRetryOnStaleState(CloudSolrClient.java:970)
	at app//org.apache.solr.client.solrj.impl.CloudSolrClient.requestWithRetryOnStaleState(CloudSolrClient.java:970)
	at app//org.apache.solr.client.solrj.impl.CloudSolrClient.requestWithRetryOnStaleState(CloudSolrClient.java:970)
	at app//org.apache.solr.client.solrj.impl.CloudSolrClient.requestWithRetryOnStaleState(CloudSolrClient.java:970)
	at app//org.apache.solr.client.solrj.impl.CloudSolrClient.requestWithRetryOnStaleState(CloudSolrClient.java:970)
	at app//org.apache.solr.client.solrj.impl.CloudSolrClient.request(CloudSolrClient.java:766)
	at app//org.apache.solr.client.solrj.SolrRequest.process(SolrRequest.java:253)
	at app//org.apache.solr.client.solrj.SolrClient.commit(SolrClient.java:467)
	at app//org.apache.solr.client.solrj.SolrClient.commit(SolrClient.java:443)
	at app//org.apache.solr.cloud.AbstractFullDistribZkTestBase.commit(AbstractFullDistribZkTestBase.java:2009)
	at app//org.apache.solr.cloud.AbstractChaosMonkeyNothingIsSafeTestBase.test(AbstractChaosMonkeyNothingIsSafeTestBase.java:247)
	at java.base@21.0.3/jdk.internal.reflect.DirectMethodHandleAccessor.invoke(DirectMethodHandleAccessor.java:103)
	at java.base@21.0.3/java.lang.reflect.Method.invoke(Method.java:580)
	at app//com.carrotsearch.randomizedtesting.RandomizedRunner.invoke(RandomizedRunner.java:1758)
	at app//com.carrotsearch.randomizedtesting.RandomizedRunner$8.evaluate(RandomizedRunner.java:946)
	at app//com.carrotsearch.randomizedtesting.RandomizedRunner$9.evaluate(RandomizedRunner.java:982)
	at app//com.carrotsearch.randomizedtesting.RandomizedRunner$10.evaluate(RandomizedRunner.java:996)
	at app//org.apache.solr.BaseDistributedSearchTestCase$ShardsRepeatRule$ShardsFixedStatement.callStatement(BaseDistributedSearchTestCase.java:1070)
	at app//org.apache.solr.BaseDistributedSearchTestCase$ShardsRepeatRule$ShardsStatement.evaluate(BaseDistributedSearchTestCase.java:1041)
	at app//com.carrotsearch.randomizedtesting.rules.SystemPropertiesRestoreRule$1.evaluate(SystemPropertiesRestoreRule.java:80)
	at app//org.junit.rules.RunRules.evaluate(RunRules.java:20)
	at app//org.apache.lucene.tests.util.TestRuleSetupTeardownChained$1.evaluate(TestRuleSetupTeardownChained.java:48)
	at app//org.apache.lucene.tests.util.AbstractBeforeAfterRule$1.evaluate(AbstractBeforeAfterRule.java:43)
	at app//org.apache.lucene.tests.util.TestRuleThreadAndTestName$1.evaluate(TestRuleThreadAndTestName.java:45)
	at app//org.apache.lucene.tests.util.TestRuleIgnoreAfterMaxFailures$1.evaluate(TestRuleIgnoreAfterMaxFailures.java:60)
	at app//org.apache.lucene.tests.util.TestRuleMarkFailure$1.evaluate(TestRuleMarkFailure.java:44)
	at app//org.junit.rules.RunRules.evaluate(RunRules.java:20)
	at app//com.carrotsearch.randomizedtesting.rules.StatementAdapter.evaluate(StatementAdapter.java:36)
	at app//com.carrotsearch.randomizedtesting.ThreadLeakControl$StatementRunner.run(ThreadLeakControl.java:390)
	at app//com.carrotsearch.randomizedtesting.ThreadLeakControl.forkTimeoutingTask(ThreadLeakControl.java:843)
	at app//com.carrotsearch.randomizedtesting.ThreadLeakControl$3.evaluate(ThreadLeakControl.java:490)
	at app//com.carrotsearch.randomizedtesting.RandomizedRunner.runSingleTest(RandomizedRunner.java:955)
	at app//com.carrotsearch.randomizedtesting.RandomizedRunner$5.evaluate(RandomizedRunner.java:840)
	at app//com.carrotsearch.randomizedtesting.RandomizedRunner$6.evaluate(RandomizedRunner.java:891)
	at app//com.carrotsearch.randomizedtesting.RandomizedRunner$7.evaluate(RandomizedRunner.java:902)
	at app//com.carrotsearch.randomizedtesting.rules.StatementAdapter.evaluate(StatementAdapter.java:36)
	at app//com.carrotsearch.randomizedtesting.rules.StatementAdapter.evaluate(StatementAdapter.java:36)
	at app//org.apache.lucene.tests.util.AbstractBeforeAfterRule$1.evaluate(AbstractBeforeAfterRule.java:43)
	at app//com.carrotsearch.randomizedtesting.rules.SystemPropertiesRestoreRule$1.evaluate(SystemPropertiesRestoreRule.java:80)
	at app//org.junit.rules.RunRules.evaluate(RunRules.java:20)
	at app//org.apache.lucene.tests.util.AbstractBeforeAfterRule$1.evaluate(AbstractBeforeAfterRule.java:43)
	at app//com.carrotsearch.randomizedtesting.rules.StatementAdapter.evaluate(StatementAdapter.java:36)
	at app//org.apache.lucene.tests.util.TestRuleStoreClassName$1.evaluate(TestRuleStoreClassName.java:38)
	at app//com.carrotsearch.randomizedtesting.rules.NoShadowingOrOverridesOnMethodsRule$1.evaluate(NoShadowingOrOverridesOnMethodsRule.java:40)
	at app//com.carrotsearch.randomizedtesting.rules.NoShadowingOrOverridesOnMethodsRule$1.evaluate(NoShadowingOrOverridesOnMethodsRule.java:40)
	at app//com.carrotsearch.randomizedtesting.rules.StatementAdapter.evaluate(StatementAdapter.java:36)
	at app//com.carrotsearch.randomizedtesting.rules.StatementAdapter.evaluate(StatementAdapter.java:36)
	at app//org.apache.lucene.tests.util.TestRuleAssertionsRequired$1.evaluate(TestRuleAssertionsRequired.java:53)
	at app//org.apache.lucene.tests.util.AbstractBeforeAfterRule$1.evaluate(AbstractBeforeAfterRule.java:43)
	at app//org.apache.lucene.tests.util.TestRuleMarkFailure$1.evaluate(TestRuleMarkFailure.java:44)
	at app//org.apache.lucene.tests.util.TestRuleIgnoreAfterMaxFailures$1.evaluate(TestRuleIgnoreAfterMaxFailures.java:60)
	at app//org.apache.lucene.tests.util.TestRuleIgnoreTestSuites$1.evaluate(TestRuleIgnoreTestSuites.java:47)
	at app//org.junit.rules.RunRules.evaluate(RunRules.java:20)
	at app//com.carrotsearch.randomizedtesting.rules.StatementAdapter.evaluate(StatementAdapter.java:36)
	at app//com.carrotsearch.randomizedtesting.ThreadLeakControl$StatementRunner.run(ThreadLeakControl.java:390)
	at app//com.carrotsearch.randomizedtesting.ThreadLeakControl.lambda$forkTimeoutingTask$0(ThreadLeakControl.java:850)
	at java.base@21.0.3/java.lang.Thread.run(Thread.java:1583)


FAILED:  org.apache.solr.hdfs.cloud.HdfsChaosMonkeyNothingIsSafeTest.test

Error Message:
org.apache.solr.common.SolrException: Could not find a healthy node to handle the request.

Stack Trace:
org.apache.solr.common.SolrException: Could not find a healthy node to handle the request.
	at __randomizedtesting.SeedInfo.seed([98B72E10A766CD84:10E311CA099AA07C]:0)
	at app//org.apache.solr.client.solrj.impl.CloudSolrClient.sendRequest(CloudSolrClient.java:1132)
	at app//org.apache.solr.client.solrj.impl.CloudSolrClient.requestWithRetryOnStaleState(CloudSolrClient.java:834)
	at app//org.apache.solr.client.solrj.impl.CloudSolrClient.requestWithRetryOnStaleState(CloudSolrClient.java:970)
	at 

[...truncated too long message...]

tests.haltonfailure=false "-Ptests.jvmargs=-XX:TieredStopAtLevel=1 -XX:+UseParallelGC -XX:ActiveProcessorCount=1 -XX:ReservedCodeCacheSize=120m" -Ptests.seed=98B72E10A766CD84 -Ptests.multiplier=2 -Ptests.nightly=true -Ptests.badapples=false -Ptests.file.encoding=UTF-8 -Ptests.linedocsfile=/home/jenkins/jenkins-slave/workspace/Solr/Solr-NightlyTests-main/test-data/enwiki.random.lines.txt

  - org.apache.solr.handler.TestReplicationHandler.testRateLimitedReplication (:solr:core)
    Test history: https://ge.apache.org/scans/tests?search.rootProjectNames=solr-root&tests.container=org.apache.solr.handler.TestReplicationHandler&tests.test=testRateLimitedReplication http://fucit.org/solr-jenkins-reports/history-trend-of-recent-failures.html#series/org.apache.solr.handler.TestReplicationHandler.testRateLimitedReplication
    Test output: /home/jenkins/jenkins-slave/workspace/Solr/Solr-NightlyTests-main/solr/core/build/test-results/test/outputs/OUTPUT-org.apache.solr.handler.TestReplicationHandler.txt
    Reproduce with: ./gradlew :solr:core:test --tests "org.apache.solr.handler.TestReplicationHandler.testRateLimitedReplication" -Ptests.jvms=4 -Ptests.haltonfailure=false "-Ptests.jvmargs=-XX:TieredStopAtLevel=1 -XX:+UseParallelGC -XX:ActiveProcessorCount=1 -XX:ReservedCodeCacheSize=120m" -Ptests.seed=98B72E10A766CD84 -Ptests.multiplier=2 -Ptests.nightly=true -Ptests.badapples=false -Ptests.file.encoding=UTF-8 -Ptests.linedocsfile=/home/jenkins/jenkins-slave/workspace/Solr/Solr-NightlyTests-main/test-data/enwiki.random.lines.txt

  - org.apache.solr.handler.TestReplicationHandler.doTestDetails (:solr:core)
    Test history: https://ge.apache.org/scans/tests?search.rootProjectNames=solr-root&tests.container=org.apache.solr.handler.TestReplicationHandler&tests.test=doTestDetails http://fucit.org/solr-jenkins-reports/history-trend-of-recent-failures.html#series/org.apache.solr.handler.TestReplicationHandler.doTestDetails
    Test output: /home/jenkins/jenkins-slave/workspace/Solr/Solr-NightlyTests-main/solr/core/build/test-results/test/outputs/OUTPUT-org.apache.solr.handler.TestReplicationHandler.txt
    Reproduce with: ./gradlew :solr:core:test --tests "org.apache.solr.handler.TestReplicationHandler.doTestDetails" -Ptests.jvms=4 -Ptests.haltonfailure=false "-Ptests.jvmargs=-XX:TieredStopAtLevel=1 -XX:+UseParallelGC -XX:ActiveProcessorCount=1 -XX:ReservedCodeCacheSize=120m" -Ptests.seed=98B72E10A766CD84 -Ptests.multiplier=2 -Ptests.nightly=true -Ptests.badapples=false -Ptests.file.encoding=UTF-8 -Ptests.linedocsfile=/home/jenkins/jenkins-slave/workspace/Solr/Solr-NightlyTests-main/test-data/enwiki.random.lines.txt

  - org.apache.solr.handler.TestReplicationHandler.doTestIndexAndConfigReplication (:solr:core)
    Test history: https://ge.apache.org/scans/tests?search.rootProjectNames=solr-root&tests.container=org.apache.solr.handler.TestReplicationHandler&tests.test=doTestIndexAndConfigReplication http://fucit.org/solr-jenkins-reports/history-trend-of-recent-failures.html#series/org.apache.solr.handler.TestReplicationHandler.doTestIndexAndConfigReplication
    Test output: /home/jenkins/jenkins-slave/workspace/Solr/Solr-NightlyTests-main/solr/core/build/test-results/test/outputs/OUTPUT-org.apache.solr.handler.TestReplicationHandler.txt
    Reproduce with: ./gradlew :solr:core:test --tests "org.apache.solr.handler.TestReplicationHandler.doTestIndexAndConfigReplication" -Ptests.jvms=4 -Ptests.haltonfailure=false "-Ptests.jvmargs=-XX:TieredStopAtLevel=1 -XX:+UseParallelGC -XX:ActiveProcessorCount=1 -XX:ReservedCodeCacheSize=120m" -Ptests.seed=98B72E10A766CD84 -Ptests.multiplier=2 -Ptests.nightly=true -Ptests.badapples=false -Ptests.file.encoding=UTF-8 -Ptests.linedocsfile=/home/jenkins/jenkins-slave/workspace/Solr/Solr-NightlyTests-main/test-data/enwiki.random.lines.txt

  - org.apache.solr.handler.TestReplicationHandler.testUrlAllowList (:solr:core)
    Test history: https://ge.apache.org/scans/tests?search.rootProjectNames=solr-root&tests.container=org.apache.solr.handler.TestReplicationHandler&tests.test=testUrlAllowList http://fucit.org/solr-jenkins-reports/history-trend-of-recent-failures.html#series/org.apache.solr.handler.TestReplicationHandler.testUrlAllowList
    Test output: /home/jenkins/jenkins-slave/workspace/Solr/Solr-NightlyTests-main/solr/core/build/test-results/test/outputs/OUTPUT-org.apache.solr.handler.TestReplicationHandler.txt
    Reproduce with: ./gradlew :solr:core:test --tests "org.apache.solr.handler.TestReplicationHandler.testUrlAllowList" -Ptests.jvms=4 -Ptests.haltonfailure=false "-Ptests.jvmargs=-XX:TieredStopAtLevel=1 -XX:+UseParallelGC -XX:ActiveProcessorCount=1 -XX:ReservedCodeCacheSize=120m" -Ptests.seed=98B72E10A766CD84 -Ptests.multiplier=2 -Ptests.nightly=true -Ptests.badapples=false -Ptests.file.encoding=UTF-8 -Ptests.linedocsfile=/home/jenkins/jenkins-slave/workspace/Solr/Solr-NightlyTests-main/test-data/enwiki.random.lines.txt

  - org.apache.solr.handler.TestReplicationHandler.doTestIndexFetchWithLeaderUrl (:solr:core)
    Test history: https://ge.apache.org/scans/tests?search.rootProjectNames=solr-root&tests.container=org.apache.solr.handler.TestReplicationHandler&tests.test=doTestIndexFetchWithLeaderUrl http://fucit.org/solr-jenkins-reports/history-trend-of-recent-failures.html#series/org.apache.solr.handler.TestReplicationHandler.doTestIndexFetchWithLeaderUrl
    Test output: /home/jenkins/jenkins-slave/workspace/Solr/Solr-NightlyTests-main/solr/core/build/test-results/test/outputs/OUTPUT-org.apache.solr.handler.TestReplicationHandler.txt
    Reproduce with: ./gradlew :solr:core:test --tests "org.apache.solr.handler.TestReplicationHandler.doTestIndexFetchWithLeaderUrl" -Ptests.jvms=4 -Ptests.haltonfailure=false "-Ptests.jvmargs=-XX:TieredStopAtLevel=1 -XX:+UseParallelGC -XX:ActiveProcessorCount=1 -XX:ReservedCodeCacheSize=120m" -Ptests.seed=98B72E10A766CD84 -Ptests.multiplier=2 -Ptests.nightly=true -Ptests.badapples=false -Ptests.file.encoding=UTF-8 -Ptests.linedocsfile=/home/jenkins/jenkins-slave/workspace/Solr/Solr-NightlyTests-main/test-data/enwiki.random.lines.txt

  - org.apache.solr.cloud.RecoveryStrategyStressTest.stressTestRecovery (:solr:core)
    Test history: https://ge.apache.org/scans/tests?search.rootProjectNames=solr-root&tests.container=org.apache.solr.cloud.RecoveryStrategyStressTest&tests.test=stressTestRecovery http://fucit.org/solr-jenkins-reports/history-trend-of-recent-failures.html#series/org.apache.solr.cloud.RecoveryStrategyStressTest.stressTestRecovery
    Test output: /home/jenkins/jenkins-slave/workspace/Solr/Solr-NightlyTests-main/solr/core/build/test-results/test/outputs/OUTPUT-org.apache.solr.cloud.RecoveryStrategyStressTest.txt
    Reproduce with: ./gradlew :solr:core:test --tests "org.apache.solr.cloud.RecoveryStrategyStressTest.stressTestRecovery" -Ptests.jvms=4 -Ptests.haltonfailure=false "-Ptests.jvmargs=-XX:TieredStopAtLevel=1 -XX:+UseParallelGC -XX:ActiveProcessorCount=1 -XX:ReservedCodeCacheSize=120m" -Ptests.seed=98B72E10A766CD84 -Ptests.multiplier=2 -Ptests.nightly=true -Ptests.badapples=false -Ptests.file.encoding=UTF-8 -Ptests.linedocsfile=/home/jenkins/jenkins-slave/workspace/Solr/Solr-NightlyTests-main/test-data/enwiki.random.lines.txt

  - org.apache.solr.cloud.RecoveryStrategyStressTest (:solr:core)
    Test history: https://ge.apache.org/scans/tests?search.rootProjectNames=solr-root&tests.container=org.apache.solr.cloud.RecoveryStrategyStressTest
    Test output: /home/jenkins/jenkins-slave/workspace/Solr/Solr-NightlyTests-main/solr/core/build/test-results/test/outputs/OUTPUT-org.apache.solr.cloud.RecoveryStrategyStressTest.txt
    Reproduce with: ./gradlew :solr:core:test --tests "org.apache.solr.cloud.RecoveryStrategyStressTest" -Ptests.jvms=4 -Ptests.haltonfailure=false "-Ptests.jvmargs=-XX:TieredStopAtLevel=1 -XX:+UseParallelGC -XX:ActiveProcessorCount=1 -XX:ReservedCodeCacheSize=120m" -Ptests.seed=98B72E10A766CD84 -Ptests.multiplier=2 -Ptests.nightly=true -Ptests.badapples=false -Ptests.file.encoding=UTF-8 -Ptests.linedocsfile=/home/jenkins/jenkins-slave/workspace/Solr/Solr-NightlyTests-main/test-data/enwiki.random.lines.txt


Deprecated Gradle features were used in this build, making it incompatible with Gradle 9.0.

You can use '--warning-mode all' to show the individual deprecation warnings and determine if they come from your own scripts or plugins.

For more on this, please refer to https://docs.gradle.org/8.10/userguide/command_line_interface.html#sec:command_line_warnings in the Gradle documentation.

BUILD SUCCESSFUL in 3h 4m 43s
153 actionable tasks: 153 executed

Publishing build scan...

The Develocity server (ge.apache.org) rejected the access key with prefix 'eyJraWQiOiJhdXRoLWtleS1pZC01ZTYyNzFkNS05Zjc0LTRmMzgtYWQ4Mi0xNmRkZTA3NjY0MGIiLCJhbGciOiJSUzI1NiIsInR5cCI6IkpXVCJ9.eyJpc19hbm9ueW1vdXMiOmZhbHNlLCJwZXJtaXNzaW9ucyI6WyJWSUVXX1NDQU4iLCJFWFBPUlRfREFUQSIsIlBVQkxJU0hfU0NBTiIsIlBSRURJQ1RJVkVfVEVTVF9TRUxFQ1RJT04iLCJSRUFEX0NBQ0hFIiwiQUNDRVNTX0FMTF9EQVRBIiwiQUNDRVNTX0RBVEFfV0lUSE9VVF9BU1NPQ0lBVEVEX1BST0pFQ1QiLCJNWV9TRVRUSU5HUyIsIlJFQURfVkVSU0lPTiJdLCJhbGxEYXRhUGVybWlzc2lvbnMiOlsiVklFV19TQ0FOIiwiUFJFRElDVElWRV9URVNUX1NFTEVDVElPTiIsIlJFQURfQ0FDSEUiLCJBQ0NFU1NfQUxMX0RBVEEiLCJBQ0NFU1NfREFUQV9XSVRIT1VUX0FTU09DSUFURURfUFJPSkVDVCIsIkVYUE9SVF9EQVRBIiwiUFVCTElTSF9TQ0FOIiwiTVlfU0VUVElOR1MiLCJSRUFEX1ZFUlNJT04iXSwicHJvamVj'.
Your access key has expired - please visit https://ge.apache.org/settings/access-keys to refresh it.

Build step 'Invoke Gradle script' changed build result to SUCCESS
Archiving artifacts
‘**/*.events’ doesn’t match anything: ‘**’ exists but not ‘**/*.events’
No artifacts found that match the file pattern "**/*.events,heapdumps/**,**/hs_err_pid*". Configuration error?
Recording test results
[Checks API] No suitable checks publisher found.
Build step 'Publish JUnit test result report' changed build result to UNSTABLE
Email was triggered for: Unstable (Test Failures)
Sending email for trigger: Unstable (Test Failures)