You are viewing a plain text version of this content. The canonical link for it is here.
Posted to notifications@cxf.apache.org by Apache Jenkins Server <je...@builds.apache.org> on 2021/03/09 00:53:38 UTC
Build failed in Jenkins: CXF » CXF-JDK8-deploy » Apache CXF Transport System Tests JMS #221
See <https://ci-builds.apache.org/job/CXF/job/CXF-JDK8-deploy/org.apache.cxf.systests$cxf-systests-transport-jms/221/display/redirect>
Changes:
------------------------------------------
[INFO]
[INFO] ---------< org.apache.cxf.systests:cxf-systests-transport-jms >---------
[INFO] Building Apache CXF Transport System Tests JMS 3.5.0-SNAPSHOT [159/301]
[INFO] --------------------------------[ jar ]---------------------------------
[INFO]
[INFO] --- maven-clean-plugin:3.1.0:clean (default-clean) @ cxf-systests-transport-jms ---
[INFO] Deleting <https://ci-builds.apache.org/job/CXF/job/CXF-JDK8-deploy/org.apache.cxf.systests$cxf-systests-transport-jms/ws/target>
[INFO]
[INFO] --- maven-enforcer-plugin:3.0.0-M3:enforce (enforce-maven) @ cxf-systests-transport-jms ---
[INFO]
[INFO] --- maven-bundle-plugin:5.1.1:cleanVersions (versions) @ cxf-systests-transport-jms ---
[INFO]
[INFO] --- cxf-xml2fastinfoset-plugin:3.4.4:xml2fastinfoset (xml2fastinfoset) @ cxf-systests-transport-jms ---
[INFO]
[INFO] --- cxf-xjc-plugin:3.3.1:xsdtojava (generate-sources) @ cxf-systests-transport-jms ---
[INFO]
[INFO] --- maven-remote-resources-plugin:1.7.0:process (default) @ cxf-systests-transport-jms ---
[INFO] Preparing remote bundle org.apache:apache-jar-resource-bundle:1.4
[INFO] Copying 3 resources from 1 bundle.
[INFO]
[INFO] --- maven-resources-plugin:3.1.0:resources (default-resources) @ cxf-systests-transport-jms ---
[INFO] Using 'UTF-8' encoding to copy filtered resources.
[INFO] skip non existing resourceDirectory <https://ci-builds.apache.org/job/CXF/job/CXF-JDK8-deploy/org.apache.cxf.systests$cxf-systests-transport-jms/ws/src/main/java>
[INFO] skip non existing resourceDirectory <https://ci-builds.apache.org/job/CXF/job/CXF-JDK8-deploy/org.apache.cxf.systests$cxf-systests-transport-jms/ws/src/main/resources>
[INFO] skip non existing resourceDirectory <https://ci-builds.apache.org/job/CXF/job/CXF-JDK8-deploy/org.apache.cxf.systests$cxf-systests-transport-jms/ws/src/main/resources-filtered>
[INFO] skip non existing resourceDirectory <https://ci-builds.apache.org/job/CXF/job/CXF-JDK8-deploy/org.apache.cxf.systests$cxf-systests-transport-jms/ws/target/generated/src/main/resources>
[INFO] Copying 3 resources
[INFO]
[INFO] --- maven-compiler-plugin:3.8.1:compile (default-compile) @ cxf-systests-transport-jms ---
[INFO] Changes detected - recompiling the module!
[INFO] Compiling 6 source files to <https://ci-builds.apache.org/job/CXF/job/CXF-JDK8-deploy/org.apache.cxf.systests$cxf-systests-transport-jms/ws/target/classes>
[INFO]
[INFO] --- cxf-codegen-plugin:3.5.0-SNAPSHOT:wsdl2java (generate-test-sources) @ cxf-systests-transport-jms ---
[INFO] Nothing to generate
[INFO]
[INFO] --- maven-resources-plugin:3.1.0:testResources (default-testResources) @ cxf-systests-transport-jms ---
[INFO] Using 'UTF-8' encoding to copy filtered resources.
[INFO] Copying 8 resources
[INFO] Copying 6 resources
[INFO] skip non existing resourceDirectory <https://ci-builds.apache.org/job/CXF/job/CXF-JDK8-deploy/org.apache.cxf.systests$cxf-systests-transport-jms/ws/target/generated/src/test/resources>
[INFO] Copying 3 resources
[INFO]
[INFO] --- maven-compiler-plugin:3.8.1:testCompile (default-testCompile) @ cxf-systests-transport-jms ---
[INFO] Changes detected - recompiling the module!
[INFO] Compiling 92 source files to <https://ci-builds.apache.org/job/CXF/job/CXF-JDK8-deploy/org.apache.cxf.systests$cxf-systests-transport-jms/ws/target/test-classes>
[INFO] -------------------------------------------------------------
[ERROR] COMPILATION ERROR :
[INFO] -------------------------------------------------------------
[ERROR] <https://ci-builds.apache.org/job/CXF/job/CXF-JDK8-deploy/org.apache.cxf.systests$cxf-systests-transport-jms/ws/src/test/java/org/apache/cxf/systest/jms/JMSClientServerTest.java>:[64,41] cannot find symbol
symbol: class TestReceiver
location: package org.apache.cxf.transport.jms.util
[ERROR] <https://ci-builds.apache.org/job/CXF/job/CXF-JDK8-deploy/org.apache.cxf.systests$cxf-systests-transport-jms/ws/src/test/java/org/apache/cxf/systest/jms/JMSClientServerTest.java>:[596,9] cannot find symbol
symbol: class TestReceiver
location: class org.apache.cxf.systest.jms.JMSClientServerTest
[ERROR] <https://ci-builds.apache.org/job/CXF/job/CXF-JDK8-deploy/org.apache.cxf.systests$cxf-systests-transport-jms/ws/src/test/java/org/apache/cxf/systest/jms/JMSClientServerTest.java>:[596,37] cannot find symbol
symbol: class TestReceiver
location: class org.apache.cxf.systest.jms.JMSClientServerTest
[INFO] 3 errors
[INFO] -------------------------------------------------------------
Jenkins build is back to normal : CXF » CXF-JDK8-deploy » Apache CXF Transport System Tests JMS #222
Posted by Apache Jenkins Server <je...@builds.apache.org>.
See <https://ci-builds.apache.org/job/CXF/job/CXF-JDK8-deploy/org.apache.cxf.systests$cxf-systests-transport-jms/222/display/redirect?page=changes>