You are viewing a plain text version of this content. The canonical link for it is here.
Posted to dev@royale.apache.org by ap...@gmail.com on 2019/11/21 15:32:29 UTC
Royale_Release_Step_N002 - Build # 1 - Failure!
Royale_Release_Step_N002 - Build # 1 - Failure:
Check console output at http://apacheroyaleci2.westus2.cloudapp.azure.com:8080/job/Royale_Release_Step_N002/1/ to view the results.
Re: Royale_Release_Step_N002 - Build # 13 - Still Failing!
Posted by Alex Harui <ah...@adobe.com.INVALID>.
It just occurred to me that CI should not be invoking GPG at all! I noticed in another commit that you had restored the skipGPG property. The profiles and other parameters passed to Maven when running on the CI server should set skipGPG and force Maven to skip GPG signing.
-Alex
On 11/25/19, 10:35 AM, "Carlos Rovira" <ca...@apache.org> wrote:
Hi,
just installed Gpg4Win on CI Server. Now the log fails since it reports no
there's no secret key, what is ok, since there's nothing about it in the
entire process.
[INFO] gpg: no default secret key: No secret key
[INFO] gpg: signing failed: No secret key
So I don't really understand why we need to have GPG, if the RS#2 doesn't
have any info for signing (and I think is not part of that process).
This the final part of the log:
[INFO] [DEBUG] Generating signature for
C:\jenkins\workspace\Royale_Release_Step_N002\target\royale-compiler-parent-0.9.7.pom
[INFO] gpg: no default secret key: No secret key
[INFO] gpg: signing failed: No secret key
[INFO] [INFO]
------------------------------------------------------------------------
[INFO] [INFO] Reactor Summary for Apache Royale: Compiler: Parent 0.9.7:
[INFO] [INFO]
[INFO] [INFO] Apache Royale: Compiler: Parent .................... FAILURE
[ 51.757 s]
[INFO] [INFO] Apache Royale: Compiler: Compiler-Common ........... SKIPPED
[INFO] [INFO] Apache Royale: Compiler: Test Utils ................ SKIPPED
[INFO] [INFO] Apache Royale: Compiler: Externc ................... SKIPPED
[INFO] [INFO] Apache Royale: Compiler: Compiler .................. SKIPPED
[INFO] [INFO] Apache Royale: Compiler: Compiler-JX ............... SKIPPED
[INFO] [INFO] Apache Royale: Compiler: SWFUtils .................. SKIPPED
[INFO] [INFO] Apache Royale: Compiler: Debugger .................. SKIPPED
[INFO] [INFO] Apache Royale: Compiler: OEM Layer ................. SKIPPED
[INFO] [INFO] Apache Royale: Royale Ant Tasks .................... SKIPPED
[INFO] [INFO] Apache Royale: RoyaleUnit Ant Tasks ................ SKIPPED
[INFO] [INFO] Apache Royale: Royale Maven Plugin ................. SKIPPED
[INFO] [INFO]
------------------------------------------------------------------------
[INFO] [INFO] BUILD FAILURE
[INFO] [INFO]
------------------------------------------------------------------------
[INFO] [INFO] Total time: 52.435 s
[INFO] [INFO] Finished at: 2019-11-25T18:30:01Z
[INFO] [INFO]
------------------------------------------------------------------------
[INFO] [WARNING] The requested profile "debug-pom" could not be activated
because it does not exist.
[INFO] [ERROR] Failed to execute goal
org.apache.maven.plugins:maven-gpg-plugin:1.6:sign (sign-release-artifacts)
on project royale-compiler-parent: Exit code: 2 -> [Help 1]
[INFO] org.apache.maven.lifecycle.LifecycleExecutionException: Failed to
execute goal org.apache.maven.plugins:maven-gpg-plugin:1.6:sign
(sign-release-artifacts) on project royale-compiler-parent: Exit code: 2
[INFO] at org.apache.maven.lifecycle.internal.MojoExecutor.execute
(MojoExecutor.java:215)
[INFO] at org.apache.maven.lifecycle.internal.MojoExecutor.execute
(MojoExecutor.java:156)
[INFO] at org.apache.maven.lifecycle.internal.MojoExecutor.execute
(MojoExecutor.java:148)
[INFO] at
org.apache.maven.lifecycle.internal.LifecycleModuleBuilder.buildProject
(LifecycleModuleBuilder.java:117)
[INFO] at
org.apache.maven.lifecycle.internal.LifecycleModuleBuilder.buildProject
(LifecycleModuleBuilder.java:81)
[INFO] at
org.apache.maven.lifecycle.internal.builder.singlethreaded.SingleThreadedBuilder.build
(SingleThreadedBuilder.java:56)
[INFO] at org.apache.maven.lifecycle.internal.LifecycleStarter.execute
(LifecycleStarter.java:128)
[INFO] at org.apache.maven.DefaultMaven.doExecute
(DefaultMaven.java:305)
[INFO] at org.apache.maven.DefaultMaven.doExecute
(DefaultMaven.java:192)
[INFO] at org.apache.maven.DefaultMaven.execute (DefaultMaven.java:105)
[INFO] at org.apache.maven.cli.MavenCli.execute (MavenCli.java:956)
[INFO] at org.apache.maven.cli.MavenCli.doMain (MavenCli.java:288)
[INFO] at org.apache.maven.cli.MavenCli.main (MavenCli.java:192)
[INFO] at sun.reflect.NativeMethodAccessorImpl.invoke0 (Native Method)
[INFO] at sun.reflect.NativeMethodAccessorImpl.invoke
(NativeMethodAccessorImpl.java:62)
[INFO] at sun.reflect.DelegatingMethodAccessorImpl.invoke
(DelegatingMethodAccessorImpl.java:43)
[INFO] at java.lang.reflect.Method.invoke (Method.java:498)
[INFO] at
org.codehaus.plexus.classworlds.launcher.Launcher.launchEnhanced
(Launcher.java:289)
[INFO] at org.codehaus.plexus.classworlds.launcher.Launcher.launch
(Launcher.java:229)
[INFO] at
org.codehaus.plexus.classworlds.launcher.Launcher.mainWithExitCode
(Launcher.java:415)
[INFO] at org.codehaus.plexus.classworlds.launcher.Launcher.main
(Launcher.java:356)
[INFO] Caused by: org.apache.maven.plugin.MojoExecutionException: Exit
code: 2
[INFO] at
org.apache.maven.plugin.gpg.GpgSigner.generateSignatureForFile
(GpgSigner.java:167)
[INFO] at
org.apache.maven.plugin.gpg.AbstractGpgSigner.generateSignatureForArtifact
(AbstractGpgSigner.java:205)
[INFO] at org.apache.maven.plugin.gpg.GpgSignAttachedMojo.execute
(GpgSignAttachedMojo.java:176)
[INFO] at org.apache.maven.plugin.DefaultBuildPluginManager.executeMojo
(DefaultBuildPluginManager.java:137)
[INFO] at org.apache.maven.lifecycle.internal.MojoExecutor.execute
(MojoExecutor.java:210)
[INFO] at org.apache.maven.lifecycle.internal.MojoExecutor.execute
(MojoExecutor.java:156)
[INFO] at org.apache.maven.lifecycle.internal.MojoExecutor.execute
(MojoExecutor.java:148)
[INFO] at
org.apache.maven.lifecycle.internal.LifecycleModuleBuilder.buildProject
(LifecycleModuleBuilder.java:117)
[INFO] at
org.apache.maven.lifecycle.internal.LifecycleModuleBuilder.buildProject
(LifecycleModuleBuilder.java:81)
[INFO] at
org.apache.maven.lifecycle.internal.builder.singlethreaded.SingleThreadedBuilder.build
(SingleThreadedBuilder.java:56)
[INFO] at org.apache.maven.lifecycle.internal.LifecycleStarter.execute
(LifecycleStarter.java:128)
[INFO] at org.apache.maven.DefaultMaven.doExecute
(DefaultMaven.java:305)
[INFO] at org.apache.maven.DefaultMaven.doExecute
(DefaultMaven.java:192)
[INFO] at org.apache.maven.DefaultMaven.execute (DefaultMaven.java:105)
[INFO] at org.apache.maven.cli.MavenCli.execute (MavenCli.java:956)
[INFO] at org.apache.maven.cli.MavenCli.doMain (MavenCli.java:288)
[INFO] at org.apache.maven.cli.MavenCli.main (MavenCli.java:192)
[INFO] at sun.reflect.NativeMethodAccessorImpl.invoke0 (Native Method)
[INFO] at sun.reflect.NativeMethodAccessorImpl.invoke
(NativeMethodAccessorImpl.java:62)
[INFO] at sun.reflect.DelegatingMethodAccessorImpl.invoke
(DelegatingMethodAccessorImpl.java:43)
[INFO] at java.lang.reflect.Method.invoke (Method.java:498)
[INFO] at
org.codehaus.plexus.classworlds.launcher.Launcher.launchEnhanced
(Launcher.java:289)
[INFO] at org.codehaus.plexus.classworlds.launcher.Launcher.launch
(Launcher.java:229)
[INFO] at
org.codehaus.plexus.classworlds.launcher.Launcher.mainWithExitCode
(Launcher.java:415)
[INFO] at org.codehaus.plexus.classworlds.launcher.Launcher.main
(Launcher.java:356)
[INFO] [ERROR]
[INFO] [ERROR]
[INFO] [ERROR] For more information about the errors and possible
solutions, please read the following articles:
[INFO] [ERROR] [Help 1]
https://nam04.safelinks.protection.outlook.com/?url=http%3A%2F%2Fcwiki.apache.org%2Fconfluence%2Fdisplay%2FMAVEN%2FMojoExecutionException&data=02%7C01%7Caharui%40adobe.com%7C5ab54aa2d88741db348d08d771d64124%7Cfa7b1b5a7b34438794aed2c178decee1%7C0%7C0%7C637103037349654779&sdata=XRNgoo9jPC4Qk%2Bl9EnmoWeyVhPqO0hssmLEQP%2Fee1nQ%3D&reserved=0
[INFO] Picked up JAVA_TOOL_OPTIONS: -Dfile.encoding=UTF-8 -Xms384m -Xmx2g
[INFO]
------------------------------------------------------------------------
[INFO] Reactor Summary for Apache Royale: Compiler: Parent 0.9.7-SNAPSHOT:
[INFO]
[INFO] Apache Royale: Compiler: Parent .................... FAILURE [01:01
min]
[INFO] Apache Royale: Compiler: Compiler-Common ........... SKIPPED
[INFO] Apache Royale: Compiler: Test Utils ................ SKIPPED
[INFO] Apache Royale: Compiler: Externc ................... SKIPPED
[INFO] Apache Royale: Compiler: Compiler .................. SKIPPED
[INFO] Apache Royale: Compiler: Compiler-JX ............... SKIPPED
[INFO] Apache Royale: Compiler: SWFUtils .................. SKIPPED
[INFO] Apache Royale: Compiler: Debugger .................. SKIPPED
[INFO] Apache Royale: Compiler: OEM Layer ................. SKIPPED
[INFO] Apache Royale: Royale Ant Tasks .................... SKIPPED
[INFO] Apache Royale: RoyaleUnit Ant Tasks ................ SKIPPED
[INFO] Apache Royale: Royale Maven Plugin ................. SKIPPED
[INFO]
------------------------------------------------------------------------
[INFO] BUILD FAILURE
[INFO]
------------------------------------------------------------------------
[INFO] Total time: 01:03 min
[INFO] Finished at: 2019-11-25T18:30:01Z
[INFO]
------------------------------------------------------------------------
[WARNING] The requested profile "debug-pom" could not be activated because
it does not exist.
[ERROR] Failed to execute goal
org.apache.maven.plugins:maven-release-plugin:2.5.3:prepare (default-cli)
on project royale-compiler-parent: Maven execution failed, exit code: '1'
-> [Help 1]
org.apache.maven.lifecycle.LifecycleExecutionException: Failed to execute
goal org.apache.maven.plugins:maven-release-plugin:2.5.3:prepare
(default-cli) on project royale-compiler-parent: Maven execution failed,
exit code: '1'
at org.apache.maven.lifecycle.internal.MojoExecutor.execute
(MojoExecutor.java:215)
at org.apache.maven.lifecycle.internal.MojoExecutor.execute
(MojoExecutor.java:156)
at org.apache.maven.lifecycle.internal.MojoExecutor.execute
(MojoExecutor.java:148)
at
org.apache.maven.lifecycle.internal.LifecycleModuleBuilder.buildProject
(LifecycleModuleBuilder.java:117)
at
org.apache.maven.lifecycle.internal.LifecycleModuleBuilder.buildProject
(LifecycleModuleBuilder.java:81)
at
org.apache.maven.lifecycle.internal.builder.singlethreaded.SingleThreadedBuilder.build
(SingleThreadedBuilder.java:56)
at org.apache.maven.lifecycle.internal.LifecycleStarter.execute
(LifecycleStarter.java:128)
at org.apache.maven.DefaultMaven.doExecute (DefaultMaven.java:305)
at org.apache.maven.DefaultMaven.doExecute (DefaultMaven.java:192)
at org.apache.maven.DefaultMaven.execute (DefaultMaven.java:105)
at org.apache.maven.cli.MavenCli.execute (MavenCli.java:956)
at org.apache.maven.cli.MavenCli.doMain (MavenCli.java:288)
at org.apache.maven.cli.MavenCli.main (MavenCli.java:192)
at sun.reflect.NativeMethodAccessorImpl.invoke0 (Native Method)
at sun.reflect.NativeMethodAccessorImpl.invoke
(NativeMethodAccessorImpl.java:62)
at sun.reflect.DelegatingMethodAccessorImpl.invoke
(DelegatingMethodAccessorImpl.java:43)
at java.lang.reflect.Method.invoke (Method.java:498)
at org.codehaus.plexus.classworlds.launcher.Launcher.launchEnhanced
(Launcher.java:289)
at org.codehaus.plexus.classworlds.launcher.Launcher.launch
(Launcher.java:229)
at org.codehaus.plexus.classworlds.launcher.Launcher.mainWithExitCode
(Launcher.java:415)
at org.codehaus.plexus.classworlds.launcher.Launcher.main
(Launcher.java:356)
Caused by: org.apache.maven.plugin.MojoExecutionException: Maven execution
failed, exit code: '1'
at org.apache.maven.plugins.release.PrepareReleaseMojo.prepareRelease
(PrepareReleaseMojo.java:290)
at org.apache.maven.plugins.release.PrepareReleaseMojo.execute
(PrepareReleaseMojo.java:240)
at org.apache.maven.plugin.DefaultBuildPluginManager.executeMojo
(DefaultBuildPluginManager.java:137)
at org.apache.maven.lifecycle.internal.MojoExecutor.execute
(MojoExecutor.java:210)
at org.apache.maven.lifecycle.internal.MojoExecutor.execute
(MojoExecutor.java:156)
at org.apache.maven.lifecycle.internal.MojoExecutor.execute
(MojoExecutor.java:148)
at
org.apache.maven.lifecycle.internal.LifecycleModuleBuilder.buildProject
(LifecycleModuleBuilder.java:117)
at
org.apache.maven.lifecycle.internal.LifecycleModuleBuilder.buildProject
(LifecycleModuleBuilder.java:81)
at
org.apache.maven.lifecycle.internal.builder.singlethreaded.SingleThreadedBuilder.build
(SingleThreadedBuilder.java:56)
at org.apache.maven.lifecycle.internal.LifecycleStarter.execute
(LifecycleStarter.java:128)
at org.apache.maven.DefaultMaven.doExecute (DefaultMaven.java:305)
at org.apache.maven.DefaultMaven.doExecute (DefaultMaven.java:192)
at org.apache.maven.DefaultMaven.execute (DefaultMaven.java:105)
at org.apache.maven.cli.MavenCli.execute (MavenCli.java:956)
at org.apache.maven.cli.MavenCli.doMain (MavenCli.java:288)
at org.apache.maven.cli.MavenCli.main (MavenCli.java:192)
at sun.reflect.NativeMethodAccessorImpl.invoke0 (Native Method)
at sun.reflect.NativeMethodAccessorImpl.invoke
(NativeMethodAccessorImpl.java:62)
at sun.reflect.DelegatingMethodAccessorImpl.invoke
(DelegatingMethodAccessorImpl.java:43)
at java.lang.reflect.Method.invoke (Method.java:498)
at org.codehaus.plexus.classworlds.launcher.Launcher.launchEnhanced
(Launcher.java:289)
at org.codehaus.plexus.classworlds.launcher.Launcher.launch
(Launcher.java:229)
at org.codehaus.plexus.classworlds.launcher.Launcher.mainWithExitCode
(Launcher.java:415)
at org.codehaus.plexus.classworlds.launcher.Launcher.main
(Launcher.java:356)
Caused by: org.apache.maven.shared.release.ReleaseExecutionException: Maven
execution failed, exit code: '1'
at org.apache.maven.shared.release.phase.AbstractRunGoalsPhase.execute
(AbstractRunGoalsPhase.java:91)
at org.apache.maven.shared.release.phase.RunPrepareGoalsPhase.execute
(RunPrepareGoalsPhase.java:44)
at org.apache.maven.shared.release.DefaultReleaseManager.prepare
(DefaultReleaseManager.java:234)
at org.apache.maven.shared.release.DefaultReleaseManager.prepare
(DefaultReleaseManager.java:169)
at org.apache.maven.shared.release.DefaultReleaseManager.prepare
(DefaultReleaseManager.java:146)
at org.apache.maven.shared.release.DefaultReleaseManager.prepare
(DefaultReleaseManager.java:107)
at org.apache.maven.plugins.release.PrepareReleaseMojo.prepareRelease
(PrepareReleaseMojo.java:286)
at org.apache.maven.plugins.release.PrepareReleaseMojo.execute
(PrepareReleaseMojo.java:240)
at org.apache.maven.plugin.DefaultBuildPluginManager.executeMojo
(DefaultBuildPluginManager.java:137)
at org.apache.maven.lifecycle.internal.MojoExecutor.execute
(MojoExecutor.java:210)
at org.apache.maven.lifecycle.internal.MojoExecutor.execute
(MojoExecutor.java:156)
at org.apache.maven.lifecycle.internal.MojoExecutor.execute
(MojoExecutor.java:148)
at
org.apache.maven.lifecycle.internal.LifecycleModuleBuilder.buildProject
(LifecycleModuleBuilder.java:117)
at
org.apache.maven.lifecycle.internal.LifecycleModuleBuilder.buildProject
(LifecycleModuleBuilder.java:81)
at
org.apache.maven.lifecycle.internal.builder.singlethreaded.SingleThreadedBuilder.build
(SingleThreadedBuilder.java:56)
at org.apache.maven.lifecycle.internal.LifecycleStarter.execute
(LifecycleStarter.java:128)
at org.apache.maven.DefaultMaven.doExecute (DefaultMaven.java:305)
at org.apache.maven.DefaultMaven.doExecute (DefaultMaven.java:192)
at org.apache.maven.DefaultMaven.execute (DefaultMaven.java:105)
at org.apache.maven.cli.MavenCli.execute (MavenCli.java:956)
at org.apache.maven.cli.MavenCli.doMain (MavenCli.java:288)
at org.apache.maven.cli.MavenCli.main (MavenCli.java:192)
at sun.reflect.NativeMethodAccessorImpl.invoke0 (Native Method)
at sun.reflect.NativeMethodAccessorImpl.invoke
(NativeMethodAccessorImpl.java:62)
at sun.reflect.DelegatingMethodAccessorImpl.invoke
(DelegatingMethodAccessorImpl.java:43)
at java.lang.reflect.Method.invoke (Method.java:498)
at org.codehaus.plexus.classworlds.launcher.Launcher.launchEnhanced
(Launcher.java:289)
at org.codehaus.plexus.classworlds.launcher.Launcher.launch
(Launcher.java:229)
at org.codehaus.plexus.classworlds.launcher.Launcher.mainWithExitCode
(Launcher.java:415)
at org.codehaus.plexus.classworlds.launcher.Launcher.main
(Launcher.java:356)
Caused by: org.apache.maven.shared.release.exec.MavenExecutorException:
Maven execution failed, exit code: '1'
at
org.apache.maven.shared.release.exec.InvokerMavenExecutor.executeGoals
(InvokerMavenExecutor.java:433)
at
org.apache.maven.shared.release.exec.AbstractMavenExecutor.executeGoals
(AbstractMavenExecutor.java:114)
at org.apache.maven.shared.release.phase.AbstractRunGoalsPhase.execute
(AbstractRunGoalsPhase.java:85)
at org.apache.maven.shared.release.phase.RunPrepareGoalsPhase.execute
(RunPrepareGoalsPhase.java:44)
at org.apache.maven.shared.release.DefaultReleaseManager.prepare
(DefaultReleaseManager.java:234)
at org.apache.maven.shared.release.DefaultReleaseManager.prepare
(DefaultReleaseManager.java:169)
at org.apache.maven.shared.release.DefaultReleaseManager.prepare
(DefaultReleaseManager.java:146)
at org.apache.maven.shared.release.DefaultReleaseManager.prepare
(DefaultReleaseManager.java:107)
at org.apache.maven.plugins.release.PrepareReleaseMojo.prepareRelease
(PrepareReleaseMojo.java:286)
at org.apache.maven.plugins.release.PrepareReleaseMojo.execute
(PrepareReleaseMojo.java:240)
at org.apache.maven.plugin.DefaultBuildPluginManager.executeMojo
(DefaultBuildPluginManager.java:137)
at org.apache.maven.lifecycle.internal.MojoExecutor.execute
(MojoExecutor.java:210)
at org.apache.maven.lifecycle.internal.MojoExecutor.execute
(MojoExecutor.java:156)
at org.apache.maven.lifecycle.internal.MojoExecutor.execute
(MojoExecutor.java:148)
at
org.apache.maven.lifecycle.internal.LifecycleModuleBuilder.buildProject
(LifecycleModuleBuilder.java:117)
at
org.apache.maven.lifecycle.internal.LifecycleModuleBuilder.buildProject
(LifecycleModuleBuilder.java:81)
at
org.apache.maven.lifecycle.internal.builder.singlethreaded.SingleThreadedBuilder.build
(SingleThreadedBuilder.java:56)
at org.apache.maven.lifecycle.internal.LifecycleStarter.execute
(LifecycleStarter.java:128)
at org.apache.maven.DefaultMaven.doExecute (DefaultMaven.java:305)
at org.apache.maven.DefaultMaven.doExecute (DefaultMaven.java:192)
at org.apache.maven.DefaultMaven.execute (DefaultMaven.java:105)
at org.apache.maven.cli.MavenCli.execute (MavenCli.java:956)
at org.apache.maven.cli.MavenCli.doMain (MavenCli.java:288)
at org.apache.maven.cli.MavenCli.main (MavenCli.java:192)
at sun.reflect.NativeMethodAccessorImpl.invoke0 (Native Method)
at sun.reflect.NativeMethodAccessorImpl.invoke
(NativeMethodAccessorImpl.java:62)
at sun.reflect.DelegatingMethodAccessorImpl.invoke
(DelegatingMethodAccessorImpl.java:43)
at java.lang.reflect.Method.invoke (Method.java:498)
at org.codehaus.plexus.classworlds.launcher.Launcher.launchEnhanced
(Launcher.java:289)
at org.codehaus.plexus.classworlds.launcher.Launcher.launch
(Launcher.java:229)
at org.codehaus.plexus.classworlds.launcher.Launcher.mainWithExitCode
(Launcher.java:415)
at org.codehaus.plexus.classworlds.launcher.Launcher.main
(Launcher.java:356)
[ERROR]
[ERROR]
[ERROR] For more information about the errors and possible solutions,
please read the following articles:
[ERROR] [Help 1]
https://nam04.safelinks.protection.outlook.com/?url=http%3A%2F%2Fcwiki.apache.org%2Fconfluence%2Fdisplay%2FMAVEN%2FMojoExecutionException&data=02%7C01%7Caharui%40adobe.com%7C5ab54aa2d88741db348d08d771d64124%7Cfa7b1b5a7b34438794aed2c178decee1%7C0%7C0%7C637103037349654779&sdata=XRNgoo9jPC4Qk%2Bl9EnmoWeyVhPqO0hssmLEQP%2Fee1nQ%3D&reserved=0
Build step 'Invoke top-level Maven targets' marked build as failure
Email was triggered for: Failure - Any
Sending email for trigger: Failure - Any
Sending email to: dev@royale.apache.org
Finished: FAILURE
El lun., 25 nov. 2019 a las 19:30, <ap...@gmail.com> escribió:
> Royale_Release_Step_N002 - Build # 13 - Still Failing:
>
> Check console output at
> https://nam04.safelinks.protection.outlook.com/?url=http%3A%2F%2Fapacheroyaleci2.westus2.cloudapp.azure.com%3A8080%2Fjob%2FRoyale_Release_Step_N002%2F13%2F&data=02%7C01%7Caharui%40adobe.com%7C5ab54aa2d88741db348d08d771d64124%7Cfa7b1b5a7b34438794aed2c178decee1%7C0%7C0%7C637103037349654779&sdata=l%2FVCM8WlqgeV8PLfOCWuyYnRV1%2BOuRT%2BglGRUpSb0OQ%3D&reserved=0
> to view the results.
--
Carlos Rovira
https://nam04.safelinks.protection.outlook.com/?url=http%3A%2F%2Fabout.me%2Fcarlosrovira&data=02%7C01%7Caharui%40adobe.com%7C5ab54aa2d88741db348d08d771d64124%7Cfa7b1b5a7b34438794aed2c178decee1%7C0%7C0%7C637103037349654779&sdata=7KDZHnMPpRpLv110A%2Boe325IX8m8t%2B0gqbMqioK%2FvWs%3D&reserved=0
Re: Royale_Release_Step_N002 - Build # 13 - Still Failing!
Posted by Carlos Rovira <ca...@apache.org>.
Hi,
just installed Gpg4Win on CI Server. Now the log fails since it reports no
there's no secret key, what is ok, since there's nothing about it in the
entire process.
[INFO] gpg: no default secret key: No secret key
[INFO] gpg: signing failed: No secret key
So I don't really understand why we need to have GPG, if the RS#2 doesn't
have any info for signing (and I think is not part of that process).
This the final part of the log:
[INFO] [DEBUG] Generating signature for
C:\jenkins\workspace\Royale_Release_Step_N002\target\royale-compiler-parent-0.9.7.pom
[INFO] gpg: no default secret key: No secret key
[INFO] gpg: signing failed: No secret key
[INFO] [INFO]
------------------------------------------------------------------------
[INFO] [INFO] Reactor Summary for Apache Royale: Compiler: Parent 0.9.7:
[INFO] [INFO]
[INFO] [INFO] Apache Royale: Compiler: Parent .................... FAILURE
[ 51.757 s]
[INFO] [INFO] Apache Royale: Compiler: Compiler-Common ........... SKIPPED
[INFO] [INFO] Apache Royale: Compiler: Test Utils ................ SKIPPED
[INFO] [INFO] Apache Royale: Compiler: Externc ................... SKIPPED
[INFO] [INFO] Apache Royale: Compiler: Compiler .................. SKIPPED
[INFO] [INFO] Apache Royale: Compiler: Compiler-JX ............... SKIPPED
[INFO] [INFO] Apache Royale: Compiler: SWFUtils .................. SKIPPED
[INFO] [INFO] Apache Royale: Compiler: Debugger .................. SKIPPED
[INFO] [INFO] Apache Royale: Compiler: OEM Layer ................. SKIPPED
[INFO] [INFO] Apache Royale: Royale Ant Tasks .................... SKIPPED
[INFO] [INFO] Apache Royale: RoyaleUnit Ant Tasks ................ SKIPPED
[INFO] [INFO] Apache Royale: Royale Maven Plugin ................. SKIPPED
[INFO] [INFO]
------------------------------------------------------------------------
[INFO] [INFO] BUILD FAILURE
[INFO] [INFO]
------------------------------------------------------------------------
[INFO] [INFO] Total time: 52.435 s
[INFO] [INFO] Finished at: 2019-11-25T18:30:01Z
[INFO] [INFO]
------------------------------------------------------------------------
[INFO] [WARNING] The requested profile "debug-pom" could not be activated
because it does not exist.
[INFO] [ERROR] Failed to execute goal
org.apache.maven.plugins:maven-gpg-plugin:1.6:sign (sign-release-artifacts)
on project royale-compiler-parent: Exit code: 2 -> [Help 1]
[INFO] org.apache.maven.lifecycle.LifecycleExecutionException: Failed to
execute goal org.apache.maven.plugins:maven-gpg-plugin:1.6:sign
(sign-release-artifacts) on project royale-compiler-parent: Exit code: 2
[INFO] at org.apache.maven.lifecycle.internal.MojoExecutor.execute
(MojoExecutor.java:215)
[INFO] at org.apache.maven.lifecycle.internal.MojoExecutor.execute
(MojoExecutor.java:156)
[INFO] at org.apache.maven.lifecycle.internal.MojoExecutor.execute
(MojoExecutor.java:148)
[INFO] at
org.apache.maven.lifecycle.internal.LifecycleModuleBuilder.buildProject
(LifecycleModuleBuilder.java:117)
[INFO] at
org.apache.maven.lifecycle.internal.LifecycleModuleBuilder.buildProject
(LifecycleModuleBuilder.java:81)
[INFO] at
org.apache.maven.lifecycle.internal.builder.singlethreaded.SingleThreadedBuilder.build
(SingleThreadedBuilder.java:56)
[INFO] at org.apache.maven.lifecycle.internal.LifecycleStarter.execute
(LifecycleStarter.java:128)
[INFO] at org.apache.maven.DefaultMaven.doExecute
(DefaultMaven.java:305)
[INFO] at org.apache.maven.DefaultMaven.doExecute
(DefaultMaven.java:192)
[INFO] at org.apache.maven.DefaultMaven.execute (DefaultMaven.java:105)
[INFO] at org.apache.maven.cli.MavenCli.execute (MavenCli.java:956)
[INFO] at org.apache.maven.cli.MavenCli.doMain (MavenCli.java:288)
[INFO] at org.apache.maven.cli.MavenCli.main (MavenCli.java:192)
[INFO] at sun.reflect.NativeMethodAccessorImpl.invoke0 (Native Method)
[INFO] at sun.reflect.NativeMethodAccessorImpl.invoke
(NativeMethodAccessorImpl.java:62)
[INFO] at sun.reflect.DelegatingMethodAccessorImpl.invoke
(DelegatingMethodAccessorImpl.java:43)
[INFO] at java.lang.reflect.Method.invoke (Method.java:498)
[INFO] at
org.codehaus.plexus.classworlds.launcher.Launcher.launchEnhanced
(Launcher.java:289)
[INFO] at org.codehaus.plexus.classworlds.launcher.Launcher.launch
(Launcher.java:229)
[INFO] at
org.codehaus.plexus.classworlds.launcher.Launcher.mainWithExitCode
(Launcher.java:415)
[INFO] at org.codehaus.plexus.classworlds.launcher.Launcher.main
(Launcher.java:356)
[INFO] Caused by: org.apache.maven.plugin.MojoExecutionException: Exit
code: 2
[INFO] at
org.apache.maven.plugin.gpg.GpgSigner.generateSignatureForFile
(GpgSigner.java:167)
[INFO] at
org.apache.maven.plugin.gpg.AbstractGpgSigner.generateSignatureForArtifact
(AbstractGpgSigner.java:205)
[INFO] at org.apache.maven.plugin.gpg.GpgSignAttachedMojo.execute
(GpgSignAttachedMojo.java:176)
[INFO] at org.apache.maven.plugin.DefaultBuildPluginManager.executeMojo
(DefaultBuildPluginManager.java:137)
[INFO] at org.apache.maven.lifecycle.internal.MojoExecutor.execute
(MojoExecutor.java:210)
[INFO] at org.apache.maven.lifecycle.internal.MojoExecutor.execute
(MojoExecutor.java:156)
[INFO] at org.apache.maven.lifecycle.internal.MojoExecutor.execute
(MojoExecutor.java:148)
[INFO] at
org.apache.maven.lifecycle.internal.LifecycleModuleBuilder.buildProject
(LifecycleModuleBuilder.java:117)
[INFO] at
org.apache.maven.lifecycle.internal.LifecycleModuleBuilder.buildProject
(LifecycleModuleBuilder.java:81)
[INFO] at
org.apache.maven.lifecycle.internal.builder.singlethreaded.SingleThreadedBuilder.build
(SingleThreadedBuilder.java:56)
[INFO] at org.apache.maven.lifecycle.internal.LifecycleStarter.execute
(LifecycleStarter.java:128)
[INFO] at org.apache.maven.DefaultMaven.doExecute
(DefaultMaven.java:305)
[INFO] at org.apache.maven.DefaultMaven.doExecute
(DefaultMaven.java:192)
[INFO] at org.apache.maven.DefaultMaven.execute (DefaultMaven.java:105)
[INFO] at org.apache.maven.cli.MavenCli.execute (MavenCli.java:956)
[INFO] at org.apache.maven.cli.MavenCli.doMain (MavenCli.java:288)
[INFO] at org.apache.maven.cli.MavenCli.main (MavenCli.java:192)
[INFO] at sun.reflect.NativeMethodAccessorImpl.invoke0 (Native Method)
[INFO] at sun.reflect.NativeMethodAccessorImpl.invoke
(NativeMethodAccessorImpl.java:62)
[INFO] at sun.reflect.DelegatingMethodAccessorImpl.invoke
(DelegatingMethodAccessorImpl.java:43)
[INFO] at java.lang.reflect.Method.invoke (Method.java:498)
[INFO] at
org.codehaus.plexus.classworlds.launcher.Launcher.launchEnhanced
(Launcher.java:289)
[INFO] at org.codehaus.plexus.classworlds.launcher.Launcher.launch
(Launcher.java:229)
[INFO] at
org.codehaus.plexus.classworlds.launcher.Launcher.mainWithExitCode
(Launcher.java:415)
[INFO] at org.codehaus.plexus.classworlds.launcher.Launcher.main
(Launcher.java:356)
[INFO] [ERROR]
[INFO] [ERROR]
[INFO] [ERROR] For more information about the errors and possible
solutions, please read the following articles:
[INFO] [ERROR] [Help 1]
http://cwiki.apache.org/confluence/display/MAVEN/MojoExecutionException
[INFO] Picked up JAVA_TOOL_OPTIONS: -Dfile.encoding=UTF-8 -Xms384m -Xmx2g
[INFO]
------------------------------------------------------------------------
[INFO] Reactor Summary for Apache Royale: Compiler: Parent 0.9.7-SNAPSHOT:
[INFO]
[INFO] Apache Royale: Compiler: Parent .................... FAILURE [01:01
min]
[INFO] Apache Royale: Compiler: Compiler-Common ........... SKIPPED
[INFO] Apache Royale: Compiler: Test Utils ................ SKIPPED
[INFO] Apache Royale: Compiler: Externc ................... SKIPPED
[INFO] Apache Royale: Compiler: Compiler .................. SKIPPED
[INFO] Apache Royale: Compiler: Compiler-JX ............... SKIPPED
[INFO] Apache Royale: Compiler: SWFUtils .................. SKIPPED
[INFO] Apache Royale: Compiler: Debugger .................. SKIPPED
[INFO] Apache Royale: Compiler: OEM Layer ................. SKIPPED
[INFO] Apache Royale: Royale Ant Tasks .................... SKIPPED
[INFO] Apache Royale: RoyaleUnit Ant Tasks ................ SKIPPED
[INFO] Apache Royale: Royale Maven Plugin ................. SKIPPED
[INFO]
------------------------------------------------------------------------
[INFO] BUILD FAILURE
[INFO]
------------------------------------------------------------------------
[INFO] Total time: 01:03 min
[INFO] Finished at: 2019-11-25T18:30:01Z
[INFO]
------------------------------------------------------------------------
[WARNING] The requested profile "debug-pom" could not be activated because
it does not exist.
[ERROR] Failed to execute goal
org.apache.maven.plugins:maven-release-plugin:2.5.3:prepare (default-cli)
on project royale-compiler-parent: Maven execution failed, exit code: '1'
-> [Help 1]
org.apache.maven.lifecycle.LifecycleExecutionException: Failed to execute
goal org.apache.maven.plugins:maven-release-plugin:2.5.3:prepare
(default-cli) on project royale-compiler-parent: Maven execution failed,
exit code: '1'
at org.apache.maven.lifecycle.internal.MojoExecutor.execute
(MojoExecutor.java:215)
at org.apache.maven.lifecycle.internal.MojoExecutor.execute
(MojoExecutor.java:156)
at org.apache.maven.lifecycle.internal.MojoExecutor.execute
(MojoExecutor.java:148)
at
org.apache.maven.lifecycle.internal.LifecycleModuleBuilder.buildProject
(LifecycleModuleBuilder.java:117)
at
org.apache.maven.lifecycle.internal.LifecycleModuleBuilder.buildProject
(LifecycleModuleBuilder.java:81)
at
org.apache.maven.lifecycle.internal.builder.singlethreaded.SingleThreadedBuilder.build
(SingleThreadedBuilder.java:56)
at org.apache.maven.lifecycle.internal.LifecycleStarter.execute
(LifecycleStarter.java:128)
at org.apache.maven.DefaultMaven.doExecute (DefaultMaven.java:305)
at org.apache.maven.DefaultMaven.doExecute (DefaultMaven.java:192)
at org.apache.maven.DefaultMaven.execute (DefaultMaven.java:105)
at org.apache.maven.cli.MavenCli.execute (MavenCli.java:956)
at org.apache.maven.cli.MavenCli.doMain (MavenCli.java:288)
at org.apache.maven.cli.MavenCli.main (MavenCli.java:192)
at sun.reflect.NativeMethodAccessorImpl.invoke0 (Native Method)
at sun.reflect.NativeMethodAccessorImpl.invoke
(NativeMethodAccessorImpl.java:62)
at sun.reflect.DelegatingMethodAccessorImpl.invoke
(DelegatingMethodAccessorImpl.java:43)
at java.lang.reflect.Method.invoke (Method.java:498)
at org.codehaus.plexus.classworlds.launcher.Launcher.launchEnhanced
(Launcher.java:289)
at org.codehaus.plexus.classworlds.launcher.Launcher.launch
(Launcher.java:229)
at org.codehaus.plexus.classworlds.launcher.Launcher.mainWithExitCode
(Launcher.java:415)
at org.codehaus.plexus.classworlds.launcher.Launcher.main
(Launcher.java:356)
Caused by: org.apache.maven.plugin.MojoExecutionException: Maven execution
failed, exit code: '1'
at org.apache.maven.plugins.release.PrepareReleaseMojo.prepareRelease
(PrepareReleaseMojo.java:290)
at org.apache.maven.plugins.release.PrepareReleaseMojo.execute
(PrepareReleaseMojo.java:240)
at org.apache.maven.plugin.DefaultBuildPluginManager.executeMojo
(DefaultBuildPluginManager.java:137)
at org.apache.maven.lifecycle.internal.MojoExecutor.execute
(MojoExecutor.java:210)
at org.apache.maven.lifecycle.internal.MojoExecutor.execute
(MojoExecutor.java:156)
at org.apache.maven.lifecycle.internal.MojoExecutor.execute
(MojoExecutor.java:148)
at
org.apache.maven.lifecycle.internal.LifecycleModuleBuilder.buildProject
(LifecycleModuleBuilder.java:117)
at
org.apache.maven.lifecycle.internal.LifecycleModuleBuilder.buildProject
(LifecycleModuleBuilder.java:81)
at
org.apache.maven.lifecycle.internal.builder.singlethreaded.SingleThreadedBuilder.build
(SingleThreadedBuilder.java:56)
at org.apache.maven.lifecycle.internal.LifecycleStarter.execute
(LifecycleStarter.java:128)
at org.apache.maven.DefaultMaven.doExecute (DefaultMaven.java:305)
at org.apache.maven.DefaultMaven.doExecute (DefaultMaven.java:192)
at org.apache.maven.DefaultMaven.execute (DefaultMaven.java:105)
at org.apache.maven.cli.MavenCli.execute (MavenCli.java:956)
at org.apache.maven.cli.MavenCli.doMain (MavenCli.java:288)
at org.apache.maven.cli.MavenCli.main (MavenCli.java:192)
at sun.reflect.NativeMethodAccessorImpl.invoke0 (Native Method)
at sun.reflect.NativeMethodAccessorImpl.invoke
(NativeMethodAccessorImpl.java:62)
at sun.reflect.DelegatingMethodAccessorImpl.invoke
(DelegatingMethodAccessorImpl.java:43)
at java.lang.reflect.Method.invoke (Method.java:498)
at org.codehaus.plexus.classworlds.launcher.Launcher.launchEnhanced
(Launcher.java:289)
at org.codehaus.plexus.classworlds.launcher.Launcher.launch
(Launcher.java:229)
at org.codehaus.plexus.classworlds.launcher.Launcher.mainWithExitCode
(Launcher.java:415)
at org.codehaus.plexus.classworlds.launcher.Launcher.main
(Launcher.java:356)
Caused by: org.apache.maven.shared.release.ReleaseExecutionException: Maven
execution failed, exit code: '1'
at org.apache.maven.shared.release.phase.AbstractRunGoalsPhase.execute
(AbstractRunGoalsPhase.java:91)
at org.apache.maven.shared.release.phase.RunPrepareGoalsPhase.execute
(RunPrepareGoalsPhase.java:44)
at org.apache.maven.shared.release.DefaultReleaseManager.prepare
(DefaultReleaseManager.java:234)
at org.apache.maven.shared.release.DefaultReleaseManager.prepare
(DefaultReleaseManager.java:169)
at org.apache.maven.shared.release.DefaultReleaseManager.prepare
(DefaultReleaseManager.java:146)
at org.apache.maven.shared.release.DefaultReleaseManager.prepare
(DefaultReleaseManager.java:107)
at org.apache.maven.plugins.release.PrepareReleaseMojo.prepareRelease
(PrepareReleaseMojo.java:286)
at org.apache.maven.plugins.release.PrepareReleaseMojo.execute
(PrepareReleaseMojo.java:240)
at org.apache.maven.plugin.DefaultBuildPluginManager.executeMojo
(DefaultBuildPluginManager.java:137)
at org.apache.maven.lifecycle.internal.MojoExecutor.execute
(MojoExecutor.java:210)
at org.apache.maven.lifecycle.internal.MojoExecutor.execute
(MojoExecutor.java:156)
at org.apache.maven.lifecycle.internal.MojoExecutor.execute
(MojoExecutor.java:148)
at
org.apache.maven.lifecycle.internal.LifecycleModuleBuilder.buildProject
(LifecycleModuleBuilder.java:117)
at
org.apache.maven.lifecycle.internal.LifecycleModuleBuilder.buildProject
(LifecycleModuleBuilder.java:81)
at
org.apache.maven.lifecycle.internal.builder.singlethreaded.SingleThreadedBuilder.build
(SingleThreadedBuilder.java:56)
at org.apache.maven.lifecycle.internal.LifecycleStarter.execute
(LifecycleStarter.java:128)
at org.apache.maven.DefaultMaven.doExecute (DefaultMaven.java:305)
at org.apache.maven.DefaultMaven.doExecute (DefaultMaven.java:192)
at org.apache.maven.DefaultMaven.execute (DefaultMaven.java:105)
at org.apache.maven.cli.MavenCli.execute (MavenCli.java:956)
at org.apache.maven.cli.MavenCli.doMain (MavenCli.java:288)
at org.apache.maven.cli.MavenCli.main (MavenCli.java:192)
at sun.reflect.NativeMethodAccessorImpl.invoke0 (Native Method)
at sun.reflect.NativeMethodAccessorImpl.invoke
(NativeMethodAccessorImpl.java:62)
at sun.reflect.DelegatingMethodAccessorImpl.invoke
(DelegatingMethodAccessorImpl.java:43)
at java.lang.reflect.Method.invoke (Method.java:498)
at org.codehaus.plexus.classworlds.launcher.Launcher.launchEnhanced
(Launcher.java:289)
at org.codehaus.plexus.classworlds.launcher.Launcher.launch
(Launcher.java:229)
at org.codehaus.plexus.classworlds.launcher.Launcher.mainWithExitCode
(Launcher.java:415)
at org.codehaus.plexus.classworlds.launcher.Launcher.main
(Launcher.java:356)
Caused by: org.apache.maven.shared.release.exec.MavenExecutorException:
Maven execution failed, exit code: '1'
at
org.apache.maven.shared.release.exec.InvokerMavenExecutor.executeGoals
(InvokerMavenExecutor.java:433)
at
org.apache.maven.shared.release.exec.AbstractMavenExecutor.executeGoals
(AbstractMavenExecutor.java:114)
at org.apache.maven.shared.release.phase.AbstractRunGoalsPhase.execute
(AbstractRunGoalsPhase.java:85)
at org.apache.maven.shared.release.phase.RunPrepareGoalsPhase.execute
(RunPrepareGoalsPhase.java:44)
at org.apache.maven.shared.release.DefaultReleaseManager.prepare
(DefaultReleaseManager.java:234)
at org.apache.maven.shared.release.DefaultReleaseManager.prepare
(DefaultReleaseManager.java:169)
at org.apache.maven.shared.release.DefaultReleaseManager.prepare
(DefaultReleaseManager.java:146)
at org.apache.maven.shared.release.DefaultReleaseManager.prepare
(DefaultReleaseManager.java:107)
at org.apache.maven.plugins.release.PrepareReleaseMojo.prepareRelease
(PrepareReleaseMojo.java:286)
at org.apache.maven.plugins.release.PrepareReleaseMojo.execute
(PrepareReleaseMojo.java:240)
at org.apache.maven.plugin.DefaultBuildPluginManager.executeMojo
(DefaultBuildPluginManager.java:137)
at org.apache.maven.lifecycle.internal.MojoExecutor.execute
(MojoExecutor.java:210)
at org.apache.maven.lifecycle.internal.MojoExecutor.execute
(MojoExecutor.java:156)
at org.apache.maven.lifecycle.internal.MojoExecutor.execute
(MojoExecutor.java:148)
at
org.apache.maven.lifecycle.internal.LifecycleModuleBuilder.buildProject
(LifecycleModuleBuilder.java:117)
at
org.apache.maven.lifecycle.internal.LifecycleModuleBuilder.buildProject
(LifecycleModuleBuilder.java:81)
at
org.apache.maven.lifecycle.internal.builder.singlethreaded.SingleThreadedBuilder.build
(SingleThreadedBuilder.java:56)
at org.apache.maven.lifecycle.internal.LifecycleStarter.execute
(LifecycleStarter.java:128)
at org.apache.maven.DefaultMaven.doExecute (DefaultMaven.java:305)
at org.apache.maven.DefaultMaven.doExecute (DefaultMaven.java:192)
at org.apache.maven.DefaultMaven.execute (DefaultMaven.java:105)
at org.apache.maven.cli.MavenCli.execute (MavenCli.java:956)
at org.apache.maven.cli.MavenCli.doMain (MavenCli.java:288)
at org.apache.maven.cli.MavenCli.main (MavenCli.java:192)
at sun.reflect.NativeMethodAccessorImpl.invoke0 (Native Method)
at sun.reflect.NativeMethodAccessorImpl.invoke
(NativeMethodAccessorImpl.java:62)
at sun.reflect.DelegatingMethodAccessorImpl.invoke
(DelegatingMethodAccessorImpl.java:43)
at java.lang.reflect.Method.invoke (Method.java:498)
at org.codehaus.plexus.classworlds.launcher.Launcher.launchEnhanced
(Launcher.java:289)
at org.codehaus.plexus.classworlds.launcher.Launcher.launch
(Launcher.java:229)
at org.codehaus.plexus.classworlds.launcher.Launcher.mainWithExitCode
(Launcher.java:415)
at org.codehaus.plexus.classworlds.launcher.Launcher.main
(Launcher.java:356)
[ERROR]
[ERROR]
[ERROR] For more information about the errors and possible solutions,
please read the following articles:
[ERROR] [Help 1]
http://cwiki.apache.org/confluence/display/MAVEN/MojoExecutionException
Build step 'Invoke top-level Maven targets' marked build as failure
Email was triggered for: Failure - Any
Sending email for trigger: Failure - Any
Sending email to: dev@royale.apache.org
Finished: FAILURE
El lun., 25 nov. 2019 a las 19:30, <ap...@gmail.com> escribió:
> Royale_Release_Step_N002 - Build # 13 - Still Failing:
>
> Check console output at
> http://apacheroyaleci2.westus2.cloudapp.azure.com:8080/job/Royale_Release_Step_N002/13/
> to view the results.
--
Carlos Rovira
http://about.me/carlosrovira
Royale_Release_Step_N002 - Build # 13 - Still Failing!
Posted by ap...@gmail.com.
Royale_Release_Step_N002 - Build # 13 - Still Failing:
Check console output at http://apacheroyaleci2.westus2.cloudapp.azure.com:8080/job/Royale_Release_Step_N002/13/ to view the results.
Royale_Release_Step_N002 - Build # 12 - Still Failing!
Posted by ap...@gmail.com.
Royale_Release_Step_N002 - Build # 12 - Still Failing:
Check console output at http://apacheroyaleci2.westus2.cloudapp.azure.com:8080/job/Royale_Release_Step_N002/12/ to view the results.
Royale_Release_Step_N002 - Build # 11 - Still Failing!
Posted by ap...@gmail.com.
Royale_Release_Step_N002 - Build # 11 - Still Failing:
Check console output at http://apacheroyaleci2.westus2.cloudapp.azure.com:8080/job/Royale_Release_Step_N002/11/ to view the results.
Royale_Release_Step_N002 - Build # 10 - Still Failing!
Posted by ap...@gmail.com.
Royale_Release_Step_N002 - Build # 10 - Still Failing:
Check console output at http://apacheroyaleci2.westus2.cloudapp.azure.com:8080/job/Royale_Release_Step_N002/10/ to view the results.
Royale_Release_Step_N002 - Build # 9 - Still Failing!
Posted by ap...@gmail.com.
Royale_Release_Step_N002 - Build # 9 - Still Failing:
Check console output at http://apacheroyaleci2.westus2.cloudapp.azure.com:8080/job/Royale_Release_Step_N002/9/ to view the results.
Royale_Release_Step_N002 - Build # 8 - Still Failing!
Posted by ap...@gmail.com.
Royale_Release_Step_N002 - Build # 8 - Still Failing:
Check console output at http://apacheroyaleci2.westus2.cloudapp.azure.com:8080/job/Royale_Release_Step_N002/8/ to view the results.
Royale_Release_Step_N002 - Build # 7 - Still Failing!
Posted by ap...@gmail.com.
Royale_Release_Step_N002 - Build # 7 - Still Failing:
Check console output at http://apacheroyaleci2.westus2.cloudapp.azure.com:8080/job/Royale_Release_Step_N002/7/ to view the results.
Royale_Release_Step_N002 - Build # 6 - Still Failing!
Posted by ap...@gmail.com.
Royale_Release_Step_N002 - Build # 6 - Still Failing:
Check console output at http://apacheroyaleci2.westus2.cloudapp.azure.com:8080/job/Royale_Release_Step_N002/6/ to view the results.
Royale_Release_Step_N002 - Build # 5 - Still Failing!
Posted by ap...@gmail.com.
Royale_Release_Step_N002 - Build # 5 - Still Failing:
Check console output at http://apacheroyaleci2.westus2.cloudapp.azure.com:8080/job/Royale_Release_Step_N002/5/ to view the results.
Royale_Release_Step_N002 - Build # 4 - Still Failing!
Posted by ap...@gmail.com.
Royale_Release_Step_N002 - Build # 4 - Still Failing:
Check console output at http://apacheroyaleci2.westus2.cloudapp.azure.com:8080/job/Royale_Release_Step_N002/4/ to view the results.
Royale_Release_Step_N002 - Build # 3 - Still Failing!
Posted by ap...@gmail.com.
Royale_Release_Step_N002 - Build # 3 - Still Failing:
Check console output at http://apacheroyaleci2.westus2.cloudapp.azure.com:8080/job/Royale_Release_Step_N002/3/ to view the results.
Royale_Release_Step_N002 - Build # 2 - Still Failing!
Posted by ap...@gmail.com.
Royale_Release_Step_N002 - Build # 2 - Still Failing:
Check console output at http://apacheroyaleci2.westus2.cloudapp.azure.com:8080/job/Royale_Release_Step_N002/2/ to view the results.