You are viewing a plain text version of this content. The canonical link for it is here.
Posted to builds@beam.apache.org by Apache Jenkins Server <je...@builds.apache.org> on 2023/11/20 11:45:18 UTC
Build failed in Jenkins: beam_PostCommit_Python38 #4833
See <https://ci-beam.apache.org/job/beam_PostCommit_Python38/4833/display/redirect>
Changes:
------------------------------------------
[...truncated 5.89 MB...]
INFO:apache_beam.runners.worker.statecache:Creating state cache with size 104857600
INFO:apache_beam.runners.worker.sdk_worker:Creating insecure control channel for localhost:33139.
INFO:apache_beam.runners.worker.sdk_worker:Control channel established.
INFO:apache_beam.runners.worker.sdk_worker:Initializing SDKHarness with unbounded number of workers.
INFO:apache_beam.utils.subprocess_server:23/11/20 08:59:21 INFO org.apache.beam.runners.fnexecution.control.FnApiControlClientPoolService: Beam Fn Control client connected with id 1-1
INFO:apache_beam.utils.subprocess_server:23/11/20 08:59:21 INFO org.apache.beam.runners.fnexecution.control.FnApiControlClientPoolService: getProcessBundleDescriptor request with id 1-2
INFO:apache_beam.runners.worker.sdk_worker:Creating insecure state channel for localhost:40609.
INFO:apache_beam.runners.worker.sdk_worker:State channel established.
INFO:apache_beam.runners.worker.data_plane:Creating client data channel for localhost:45095
INFO:apache_beam.utils.subprocess_server:23/11/20 08:59:21 INFO org.apache.beam.runners.fnexecution.data.GrpcDataService: Beam Fn Data client connected.
INFO:apache_beam.utils.subprocess_server:23/11/20 08:59:21 INFO org.apache.beam.runners.fnexecution.control.FnApiControlClientPoolService: getProcessBundleDescriptor request with id 1-3
INFO:apache_beam.utils.subprocess_server:23/11/20 08:59:21 INFO org.apache.beam.runners.fnexecution.control.FnApiControlClientPoolService: getProcessBundleDescriptor request with id 1-4
INFO:apache_beam.utils.subprocess_server:23/11/20 08:59:21 INFO org.apache.beam.runners.fnexecution.control.FnApiControlClientPoolService: getProcessBundleDescriptor request with id 1-5
INFO:apache_beam.utils.subprocess_server:23/11/20 08:59:21 INFO org.apache.beam.runners.fnexecution.control.FnApiControlClientPoolService: getProcessBundleDescriptor request with id 1-7
INFO:apache_beam.utils.subprocess_server:23/11/20 08:59:21 INFO org.apache.beam.runners.fnexecution.control.FnApiControlClientPoolService: getProcessBundleDescriptor request with id 1-6
INFO:apache_beam.utils.subprocess_server:23/11/20 08:59:21 INFO org.apache.beam.runners.fnexecution.control.FnApiControlClientPoolService: getProcessBundleDescriptor request with id 1-9
INFO:apache_beam.utils.subprocess_server:23/11/20 08:59:21 INFO org.apache.beam.runners.fnexecution.control.FnApiControlClientPoolService: getProcessBundleDescriptor request with id 1-8
INFO:apache_beam.utils.subprocess_server:23/11/20 08:59:21 INFO org.apache.beam.runners.fnexecution.control.FnApiControlClientPoolService: getProcessBundleDescriptor request with id 1-10
INFO:apache_beam.utils.subprocess_server:23/11/20 08:59:21 INFO org.apache.beam.runners.fnexecution.control.FnApiControlClientPoolService: getProcessBundleDescriptor request with id 1-11
INFO:apache_beam.utils.subprocess_server:23/11/20 08:59:21 INFO org.apache.beam.runners.fnexecution.control.FnApiControlClientPoolService: getProcessBundleDescriptor request with id 1-12
INFO:apache_beam.utils.subprocess_server:23/11/20 08:59:21 INFO org.apache.beam.runners.fnexecution.control.FnApiControlClientPoolService: getProcessBundleDescriptor request with id 1-13
INFO:apache_beam.utils.subprocess_server:23/11/20 08:59:22 INFO org.apache.beam.runners.fnexecution.control.FnApiControlClientPoolService: getProcessBundleDescriptor request with id 1-14
INFO:apache_beam.utils.subprocess_server:23/11/20 08:59:22 INFO org.apache.beam.runners.fnexecution.control.FnApiControlClientPoolService: getProcessBundleDescriptor request with id 1-15
INFO:apache_beam.utils.subprocess_server:23/11/20 08:59:22 INFO org.apache.beam.runners.spark.SparkPipelineRunner: Job BeamApp-jenkins-1120085917-8b750a95_773d0e9b-426a-4a4e-8af7-b8b59373071b: Pipeline translated successfully. Computing outputs
INFO:apache_beam.utils.subprocess_server:23/11/20 08:59:22 INFO org.apache.beam.runners.fnexecution.control.FnApiControlClientPoolService: getProcessBundleDescriptor request with id 1-16
INFO:apache_beam.io.filebasedsink:Starting finalize_write threads with num_shards: 4 (skipped: 0), batches: 4, num_threads: 4
INFO:apache_beam.io.filebasedsink:Renamed 4 shards in 0.01 seconds.
INFO:apache_beam.utils.subprocess_server:23/11/20 08:59:22 INFO org.apache.beam.runners.spark.SparkPipelineRunner: Job BeamApp-jenkins-1120085917-8b750a95_773d0e9b-426a-4a4e-8af7-b8b59373071b finished.
INFO:apache_beam.utils.subprocess_server:23/11/20 08:59:22 INFO org.sparkproject.jetty.server.AbstractConnector: Stopped Spark@2ae59e7d{HTTP/1.1, (http/1.1)}{127.0.0.1:4040}
INFO:apache_beam.runners.portability.portable_runner:Job state changed to DONE
Exception in thread run_worker_1-1:
Traceback (most recent call last):
File "/usr/lib/python3.8/threading.py", line 932, in _bootstrap_inner
self.run()
File "/usr/lib/python3.8/threading.py", line 870, in run
self._target(*self._args, **self._kwargs)
File "<https://ci-beam.apache.org/job/beam_PostCommit_Python38/ws/src/sdks/python/apache_beam/runners/worker/sdk_worker.py",> line 262, in run
Exception in thread read_state:
Traceback (most recent call last):
File "/usr/lib/python3.8/threading.py", line 932, in _bootstrap_inner
self.run()
File "/usr/lib/python3.8/threading.py", line 870, in run
for work_request in self._control_stub.Control(get_responses()):
File "<https://ci-beam.apache.org/job/beam_PostCommit_Python38/ws/src/build/gradleenv/2022703442/lib/python3.8/site-packages/grpc/_channel.py",> line 540, in __next__
self._target(*self._args, **self._kwargs)
File "<https://ci-beam.apache.org/job/beam_PostCommit_Python38/ws/src/sdks/python/apache_beam/runners/worker/sdk_worker.py",> line 1035, in pull_responses
return self._next()
File "<https://ci-beam.apache.org/job/beam_PostCommit_Python38/ws/src/build/gradleenv/2022703442/lib/python3.8/site-packages/grpc/_channel.py",> line 966, in _next
for response in responses:
File "<https://ci-beam.apache.org/job/beam_PostCommit_Python38/ws/src/build/gradleenv/2022703442/lib/python3.8/site-packages/grpc/_channel.py",> line 540, in __next__
raise self
grpc._channel._MultiThreadedRendezvous: <_MultiThreadedRendezvous of RPC that terminated with:
status = StatusCode.UNAVAILABLE
details = "recvmsg:Connection reset by peer"
debug_error_string = "UNKNOWN:Error received from peer ipv6:%5B::1%5D:33139 {created_time:"2023-11-20T08:59:22.790483288+00:00", grpc_status:14, grpc_message:"recvmsg:Connection reset by peer"}"
>
return self._next()
File "<https://ci-beam.apache.org/job/beam_PostCommit_Python38/ws/src/build/gradleenv/2022703442/lib/python3.8/site-packages/grpc/_channel.py",> line 966, in _next
ERROR:apache_beam.runners.worker.data_plane:Failed to read inputs in the data plane.
Traceback (most recent call last):
File "<https://ci-beam.apache.org/job/beam_PostCommit_Python38/ws/src/sdks/python/apache_beam/runners/worker/data_plane.py",> line 669, in _read_inputs
for elements in elements_iterator:
File "<https://ci-beam.apache.org/job/beam_PostCommit_Python38/ws/src/build/gradleenv/2022703442/lib/python3.8/site-packages/grpc/_channel.py",> line 540, in __next__
return self._next()
File "<https://ci-beam.apache.org/job/beam_PostCommit_Python38/ws/src/build/gradleenv/2022703442/lib/python3.8/site-packages/grpc/_channel.py",> line 966, in _next
raise self
grpc._channel._MultiThreadedRendezvous: <_MultiThreadedRendezvous of RPC that terminated with:
status = StatusCode.UNAVAILABLE
details = "recvmsg:Connection reset by peer"
debug_error_string = "UNKNOWN:Error received from peer ipv6:%5B::1%5D:45095 {created_time:"2023-11-20T08:59:22.7904638+00:00", grpc_status:14, grpc_message:"recvmsg:Connection reset by peer"}"
>
Exception in thread read_grpc_client_inputs:
Traceback (most recent call last):
File "/usr/lib/python3.8/threading.py", line 932, in _bootstrap_inner
raise self
grpc._channel._MultiThreadedRendezvous: <_MultiThreadedRendezvous of RPC that terminated with:
status = StatusCode.UNAVAILABLE
details = "Socket closed"
debug_error_string = "UNKNOWN:Error received from peer ipv6:%5B::1%5D:40609 {created_time:"2023-11-20T08:59:22.790466344+00:00", grpc_status:14, grpc_message:"Socket closed"}"
>
self.run()
File "/usr/lib/python3.8/threading.py", line 870, in run
self._target(*self._args, **self._kwargs)
File "<https://ci-beam.apache.org/job/beam_PostCommit_Python38/ws/src/sdks/python/apache_beam/runners/worker/data_plane.py",> line 686, in <lambda>
target=lambda: self._read_inputs(elements_iterator),
File "<https://ci-beam.apache.org/job/beam_PostCommit_Python38/ws/src/sdks/python/apache_beam/runners/worker/data_plane.py",> line 669, in _read_inputs
for elements in elements_iterator:
File "<https://ci-beam.apache.org/job/beam_PostCommit_Python38/ws/src/build/gradleenv/2022703442/lib/python3.8/site-packages/grpc/_channel.py",> line 540, in __next__
return self._next()
File "<https://ci-beam.apache.org/job/beam_PostCommit_Python38/ws/src/build/gradleenv/2022703442/lib/python3.8/site-packages/grpc/_channel.py",> line 966, in _next
raise self
grpc._channel._MultiThreadedRendezvous: <_MultiThreadedRendezvous of RPC that terminated with:
status = StatusCode.UNAVAILABLE
details = "recvmsg:Connection reset by peer"
debug_error_string = "UNKNOWN:Error received from peer ipv6:%5B::1%5D:45095 {created_time:"2023-11-20T08:59:22.7904638+00:00", grpc_status:14, grpc_message:"recvmsg:Connection reset by peer"}"
>
> Task :sdks:python:test-suites:portable:py38:postCommitPy38
> Task :sdks:python:test-suites:dataflow:py38:postCommitIT
<https://ci-beam.apache.org/job/beam_PostCommit_Python38/ws/src/build/gradleenv/-1734967051/bin/python3.8>: No module named build
warning: sdist: standard file not found: should have one of README, README.rst, README.txt, README.md
warning: check: missing required meta-data: url
warning: check: missing meta-data: either (author and author_email) or (maintainer and maintainer_email) must be supplied
> Task :sdks:python:test-suites:direct:py38:postCommitIT
+++++++++++++++++++++++++++++++++++ Timeout ++++++++++++++++++++++++++++++++++++
~~~~~~~~~~~~~~~~~~~~~ Stack of Thread-25 (140094028134144) ~~~~~~~~~~~~~~~~~~~~~
File "/usr/lib/python3.8/threading.py", line 890, in _bootstrap
self._bootstrap_inner()
File "/usr/lib/python3.8/threading.py", line 932, in _bootstrap_inner
self.run()
File "<https://ci-beam.apache.org/job/beam_PostCommit_Python38/ws/src/sdks/python/apache_beam/runners/worker/data_plane.py",> line 224, in run
while not self._finished.wait(next_call - time.time()):
File "/usr/lib/python3.8/threading.py", line 558, in wait
signaled = self._cond.wait(timeout)
File "/usr/lib/python3.8/threading.py", line 306, in wait
gotit = waiter.acquire(True, timeout)
~~~~~~~~~~~~~~~~~~~~~ Stack of <unknown> (140095075636992) ~~~~~~~~~~~~~~~~~~~~~
File "<https://ci-beam.apache.org/job/beam_PostCommit_Python38/ws/src/build/gradleenv/1398941892/lib/python3.8/site-packages/execnet/gateway_base.py",> line 361, in _perform_spawn
reply.run()
File "<https://ci-beam.apache.org/job/beam_PostCommit_Python38/ws/src/build/gradleenv/1398941892/lib/python3.8/site-packages/execnet/gateway_base.py",> line 296, in run
self._result = func(*args, **kwargs)
File "<https://ci-beam.apache.org/job/beam_PostCommit_Python38/ws/src/build/gradleenv/1398941892/lib/python3.8/site-packages/execnet/gateway_base.py",> line 1049, in _thread_receiver
msg = Message.from_io(io)
File "<https://ci-beam.apache.org/job/beam_PostCommit_Python38/ws/src/build/gradleenv/1398941892/lib/python3.8/site-packages/execnet/gateway_base.py",> line 507, in from_io
header = io.read(9) # type 1, channel 4, payload 4
File "<https://ci-beam.apache.org/job/beam_PostCommit_Python38/ws/src/build/gradleenv/1398941892/lib/python3.8/site-packages/execnet/gateway_base.py",> line 474, in read
data = self._read(numbytes - len(buf))
+++++++++++++++++++++++++++++++++++ Timeout ++++++++++++++++++++++++++++++++++++
+++++++++++++++++++++++++++++++++++ Timeout ++++++++++++++++++++++++++++++++++++
~~~~~~~~~~~~~~~~~~~~~ Stack of Thread-19 (139830091503360) ~~~~~~~~~~~~~~~~~~~~~
File "/usr/lib/python3.8/threading.py", line 890, in _bootstrap
self._bootstrap_inner()
File "/usr/lib/python3.8/threading.py", line 932, in _bootstrap_inner
self.run()
File "<https://ci-beam.apache.org/job/beam_PostCommit_Python38/ws/src/sdks/python/apache_beam/runners/worker/data_plane.py",> line 224, in run
while not self._finished.wait(next_call - time.time()):
File "/usr/lib/python3.8/threading.py", line 558, in wait
signaled = self._cond.wait(timeout)
File "/usr/lib/python3.8/threading.py", line 306, in wait
gotit = waiter.acquire(True, timeout)
~~~~~~~~~~~~~~~~~~~~~ Stack of <unknown> (139831130351360) ~~~~~~~~~~~~~~~~~~~~~
File "<https://ci-beam.apache.org/job/beam_PostCommit_Python38/ws/src/build/gradleenv/1398941892/lib/python3.8/site-packages/execnet/gateway_base.py",> line 361, in _perform_spawn
reply.run()
File "<https://ci-beam.apache.org/job/beam_PostCommit_Python38/ws/src/build/gradleenv/1398941892/lib/python3.8/site-packages/execnet/gateway_base.py",> line 296, in run
self._result = func(*args, **kwargs)
File "<https://ci-beam.apache.org/job/beam_PostCommit_Python38/ws/src/build/gradleenv/1398941892/lib/python3.8/site-packages/execnet/gateway_base.py",> line 1049, in _thread_receiver
msg = Message.from_io(io)
File "<https://ci-beam.apache.org/job/beam_PostCommit_Python38/ws/src/build/gradleenv/1398941892/lib/python3.8/site-packages/execnet/gateway_base.py",> line 507, in from_io
header = io.read(9) # type 1, channel 4, payload 4
File "<https://ci-beam.apache.org/job/beam_PostCommit_Python38/ws/src/build/gradleenv/1398941892/lib/python3.8/site-packages/execnet/gateway_base.py",> line 474, in read
data = self._read(numbytes - len(buf))
+++++++++++++++++++++++++++++++++++ Timeout ++++++++++++++++++++++++++++++++++++
> Task :sdks:python:test-suites:direct:py38:postCommitIT FAILED
> Task :sdks:python:test-suites:dataflow:py38:postCommitIT
[gw5] [32mPASSED[0m apache_beam/io/gcp/bigquery_read_it_test.py::ReadUsingStorageApiTests::test_iobase_source_with_column_selection_and_row_restriction
apache_beam/io/gcp/bigquery_read_it_test.py::ReadUsingStorageApiTests::test_iobase_source_with_column_selection_and_row_restriction_rows
[gw5] [32mPASSED[0m apache_beam/io/gcp/bigquery_read_it_test.py::ReadUsingStorageApiTests::test_iobase_source_with_column_selection_and_row_restriction_rows
apache_beam/io/gcp/bigquery_read_it_test.py::ReadUsingStorageApiTests::test_iobase_source_with_native_datetime
[gw5] [32mPASSED[0m apache_beam/io/gcp/bigquery_read_it_test.py::ReadUsingStorageApiTests::test_iobase_source_with_native_datetime
apache_beam/io/gcp/bigquery_read_it_test.py::ReadUsingStorageApiTests::test_iobase_source_with_query
[gw5] [32mPASSED[0m apache_beam/io/gcp/bigquery_read_it_test.py::ReadUsingStorageApiTests::test_iobase_source_with_query
apache_beam/io/gcp/bigquery_read_it_test.py::ReadUsingStorageApiTests::test_iobase_source_with_query_and_filters
[gw5] [32mPASSED[0m apache_beam/io/gcp/bigquery_read_it_test.py::ReadUsingStorageApiTests::test_iobase_source_with_query_and_filters
apache_beam/io/gcp/bigquery_read_it_test.py::ReadUsingStorageApiTests::test_iobase_source_with_row_restriction
[gw5] [32mPASSED[0m apache_beam/io/gcp/bigquery_read_it_test.py::ReadUsingStorageApiTests::test_iobase_source_with_row_restriction
apache_beam/io/gcp/bigquery_read_it_test.py::ReadUsingStorageApiTests::test_iobase_source_with_very_selective_filters
[gw5] [32mPASSED[0m apache_beam/io/gcp/bigquery_read_it_test.py::ReadUsingStorageApiTests::test_iobase_source_with_very_selective_filters
apache_beam/io/gcp/bigquery_read_it_test.py::ReadNewTypesTests::test_iobase_source
[gw5] [32mPASSED[0m apache_beam/io/gcp/bigquery_read_it_test.py::ReadNewTypesTests::test_iobase_source
apache_beam/io/gcp/bigquery_read_it_test.py::ReadNewTypesTests::test_native_source
[gw5] [32mPASSED[0m apache_beam/io/gcp/bigquery_read_it_test.py::ReadNewTypesTests::test_native_source
apache_beam/io/gcp/bigquery_read_it_test.py::ReadAllBQTests::test_read_queries
[gw5] [32mPASSED[0m apache_beam/io/gcp/bigquery_read_it_test.py::ReadAllBQTests::test_read_queries
apache_beam/io/gcp/bigquery_read_it_test.py::ReadInteractiveRunnerTests::test_read_in_interactive_runner
[gw5] [32mPASSED[0m apache_beam/io/gcp/bigquery_read_it_test.py::ReadInteractiveRunnerTests::test_read_in_interactive_runner
[33m=============================== warnings summary ===============================[0m
apache_beam/examples/complete/game/game_stats_it_test.py::GameStatsIT::test_game_stats_it
apache_beam/examples/complete/game/hourly_team_score_it_test.py::HourlyTeamScoreIT::test_hourly_team_score_it
apache_beam/examples/complete/game/leader_board_it_test.py::LeaderBoardIT::test_leader_board_it
apache_beam/io/gcp/bigquery_test.py::PubSubBigQueryIT::test_file_loads
apache_beam/io/gcp/bigquery_test.py::PubSubBigQueryIT::test_streaming_inserts
<https://ci-beam.apache.org/job/beam_PostCommit_Python38/ws/src/sdks/python/apache_beam/io/gcp/tests/utils.py>:63: PendingDeprecationWarning: Client.dataset is deprecated and will be removed in a future version. Use a string like 'my_project.my_dataset' or a cloud.google.bigquery.DatasetReference object, instead.
dataset_ref = client.dataset(unique_dataset_name, project=project)
apache_beam/examples/cookbook/bigquery_tornadoes_it_test.py::BigqueryTornadoesIT::test_bigquery_tornadoes_it
<https://ci-beam.apache.org/job/beam_PostCommit_Python38/ws/src/sdks/python/apache_beam/io/gcp/tests/utils.py>:100: PendingDeprecationWarning: Client.dataset is deprecated and will be removed in a future version. Use a string like 'my_project.my_dataset' or a cloud.google.bigquery.DatasetReference object, instead.
table_ref = client.dataset(dataset_id).table(table_id)
apache_beam/examples/dataframe/flight_delays_it_test.py::FlightDelaysTest::test_flight_delays
<https://ci-beam.apache.org/job/beam_PostCommit_Python38/ws/src/sdks/python/apache_beam/examples/dataframe/flight_delays.py>:47: FutureWarning: The default value of numeric_only in DataFrame.mean is deprecated. In a future version, it will default to False. In addition, specifying 'numeric_only=None' is deprecated. Select only valid columns or specify the value of numeric_only to silence this warning.
return airline_df[at_top_airports].mean()
apache_beam/io/gcp/bigquery_read_it_test.py::ReadTests::test_native_source
<https://ci-beam.apache.org/job/beam_PostCommit_Python38/ws/src/sdks/python/apache_beam/io/gcp/bigquery_read_it_test.py>:170: BeamDeprecationWarning: BigQuerySource is deprecated since 2.25.0. Use ReadFromBigQuery instead.
beam.io.BigQuerySource(query=self.query, use_standard_sql=True)))
apache_beam/io/gcp/bigquery_read_it_test.py::ReadNewTypesTests::test_native_source
<https://ci-beam.apache.org/job/beam_PostCommit_Python38/ws/src/sdks/python/apache_beam/io/gcp/bigquery_read_it_test.py>:706: BeamDeprecationWarning: BigQuerySource is deprecated since 2.25.0. Use ReadFromBigQuery instead.
beam.io.BigQuerySource(query=self.query, use_standard_sql=True)))
-- Docs: https://docs.pytest.org/en/stable/how-to/capture-warnings.html
- generated xml file: <https://ci-beam.apache.org/job/beam_PostCommit_Python38/ws/src/sdks/python/pytest_postCommitIT-df-py38.xml> -
[33m=========== [32m83 passed[0m, [33m[1m49 skipped[0m, [33m[1m9 warnings[0m[33m in 10029.26s (2:47:09)[0m[33m ===========[0m
FAILURE: Build failed with an exception.
* Where:
Script '<https://ci-beam.apache.org/job/beam_PostCommit_Python38/ws/src/sdks/python/test-suites/direct/common.gradle'> line: 52
* What went wrong:
Execution failed for task ':sdks:python:test-suites:direct:py38:postCommitIT'.
> Process 'command 'sh'' finished with non-zero exit value 1
* Try:
> Run with --stacktrace option to get the stack trace.
> Run with --info or --debug option to get more log output.
> Get more help at https://help.gradle.org.
Deprecated Gradle features were used in this build, making it incompatible with Gradle 9.0.
You can use '--warning-mode all' to show the individual deprecation warnings and determine if they come from your own scripts or plugins.
For more on this, please refer to https://docs.gradle.org/8.4/userguide/command_line_interface.html#sec:command_line_warnings in the Gradle documentation.
BUILD FAILED in 3h 29m 52s
224 actionable tasks: 159 executed, 61 from cache, 4 up-to-date
Publishing build scan...
https://ge.apache.org/s/hq4pypjbrpfmo
Build step 'Invoke Gradle script' changed build result to FAILURE
Build step 'Invoke Gradle script' marked build as failure
---------------------------------------------------------------------
To unsubscribe, e-mail: builds-unsubscribe@beam.apache.org
For additional commands, e-mail: builds-help@beam.apache.org
Jenkins build is back to normal : beam_PostCommit_Python38 #4836
Posted by Apache Jenkins Server <je...@builds.apache.org>.
See <https://ci-beam.apache.org/job/beam_PostCommit_Python38/4836/display/redirect>
---------------------------------------------------------------------
To unsubscribe, e-mail: builds-unsubscribe@beam.apache.org
For additional commands, e-mail: builds-help@beam.apache.org
Build failed in Jenkins: beam_PostCommit_Python38 #4835
Posted by Apache Jenkins Server <je...@builds.apache.org>.
See <https://ci-beam.apache.org/job/beam_PostCommit_Python38/4835/display/redirect?page=changes>
Changes:
[noreply] Adding instructions for PMC finalization (#29483)
------------------------------------------
[...truncated 9.62 MB...]
}
message: "No more requests from control plane"
log_location: "/usr/local/lib/python3.8/site-packages/apache_beam/runners/worker/sdk_worker.py:274"
thread: "MainThread"
INFO:root:severity: INFO
timestamp {
seconds: 1700513176
nanos: 889593839
}
message: "SDK Harness waiting for in-flight requests to complete"
log_location: "/usr/local/lib/python3.8/site-packages/apache_beam/runners/worker/sdk_worker.py:275"
thread: "MainThread"
INFO:root:severity: INFO
timestamp {
seconds: 1700513176
nanos: 889676094
}
message: "Closing all cached grpc data channels."
log_location: "/usr/local/lib/python3.8/site-packages/apache_beam/runners/worker/data_plane.py:820"
thread: "MainThread"
INFO:root:severity: INFO
timestamp {
seconds: 1700513176
nanos: 889754295
}
message: "Closing all cached gRPC state handlers."
log_location: "/usr/local/lib/python3.8/site-packages/apache_beam/runners/worker/sdk_worker.py:904"
thread: "MainThread"
INFO:root:severity: INFO
timestamp {
seconds: 1700513176
nanos: 891421556
}
message: "Done consuming work."
log_location: "/usr/local/lib/python3.8/site-packages/apache_beam/runners/worker/sdk_worker.py:287"
thread: "MainThread"
INFO:root:severity: INFO
timestamp {
seconds: 1700513176
nanos: 891611576
}
message: "Python sdk harness exiting."
log_location: "/usr/local/lib/python3.8/site-packages/apache_beam/runners/worker/sdk_worker_main.py:213"
thread: "MainThread"
INFO:apache_beam.runners.portability.local_job_service:Completed job in 27.551008701324463 seconds with state DONE.
INFO:root:Completed job in 27.551008701324463 seconds with state DONE.
INFO:apache_beam.runners.portability.portable_runner:Job state changed to DONE
> Task :sdks:python:test-suites:portable:py38:portableWordCountSparkRunnerBatch
INFO:apache_beam.runners.worker.worker_pool_main:Listening for workers at localhost:37637
INFO:apache_beam.runners.portability.fn_api_runner.translations:==================== <function pack_combiners at 0x7fc5b5b8f3a0> ====================
INFO:apache_beam.runners.portability.fn_api_runner.translations:==================== <function lift_combiners at 0x7fc5b5b8f430> ====================
INFO:apache_beam.runners.portability.fn_api_runner.translations:==================== <function sort_stages at 0x7fc5b5b8fb80> ====================
INFO:apache_beam.utils.subprocess_server:Starting service with ['java' '-jar' '<https://ci-beam.apache.org/job/beam_PostCommit_Python38/ws/src/runners/spark/3/job-server/build/libs/beam-runners-spark-3-job-server-2.53.0-SNAPSHOT.jar'> '--spark-master-url' 'local[4]' '--artifacts-dir' '/tmp/beam-temp2lxrtmnj/artifactsz7mfgl8i' '--job-port' '48301' '--artifact-port' '0' '--expansion-port' '0']
INFO:apache_beam.utils.subprocess_server:23/11/20 20:46:27 WARN software.amazon.awssdk.regions.internal.util.EC2MetadataUtils: Unable to retrieve the requested metadata.
INFO:apache_beam.utils.subprocess_server:23/11/20 20:46:28 INFO org.apache.beam.runners.jobsubmission.JobServerDriver: ArtifactStagingService started on localhost:32809
INFO:apache_beam.utils.subprocess_server:23/11/20 20:46:28 INFO org.apache.beam.runners.jobsubmission.JobServerDriver: Java ExpansionService started on localhost:42735
INFO:apache_beam.utils.subprocess_server:23/11/20 20:46:28 INFO org.apache.beam.runners.jobsubmission.JobServerDriver: JobService started on localhost:48301
INFO:apache_beam.utils.subprocess_server:23/11/20 20:46:28 INFO org.apache.beam.runners.jobsubmission.JobServerDriver: Job server now running, terminate with Ctrl+C
INFO:apache_beam.utils.subprocess_server:23/11/20 20:46:30 INFO org.apache.beam.runners.fnexecution.artifact.ArtifactStagingService: Staging artifacts for job_1223e021-ce32-4fa3-862e-8613f8b4868d.
INFO:apache_beam.utils.subprocess_server:23/11/20 20:46:30 INFO org.apache.beam.runners.fnexecution.artifact.ArtifactStagingService: Resolving artifacts for job_1223e021-ce32-4fa3-862e-8613f8b4868d.ref_Environment_default_environment_1.
INFO:apache_beam.utils.subprocess_server:23/11/20 20:46:30 INFO org.apache.beam.runners.fnexecution.artifact.ArtifactStagingService: Getting 1 artifacts for job_1223e021-ce32-4fa3-862e-8613f8b4868d.null.
INFO:apache_beam.utils.subprocess_server:23/11/20 20:46:30 INFO org.apache.beam.runners.fnexecution.artifact.ArtifactStagingService: Artifacts fully staged for job_1223e021-ce32-4fa3-862e-8613f8b4868d.
INFO:apache_beam.utils.subprocess_server:23/11/20 20:46:30 INFO org.apache.beam.runners.spark.SparkJobInvoker: Invoking job BeamApp-jenkins-1120204630-27fc0ee2_a761602c-c014-4423-ae73-b7c7947d8dfe
INFO:apache_beam.utils.subprocess_server:23/11/20 20:46:30 INFO org.apache.beam.runners.jobsubmission.JobInvocation: Starting job invocation BeamApp-jenkins-1120204630-27fc0ee2_a761602c-c014-4423-ae73-b7c7947d8dfe
INFO:apache_beam.runners.portability.portable_runner:Environment "LOOPBACK" has started a component necessary for the execution. Be sure to run the pipeline using
with Pipeline() as p:
p.apply(..)
This ensures that the pipeline finishes before this program exits.
INFO:apache_beam.runners.portability.portable_runner:Job state changed to STOPPED
INFO:apache_beam.runners.portability.portable_runner:Job state changed to STARTING
INFO:apache_beam.runners.portability.portable_runner:Job state changed to RUNNING
INFO:apache_beam.utils.subprocess_server:23/11/20 20:46:31 INFO org.apache.beam.runners.spark.translation.SparkContextFactory: Creating a brand new Spark Context.
INFO:apache_beam.utils.subprocess_server:23/11/20 20:46:31 WARN org.apache.hadoop.util.NativeCodeLoader: Unable to load native-hadoop library for your platform... using builtin-java classes where applicable
INFO:apache_beam.utils.subprocess_server:23/11/20 20:46:32 INFO org.sparkproject.jetty.util.log: Logging initialized @7083ms to org.sparkproject.jetty.util.log.Slf4jLog
INFO:apache_beam.utils.subprocess_server:23/11/20 20:46:32 INFO org.sparkproject.jetty.server.Server: jetty-9.4.44.v20210927; built: 2021-09-27T23:02:44.612Z; git: 8da83308eeca865e495e53ef315a249d63ba9332; jvm 1.8.0_382-8u382-ga-1~20.04.1-b05
INFO:apache_beam.utils.subprocess_server:23/11/20 20:46:32 INFO org.sparkproject.jetty.server.Server: Started @7202ms
INFO:apache_beam.utils.subprocess_server:23/11/20 20:46:32 INFO org.sparkproject.jetty.server.AbstractConnector: Started ServerConnector@63d0acf{HTTP/1.1, (http/1.1)}{127.0.0.1:4040}
INFO:apache_beam.utils.subprocess_server:23/11/20 20:46:32 INFO org.sparkproject.jetty.server.handler.ContextHandler: Started o.s.j.s.ServletContextHandler@697505f{/jobs,null,AVAILABLE,@Spark}
INFO:apache_beam.utils.subprocess_server:23/11/20 20:46:32 INFO org.sparkproject.jetty.server.handler.ContextHandler: Started o.s.j.s.ServletContextHandler@26baeb66{/jobs/json,null,AVAILABLE,@Spark}
INFO:apache_beam.utils.subprocess_server:23/11/20 20:46:32 INFO org.sparkproject.jetty.server.handler.ContextHandler: Started o.s.j.s.ServletContextHandler@6449b832{/jobs/job,null,AVAILABLE,@Spark}
INFO:apache_beam.utils.subprocess_server:23/11/20 20:46:32 INFO org.sparkproject.jetty.server.handler.ContextHandler: Started o.s.j.s.ServletContextHandler@570189f8{/jobs/job/json,null,AVAILABLE,@Spark}
INFO:apache_beam.utils.subprocess_server:23/11/20 20:46:32 INFO org.sparkproject.jetty.server.handler.ContextHandler: Started o.s.j.s.ServletContextHandler@4bd3880c{/stages,null,AVAILABLE,@Spark}
INFO:apache_beam.utils.subprocess_server:23/11/20 20:46:32 INFO org.sparkproject.jetty.server.handler.ContextHandler: Started o.s.j.s.ServletContextHandler@550c79fa{/stages/json,null,AVAILABLE,@Spark}
INFO:apache_beam.utils.subprocess_server:23/11/20 20:46:32 INFO org.sparkproject.jetty.server.handler.ContextHandler: Started o.s.j.s.ServletContextHandler@7d0f96c7{/stages/stage,null,AVAILABLE,@Spark}
INFO:apache_beam.utils.subprocess_server:23/11/20 20:46:32 INFO org.sparkproject.jetty.server.handler.ContextHandler: Started o.s.j.s.ServletContextHandler@7a1f1783{/stages/stage/json,null,AVAILABLE,@Spark}
INFO:apache_beam.utils.subprocess_server:23/11/20 20:46:32 INFO org.sparkproject.jetty.server.handler.ContextHandler: Started o.s.j.s.ServletContextHandler@671ddd56{/stages/pool,null,AVAILABLE,@Spark}
INFO:apache_beam.utils.subprocess_server:23/11/20 20:46:32 INFO org.sparkproject.jetty.server.handler.ContextHandler: Started o.s.j.s.ServletContextHandler@26a45dc8{/stages/pool/json,null,AVAILABLE,@Spark}
INFO:apache_beam.utils.subprocess_server:23/11/20 20:46:32 INFO org.sparkproject.jetty.server.handler.ContextHandler: Started o.s.j.s.ServletContextHandler@70df30ef{/storage,null,AVAILABLE,@Spark}
INFO:apache_beam.utils.subprocess_server:23/11/20 20:46:32 INFO org.sparkproject.jetty.server.handler.ContextHandler: Started o.s.j.s.ServletContextHandler@7fb198cf{/storage/json,null,AVAILABLE,@Spark}
INFO:apache_beam.utils.subprocess_server:23/11/20 20:46:32 INFO org.sparkproject.jetty.server.handler.ContextHandler: Started o.s.j.s.ServletContextHandler@21aad32{/storage/rdd,null,AVAILABLE,@Spark}
INFO:apache_beam.utils.subprocess_server:23/11/20 20:46:32 INFO org.sparkproject.jetty.server.handler.ContextHandler: Started o.s.j.s.ServletContextHandler@7467be2f{/storage/rdd/json,null,AVAILABLE,@Spark}
INFO:apache_beam.utils.subprocess_server:23/11/20 20:46:32 INFO org.sparkproject.jetty.server.handler.ContextHandler: Started o.s.j.s.ServletContextHandler@75b98acf{/environment,null,AVAILABLE,@Spark}
INFO:apache_beam.utils.subprocess_server:23/11/20 20:46:32 INFO org.sparkproject.jetty.server.handler.ContextHandler: Started o.s.j.s.ServletContextHandler@2254bc45{/environment/json,null,AVAILABLE,@Spark}
INFO:apache_beam.utils.subprocess_server:23/11/20 20:46:32 INFO org.sparkproject.jetty.server.handler.ContextHandler: Started o.s.j.s.ServletContextHandler@57d7f9a9{/executors,null,AVAILABLE,@Spark}
INFO:apache_beam.utils.subprocess_server:23/11/20 20:46:32 INFO org.sparkproject.jetty.server.handler.ContextHandler: Started o.s.j.s.ServletContextHandler@6457513a{/executors/json,null,AVAILABLE,@Spark}
INFO:apache_beam.utils.subprocess_server:23/11/20 20:46:32 INFO org.sparkproject.jetty.server.handler.ContextHandler: Started o.s.j.s.ServletContextHandler@6d8ff49a{/executors/threadDump,null,AVAILABLE,@Spark}
INFO:apache_beam.utils.subprocess_server:23/11/20 20:46:32 INFO org.sparkproject.jetty.server.handler.ContextHandler: Started o.s.j.s.ServletContextHandler@6345fce8{/executors/threadDump/json,null,AVAILABLE,@Spark}
INFO:apache_beam.utils.subprocess_server:23/11/20 20:46:32 INFO org.sparkproject.jetty.server.handler.ContextHandler: Started o.s.j.s.ServletContextHandler@1e975d21{/static,null,AVAILABLE,@Spark}
INFO:apache_beam.utils.subprocess_server:23/11/20 20:46:32 INFO org.sparkproject.jetty.server.handler.ContextHandler: Started o.s.j.s.ServletContextHandler@1e2b0fc5{/,null,AVAILABLE,@Spark}
INFO:apache_beam.utils.subprocess_server:23/11/20 20:46:32 INFO org.sparkproject.jetty.server.handler.ContextHandler: Started o.s.j.s.ServletContextHandler@459f7af6{/api,null,AVAILABLE,@Spark}
INFO:apache_beam.utils.subprocess_server:23/11/20 20:46:32 INFO org.sparkproject.jetty.server.handler.ContextHandler: Started o.s.j.s.ServletContextHandler@3d6f5839{/jobs/job/kill,null,AVAILABLE,@Spark}
INFO:apache_beam.utils.subprocess_server:23/11/20 20:46:32 INFO org.sparkproject.jetty.server.handler.ContextHandler: Started o.s.j.s.ServletContextHandler@6faadc5c{/stages/stage/kill,null,AVAILABLE,@Spark}
INFO:apache_beam.utils.subprocess_server:23/11/20 20:46:32 INFO org.sparkproject.jetty.server.handler.ContextHandler: Started o.s.j.s.ServletContextHandler@202d6dcb{/metrics/json,null,AVAILABLE,@Spark}
INFO:apache_beam.utils.subprocess_server:23/11/20 20:46:33 INFO org.apache.beam.runners.spark.metrics.MetricsAccumulator: Instantiated metrics accumulator: MetricQueryResults()
INFO:apache_beam.utils.subprocess_server:23/11/20 20:46:33 WARN software.amazon.awssdk.regions.internal.util.EC2MetadataUtils: Unable to retrieve the requested metadata.
INFO:apache_beam.utils.subprocess_server:23/11/20 20:46:33 INFO org.apache.beam.runners.spark.SparkPipelineRunner: Running job BeamApp-jenkins-1120204630-27fc0ee2_a761602c-c014-4423-ae73-b7c7947d8dfe on Spark master local[4]
INFO:apache_beam.runners.worker.statecache:Creating state cache with size 104857600
INFO:apache_beam.runners.worker.sdk_worker:Creating insecure control channel for localhost:36093.
INFO:apache_beam.runners.worker.sdk_worker:Control channel established.
INFO:apache_beam.runners.worker.sdk_worker:Initializing SDKHarness with unbounded number of workers.
INFO:apache_beam.utils.subprocess_server:23/11/20 20:46:34 INFO org.apache.beam.runners.fnexecution.control.FnApiControlClientPoolService: Beam Fn Control client connected with id 1-1
INFO:apache_beam.utils.subprocess_server:23/11/20 20:46:35 INFO org.apache.beam.runners.fnexecution.control.FnApiControlClientPoolService: getProcessBundleDescriptor request with id 1-2
INFO:apache_beam.runners.worker.sdk_worker:Creating insecure state channel for localhost:35265.
INFO:apache_beam.runners.worker.sdk_worker:State channel established.
INFO:apache_beam.runners.worker.data_plane:Creating client data channel for localhost:35217
INFO:apache_beam.utils.subprocess_server:23/11/20 20:46:35 INFO org.apache.beam.runners.fnexecution.data.GrpcDataService: Beam Fn Data client connected.
INFO:apache_beam.utils.subprocess_server:23/11/20 20:46:35 INFO org.apache.beam.runners.fnexecution.control.FnApiControlClientPoolService: getProcessBundleDescriptor request with id 1-3
INFO:apache_beam.utils.subprocess_server:23/11/20 20:46:35 INFO org.apache.beam.runners.fnexecution.control.FnApiControlClientPoolService: getProcessBundleDescriptor request with id 1-4
INFO:apache_beam.utils.subprocess_server:23/11/20 20:46:35 INFO org.apache.beam.runners.fnexecution.control.FnApiControlClientPoolService: getProcessBundleDescriptor request with id 1-5
INFO:apache_beam.utils.subprocess_server:23/11/20 20:46:35 INFO org.apache.beam.runners.fnexecution.control.FnApiControlClientPoolService: getProcessBundleDescriptor request with id 1-9
INFO:apache_beam.utils.subprocess_server:23/11/20 20:46:35 INFO org.apache.beam.runners.fnexecution.control.FnApiControlClientPoolService: getProcessBundleDescriptor request with id 1-6
INFO:apache_beam.utils.subprocess_server:23/11/20 20:46:35 INFO org.apache.beam.runners.fnexecution.control.FnApiControlClientPoolService: getProcessBundleDescriptor request with id 1-7
INFO:apache_beam.utils.subprocess_server:23/11/20 20:46:35 INFO org.apache.beam.runners.fnexecution.control.FnApiControlClientPoolService: getProcessBundleDescriptor request with id 1-8
INFO:apache_beam.utils.subprocess_server:23/11/20 20:46:36 INFO org.apache.beam.runners.fnexecution.control.FnApiControlClientPoolService: getProcessBundleDescriptor request with id 1-10
INFO:apache_beam.utils.subprocess_server:23/11/20 20:46:36 INFO org.apache.beam.runners.fnexecution.control.FnApiControlClientPoolService: getProcessBundleDescriptor request with id 1-11
INFO:apache_beam.utils.subprocess_server:23/11/20 20:46:36 INFO org.apache.beam.runners.fnexecution.control.FnApiControlClientPoolService: getProcessBundleDescriptor request with id 1-12
INFO:apache_beam.utils.subprocess_server:23/11/20 20:46:36 INFO org.apache.beam.runners.fnexecution.control.FnApiControlClientPoolService: getProcessBundleDescriptor request with id 1-13
INFO:apache_beam.utils.subprocess_server:23/11/20 20:46:36 INFO org.apache.beam.runners.fnexecution.control.FnApiControlClientPoolService: getProcessBundleDescriptor request with id 1-14
INFO:apache_beam.utils.subprocess_server:23/11/20 20:46:36 INFO org.apache.beam.runners.fnexecution.control.FnApiControlClientPoolService: getProcessBundleDescriptor request with id 1-15
INFO:apache_beam.utils.subprocess_server:23/11/20 20:46:36 INFO org.apache.beam.runners.spark.SparkPipelineRunner: Job BeamApp-jenkins-1120204630-27fc0ee2_a761602c-c014-4423-ae73-b7c7947d8dfe: Pipeline translated successfully. Computing outputs
INFO:apache_beam.utils.subprocess_server:23/11/20 20:46:36 INFO org.apache.beam.runners.fnexecution.control.FnApiControlClientPoolService: getProcessBundleDescriptor request with id 1-16
INFO:apache_beam.io.filebasedsink:Starting finalize_write threads with num_shards: 4 (skipped: 0), batches: 4, num_threads: 4
INFO:apache_beam.io.filebasedsink:Renamed 4 shards in 0.01 seconds.
INFO:apache_beam.utils.subprocess_server:23/11/20 20:46:36 INFO org.apache.beam.runners.spark.SparkPipelineRunner: Job BeamApp-jenkins-1120204630-27fc0ee2_a761602c-c014-4423-ae73-b7c7947d8dfe finished.
INFO:apache_beam.utils.subprocess_server:23/11/20 20:46:36 INFO org.sparkproject.jetty.server.AbstractConnector: Stopped Spark@63d0acf{HTTP/1.1, (http/1.1)}{127.0.0.1:4040}
INFO:apache_beam.runners.portability.portable_runner:Job state changed to DONE
Exception in thread run_worker_1-1:
Traceback (most recent call last):
File "/usr/lib/python3.8/threading.py", line 932, in _bootstrap_inner
Exception in thread read_state:
Traceback (most recent call last):
File "/usr/lib/python3.8/threading.py", line 932, in _bootstrap_inner
self.run()
File "/usr/lib/python3.8/threading.py", line 870, in run
self._target(*self._args, **self._kwargs)
File "<https://ci-beam.apache.org/job/beam_PostCommit_Python38/ws/src/sdks/python/apache_beam/runners/worker/sdk_worker.py",> line 262, in run
self.run()
File "/usr/lib/python3.8/threading.py", line 870, in run
for work_request in self._control_stub.Control(get_responses()):
File "<https://ci-beam.apache.org/job/beam_PostCommit_Python38/ws/src/build/gradleenv/2022703442/lib/python3.8/site-packages/grpc/_channel.py",> line 540, in __next__
self._target(*self._args, **self._kwargs)
File "<https://ci-beam.apache.org/job/beam_PostCommit_Python38/ws/src/sdks/python/apache_beam/runners/worker/sdk_worker.py",> line 1035, in pull_responses
for response in responses:
File "<https://ci-beam.apache.org/job/beam_PostCommit_Python38/ws/src/build/gradleenv/2022703442/lib/python3.8/site-packages/grpc/_channel.py",> line 540, in __next__
return self._next()
File "<https://ci-beam.apache.org/job/beam_PostCommit_Python38/ws/src/build/gradleenv/2022703442/lib/python3.8/site-packages/grpc/_channel.py",> line 966, in _next
ERROR:apache_beam.runners.worker.data_plane:Failed to read inputs in the data plane.
Traceback (most recent call last):
File "<https://ci-beam.apache.org/job/beam_PostCommit_Python38/ws/src/sdks/python/apache_beam/runners/worker/data_plane.py",> line 669, in _read_inputs
for elements in elements_iterator:
File "<https://ci-beam.apache.org/job/beam_PostCommit_Python38/ws/src/build/gradleenv/2022703442/lib/python3.8/site-packages/grpc/_channel.py",> line 540, in __next__
return self._next()
File "<https://ci-beam.apache.org/job/beam_PostCommit_Python38/ws/src/build/gradleenv/2022703442/lib/python3.8/site-packages/grpc/_channel.py",> line 966, in _next
raise self
grpc._channel._MultiThreadedRendezvous: <_MultiThreadedRendezvous of RPC that terminated with:
status = StatusCode.UNAVAILABLE
details = "Socket closed"
debug_error_string = "UNKNOWN:Error received from peer ipv6:%5B::1%5D:35217 {created_time:"2023-11-20T20:46:37.072096091+00:00", grpc_status:14, grpc_message:"Socket closed"}"
>
Exception in thread read_grpc_client_inputs:
Traceback (most recent call last):
File "/usr/lib/python3.8/threading.py", line 932, in _bootstrap_inner
return self._next()
File "<https://ci-beam.apache.org/job/beam_PostCommit_Python38/ws/src/build/gradleenv/2022703442/lib/python3.8/site-packages/grpc/_channel.py",> line 966, in _next
self.run()
File "/usr/lib/python3.8/threading.py", line 870, in run
self._target(*self._args, **self._kwargs)
File "<https://ci-beam.apache.org/job/beam_PostCommit_Python38/ws/src/sdks/python/apache_beam/runners/worker/data_plane.py",> line 686, in <lambda>
raise self
grpc._channel._MultiThreadedRendezvous: <_MultiThreadedRendezvous of RPC that terminated with:
status = StatusCode.UNAVAILABLE
details = "recvmsg:Connection reset by peer"
debug_error_string = "UNKNOWN:Error received from peer ipv6:%5B::1%5D:35265 {grpc_message:"recvmsg:Connection reset by peer", grpc_status:14, created_time:"2023-11-20T20:46:37.07209385+00:00"}"
>
target=lambda: self._read_inputs(elements_iterator),
File "<https://ci-beam.apache.org/job/beam_PostCommit_Python38/ws/src/sdks/python/apache_beam/runners/worker/data_plane.py",> line 669, in _read_inputs
raise self
grpc._channel._MultiThreadedRendezvous: <_MultiThreadedRendezvous of RPC that terminated with:
status = StatusCode.UNAVAILABLE
details = "Socket closed"
debug_error_string = "UNKNOWN:Error received from peer ipv6:%5B::1%5D:36093 {created_time:"2023-11-20T20:46:37.072091509+00:00", grpc_status:14, grpc_message:"Socket closed"}"
>
for elements in elements_iterator:
File "<https://ci-beam.apache.org/job/beam_PostCommit_Python38/ws/src/build/gradleenv/2022703442/lib/python3.8/site-packages/grpc/_channel.py",> line 540, in __next__
return self._next()
File "<https://ci-beam.apache.org/job/beam_PostCommit_Python38/ws/src/build/gradleenv/2022703442/lib/python3.8/site-packages/grpc/_channel.py",> line 966, in _next
raise self
grpc._channel._MultiThreadedRendezvous: <_MultiThreadedRendezvous of RPC that terminated with:
status = StatusCode.UNAVAILABLE
details = "Socket closed"
debug_error_string = "UNKNOWN:Error received from peer ipv6:%5B::1%5D:35217 {created_time:"2023-11-20T20:46:37.072096091+00:00", grpc_status:14, grpc_message:"Socket closed"}"
>
> Task :sdks:python:test-suites:portable:py38:postCommitPy38
> Task :sdks:python:test-suites:dataflow:py38:postCommitIT
<https://ci-beam.apache.org/job/beam_PostCommit_Python38/ws/src/build/gradleenv/-1734967051/bin/python3.8>: No module named build
warning: sdist: standard file not found: should have one of README, README.rst, README.txt, README.md
warning: check: missing required meta-data: url
warning: check: missing meta-data: either (author and author_email) or (maintainer and maintainer_email) must be supplied
FAILURE: Build failed with an exception.
* Where:
Script '<https://ci-beam.apache.org/job/beam_PostCommit_Python38/ws/src/sdks/python/test-suites/dataflow/common.gradle'> line: 448
* What went wrong:
Execution failed for task ':sdks:python:test-suites:dataflow:py38:vertexAIInferenceTest'.
> Process 'command 'sh'' finished with non-zero exit value 1
* Try:
> Run with --stacktrace option to get the stack trace.
> Run with --info or --debug option to get more log output.
> Get more help at https://help.gradle.org.
Deprecated Gradle features were used in this build, making it incompatible with Gradle 9.0.
You can use '--warning-mode all' to show the individual deprecation warnings and determine if they come from your own scripts or plugins.
For more on this, please refer to https://docs.gradle.org/8.4/userguide/command_line_interface.html#sec:command_line_warnings in the Gradle documentation.
BUILD FAILED in 2h 24m 8s
224 actionable tasks: 159 executed, 61 from cache, 4 up-to-date
Publishing build scan...
https://ge.apache.org/s/vtfps4oxedjy6
Build step 'Invoke Gradle script' changed build result to FAILURE
Build step 'Invoke Gradle script' marked build as failure
---------------------------------------------------------------------
To unsubscribe, e-mail: builds-unsubscribe@beam.apache.org
For additional commands, e-mail: builds-help@beam.apache.org
Build failed in Jenkins: beam_PostCommit_Python38 #4834
Posted by Apache Jenkins Server <je...@builds.apache.org>.
See <https://ci-beam.apache.org/job/beam_PostCommit_Python38/4834/display/redirect>
Changes:
------------------------------------------
[...truncated 12.24 MB...]
apache_beam/io/gcp/bigquery_file_loads_test.py::BigQueryFileLoadsIT::test_one_job_fails_all_jobs_fail
[gw1] [32mPASSED[0m apache_beam/io/gcp/bigquery_test.py::BigQueryStreamingInsertTransformIntegrationTests::test_value_provider_transform
apache_beam/io/gcp/bigquery_test.py::PubSubBigQueryIT::test_file_loads
[gw2] [32mPASSED[0m apache_beam/examples/complete/game/leader_board_it_test.py::LeaderBoardIT::test_leader_board_it
apache_beam/io/gcp/bigquery_io_read_it_test.py::BigqueryIOReadIT::test_bigquery_read_1M_python
[gw3] [32mPASSED[0m apache_beam/io/gcp/bigquery_json_it_test.py::BigQueryJsonIT::test_direct_read
apache_beam/io/gcp/bigquery_json_it_test.py::BigQueryJsonIT::test_export_read
[gw6] [32mPASSED[0m apache_beam/io/gcp/bigquery_write_it_test.py::BigQueryWriteIntegrationTests::test_big_query_write
apache_beam/io/gcp/bigquery_write_it_test.py::BigQueryWriteIntegrationTests::test_big_query_write_insert_errors_reporting
[gw0] [32mPASSED[0m apache_beam/dataframe/io_it_test.py::ReadUsingReadGbqTests::test_ReadGbq_with_computation
apache_beam/io/gcp/gcsfilesystem_integration_test.py::GcsFileSystemIntegrationTest::test_copy
[gw0] [32mPASSED[0m apache_beam/io/gcp/gcsfilesystem_integration_test.py::GcsFileSystemIntegrationTest::test_copy
apache_beam/io/gcp/gcsfilesystem_integration_test.py::GcsFileSystemIntegrationTest::test_rename
[gw0] [32mPASSED[0m apache_beam/io/gcp/gcsfilesystem_integration_test.py::GcsFileSystemIntegrationTest::test_rename
apache_beam/io/gcp/gcsfilesystem_integration_test.py::GcsFileSystemIntegrationTest::test_rename_error
[gw0] [32mPASSED[0m apache_beam/io/gcp/gcsfilesystem_integration_test.py::GcsFileSystemIntegrationTest::test_rename_error
apache_beam/io/gcp/datastore/v1new/datastore_write_it_test.py::DatastoreWriteIT::test_datastore_write_limit
[gw4] [32mPASSED[0m apache_beam/io/gcp/big_query_query_to_table_it_test.py::BigQueryQueryToTableIT::test_big_query_legacy_sql
apache_beam/io/gcp/big_query_query_to_table_it_test.py::BigQueryQueryToTableIT::test_big_query_new_types
[gw5] [32mPASSED[0m apache_beam/io/gcp/bigquery_file_loads_test.py::BigQueryFileLoadsIT::test_one_job_fails_all_jobs_fail
apache_beam/io/gcp/gcsio_integration_test.py::GcsIOIntegrationTest::test_batch_copy_and_delete
[gw5] [32mPASSED[0m apache_beam/io/gcp/gcsio_integration_test.py::GcsIOIntegrationTest::test_batch_copy_and_delete
apache_beam/io/gcp/gcsio_integration_test.py::GcsIOIntegrationTest::test_copy
[gw5] [32mPASSED[0m apache_beam/io/gcp/gcsio_integration_test.py::GcsIOIntegrationTest::test_copy
apache_beam/ml/gcp/cloud_dlp_it_test.py::CloudDLPIT::test_deidentification
[gw2] [32mPASSED[0m apache_beam/io/gcp/bigquery_io_read_it_test.py::BigqueryIOReadIT::test_bigquery_read_1M_python
apache_beam/io/gcp/bigquery_io_read_it_test.py::BigqueryIOReadIT::test_bigquery_read_custom_1M_python
[gw3] [32mPASSED[0m apache_beam/io/gcp/bigquery_json_it_test.py::BigQueryJsonIT::test_export_read
apache_beam/io/gcp/bigquery_json_it_test.py::BigQueryJsonIT::test_file_loads_write
[gw3] [32mPASSED[0m apache_beam/io/gcp/bigquery_json_it_test.py::BigQueryJsonIT::test_file_loads_write
apache_beam/io/gcp/bigquery_json_it_test.py::BigQueryJsonIT::test_query_read
[gw6] [32mPASSED[0m apache_beam/io/gcp/bigquery_write_it_test.py::BigQueryWriteIntegrationTests::test_big_query_write_insert_errors_reporting
apache_beam/io/gcp/bigquery_write_it_test.py::BigQueryWriteIntegrationTests::test_big_query_write_insert_non_transient_api_call_error
[gw4] [32mPASSED[0m apache_beam/io/gcp/big_query_query_to_table_it_test.py::BigQueryQueryToTableIT::test_big_query_new_types
apache_beam/io/gcp/big_query_query_to_table_it_test.py::BigQueryQueryToTableIT::test_big_query_new_types_avro
[gw5] [32mPASSED[0m apache_beam/ml/gcp/cloud_dlp_it_test.py::CloudDLPIT::test_deidentification
apache_beam/ml/gcp/cloud_dlp_it_test.py::CloudDLPIT::test_inspection
[gw2] [32mPASSED[0m apache_beam/io/gcp/bigquery_io_read_it_test.py::BigqueryIOReadIT::test_bigquery_read_custom_1M_python
apache_beam/io/gcp/pubsub_integration_test.py::PubSubIntegrationTest::test_streaming_data_only
[gw3] [32mPASSED[0m apache_beam/io/gcp/bigquery_json_it_test.py::BigQueryJsonIT::test_query_read
apache_beam/io/gcp/bigquery_json_it_test.py::BigQueryJsonIT::test_streaming_inserts
[gw6] [32mPASSED[0m apache_beam/io/gcp/bigquery_write_it_test.py::BigQueryWriteIntegrationTests::test_big_query_write_insert_non_transient_api_call_error
apache_beam/io/gcp/bigquery_write_it_test.py::BigQueryWriteIntegrationTests::test_big_query_write_new_types
[gw4] [32mPASSED[0m apache_beam/io/gcp/big_query_query_to_table_it_test.py::BigQueryQueryToTableIT::test_big_query_new_types_avro
apache_beam/io/gcp/big_query_query_to_table_it_test.py::BigQueryQueryToTableIT::test_big_query_standard_sql
[gw7] [32mPASSED[0m apache_beam/examples/dataframe/taxiride_it_test.py::TaxirideIT::test_enrich
apache_beam/io/gcp/bigquery_read_it_test.py::ReadTests::test_iobase_source
[gw5] [32mPASSED[0m apache_beam/ml/gcp/cloud_dlp_it_test.py::CloudDLPIT::test_inspection
apache_beam/ml/gcp/naturallanguageml_test_it.py::NaturalLanguageMlTestIT::test_analyzing_syntax
[gw5] [33mSKIPPED[0m apache_beam/ml/gcp/naturallanguageml_test_it.py::NaturalLanguageMlTestIT::test_analyzing_syntax
apache_beam/ml/gcp/visionml_test_it.py::VisionMlTestIT::test_text_detection_with_language_hint
[gw1] [32mPASSED[0m apache_beam/io/gcp/bigquery_test.py::PubSubBigQueryIT::test_file_loads
apache_beam/io/gcp/bigquery_test.py::PubSubBigQueryIT::test_streaming_inserts
[gw6] [32mPASSED[0m apache_beam/io/gcp/bigquery_write_it_test.py::BigQueryWriteIntegrationTests::test_big_query_write_new_types
apache_beam/io/gcp/bigquery_write_it_test.py::BigQueryWriteIntegrationTests::test_big_query_write_schema_autodetect
[gw6] [33mSKIPPED[0m apache_beam/io/gcp/bigquery_write_it_test.py::BigQueryWriteIntegrationTests::test_big_query_write_schema_autodetect
apache_beam/io/gcp/bigquery_write_it_test.py::BigQueryWriteIntegrationTests::test_big_query_write_without_schema
[gw5] [32mPASSED[0m apache_beam/ml/gcp/visionml_test_it.py::VisionMlTestIT::test_text_detection_with_language_hint
apache_beam/ml/inference/pytorch_inference_it_test.py::PyTorchInference::test_torch_run_inference_bert_for_masked_lm
[gw5] [33mSKIPPED[0m apache_beam/ml/inference/pytorch_inference_it_test.py::PyTorchInference::test_torch_run_inference_bert_for_masked_lm
apache_beam/ml/inference/pytorch_inference_it_test.py::PyTorchInference::test_torch_run_inference_bert_for_masked_lm_large_model
[gw5] [33mSKIPPED[0m apache_beam/ml/inference/pytorch_inference_it_test.py::PyTorchInference::test_torch_run_inference_bert_for_masked_lm_large_model
apache_beam/ml/inference/pytorch_inference_it_test.py::PyTorchInference::test_torch_run_inference_coco_maskrcnn_resnet50_fpn
[gw5] [33mSKIPPED[0m apache_beam/ml/inference/pytorch_inference_it_test.py::PyTorchInference::test_torch_run_inference_coco_maskrcnn_resnet50_fpn
apache_beam/ml/inference/pytorch_inference_it_test.py::PyTorchInference::test_torch_run_inference_coco_maskrcnn_resnet50_fpn_v1_and_v2
[gw5] [33mSKIPPED[0m apache_beam/ml/inference/pytorch_inference_it_test.py::PyTorchInference::test_torch_run_inference_coco_maskrcnn_resnet50_fpn_v1_and_v2
apache_beam/ml/inference/pytorch_inference_it_test.py::PyTorchInference::test_torch_run_inference_imagenet_mobilenetv2
[gw5] [33mSKIPPED[0m apache_beam/ml/inference/pytorch_inference_it_test.py::PyTorchInference::test_torch_run_inference_imagenet_mobilenetv2
apache_beam/ml/inference/xgboost_inference_it_test.py::XGBoostInference::test_iris_classification_datatable_multi_batch
[gw5] [33mSKIPPED[0m apache_beam/ml/inference/xgboost_inference_it_test.py::XGBoostInference::test_iris_classification_datatable_multi_batch
apache_beam/ml/inference/xgboost_inference_it_test.py::XGBoostInference::test_iris_classification_datatable_single_batch
[gw5] [33mSKIPPED[0m apache_beam/ml/inference/xgboost_inference_it_test.py::XGBoostInference::test_iris_classification_datatable_single_batch
apache_beam/ml/inference/xgboost_inference_it_test.py::XGBoostInference::test_iris_classification_numpy_multi_batch
[gw5] [33mSKIPPED[0m apache_beam/ml/inference/xgboost_inference_it_test.py::XGBoostInference::test_iris_classification_numpy_multi_batch
apache_beam/ml/inference/xgboost_inference_it_test.py::XGBoostInference::test_iris_classification_numpy_single_batch
[gw5] [33mSKIPPED[0m apache_beam/ml/inference/xgboost_inference_it_test.py::XGBoostInference::test_iris_classification_numpy_single_batch
apache_beam/ml/inference/xgboost_inference_it_test.py::XGBoostInference::test_iris_classification_numpy_single_batch_large_model
[gw5] [33mSKIPPED[0m apache_beam/ml/inference/xgboost_inference_it_test.py::XGBoostInference::test_iris_classification_numpy_single_batch_large_model
apache_beam/ml/inference/xgboost_inference_it_test.py::XGBoostInference::test_iris_classification_pandas_multi_batch
[gw5] [33mSKIPPED[0m apache_beam/ml/inference/xgboost_inference_it_test.py::XGBoostInference::test_iris_classification_pandas_multi_batch
apache_beam/ml/inference/xgboost_inference_it_test.py::XGBoostInference::test_iris_classification_pandas_single_batch
[gw5] [33mSKIPPED[0m apache_beam/ml/inference/xgboost_inference_it_test.py::XGBoostInference::test_iris_classification_pandas_single_batch
apache_beam/ml/inference/xgboost_inference_it_test.py::XGBoostInference::test_iris_classification_scipy_multi_batch
[gw5] [33mSKIPPED[0m apache_beam/ml/inference/xgboost_inference_it_test.py::XGBoostInference::test_iris_classification_scipy_multi_batch
apache_beam/ml/inference/xgboost_inference_it_test.py::XGBoostInference::test_iris_classification_scipy_single_batch
[gw5] [33mSKIPPED[0m apache_beam/ml/inference/xgboost_inference_it_test.py::XGBoostInference::test_iris_classification_scipy_single_batch
apache_beam/runners/dataflow/dataflow_exercise_metrics_pipeline_test.py::ExerciseMetricsPipelineTest::test_metrics_it
[gw5] [33mSKIPPED[0m apache_beam/runners/dataflow/dataflow_exercise_metrics_pipeline_test.py::ExerciseMetricsPipelineTest::test_metrics_it
apache_beam/testing/test_stream_it_test.py::TestStreamIntegrationTests::test_basic_execution
[gw5] [33mSKIPPED[0m apache_beam/testing/test_stream_it_test.py::TestStreamIntegrationTests::test_basic_execution
apache_beam/testing/test_stream_it_test.py::TestStreamIntegrationTests::test_multiple_outputs
[gw5] [33mSKIPPED[0m apache_beam/testing/test_stream_it_test.py::TestStreamIntegrationTests::test_multiple_outputs
apache_beam/testing/test_stream_it_test.py::TestStreamIntegrationTests::test_multiple_outputs_with_watermark_advancement
[gw5] [33mSKIPPED[0m apache_beam/testing/test_stream_it_test.py::TestStreamIntegrationTests::test_multiple_outputs_with_watermark_advancement
apache_beam/transforms/external_it_test.py::ExternalTransformIT::test_job_python_from_python_it
[gw4] [32mPASSED[0m apache_beam/io/gcp/big_query_query_to_table_it_test.py::BigQueryQueryToTableIT::test_big_query_standard_sql
apache_beam/ml/gcp/videointelligenceml_test_it.py::VideoIntelligenceMlTestIT::test_label_detection_with_video_context
[gw4] [33mSKIPPED[0m apache_beam/ml/gcp/videointelligenceml_test_it.py::VideoIntelligenceMlTestIT::test_label_detection_with_video_context
apache_beam/ml/inference/onnx_inference_it_test.py::OnnxInference::test_onnx_run_inference_roberta_sentiment_classification
[gw4] [33mSKIPPED[0m apache_beam/ml/inference/onnx_inference_it_test.py::OnnxInference::test_onnx_run_inference_roberta_sentiment_classification
[gw7] [32mPASSED[0m apache_beam/io/gcp/bigquery_read_it_test.py::ReadTests::test_iobase_source
apache_beam/io/gcp/bigquery_read_it_test.py::ReadTests::test_native_source
[gw3] [32mPASSED[0m apache_beam/io/gcp/bigquery_json_it_test.py::BigQueryJsonIT::test_streaming_inserts
apache_beam/ml/gcp/recommendations_ai_test_it.py::RecommendationAIIT::test_create_catalog_item
[gw2] [32mPASSED[0m apache_beam/io/gcp/pubsub_integration_test.py::PubSubIntegrationTest::test_streaming_data_only
apache_beam/io/gcp/pubsub_integration_test.py::PubSubIntegrationTest::test_streaming_with_attributes
[gw6] [32mPASSED[0m apache_beam/io/gcp/bigquery_write_it_test.py::BigQueryWriteIntegrationTests::test_big_query_write_without_schema
apache_beam/ml/inference/tensorflow_inference_it_test.py::TensorflowInference::test_tf_imagenet_image_segmentation
[gw6] [33mSKIPPED[0m apache_beam/ml/inference/tensorflow_inference_it_test.py::TensorflowInference::test_tf_imagenet_image_segmentation
apache_beam/ml/inference/tensorflow_inference_it_test.py::TensorflowInference::test_tf_mnist_classification
[gw6] [33mSKIPPED[0m apache_beam/ml/inference/tensorflow_inference_it_test.py::TensorflowInference::test_tf_mnist_classification
apache_beam/ml/inference/tensorflow_inference_it_test.py::TensorflowInference::test_tf_mnist_classification_large_model
[gw6] [33mSKIPPED[0m apache_beam/ml/inference/tensorflow_inference_it_test.py::TensorflowInference::test_tf_mnist_classification_large_model
apache_beam/ml/inference/tensorflow_inference_it_test.py::TensorflowInference::test_tf_mnist_with_weights_classification
[gw6] [33mSKIPPED[0m apache_beam/ml/inference/tensorflow_inference_it_test.py::TensorflowInference::test_tf_mnist_with_weights_classification
[gw5] [32mPASSED[0m apache_beam/transforms/external_it_test.py::ExternalTransformIT::test_job_python_from_python_it
apache_beam/transforms/periodicsequence_it_test.py::PeriodicSequenceIT::test_periodicsequence_outputs_valid_watermarks_it
[gw5] [33mSKIPPED[0m apache_beam/transforms/periodicsequence_it_test.py::PeriodicSequenceIT::test_periodicsequence_outputs_valid_watermarks_it
[gw7] [32mPASSED[0m apache_beam/io/gcp/bigquery_read_it_test.py::ReadTests::test_native_source
apache_beam/io/gcp/bigquery_read_it_test.py::ReadTests::test_table_schema_retrieve
[gw3] [32mPASSED[0m apache_beam/ml/gcp/recommendations_ai_test_it.py::RecommendationAIIT::test_create_catalog_item
apache_beam/ml/gcp/recommendations_ai_test_it.py::RecommendationAIIT::test_create_user_event
[gw0] [32mPASSED[0m apache_beam/io/gcp/datastore/v1new/datastore_write_it_test.py::DatastoreWriteIT::test_datastore_write_limit
apache_beam/io/gcp/healthcare/dicomio_integration_test.py::DICOMIoIntegrationTest::test_dicom_search_instances
[gw7] [32mPASSED[0m apache_beam/io/gcp/bigquery_read_it_test.py::ReadTests::test_table_schema_retrieve
apache_beam/io/gcp/bigquery_read_it_test.py::ReadTests::test_table_schema_retrieve_specifying_only_table
[gw3] [32mPASSED[0m apache_beam/ml/gcp/recommendations_ai_test_it.py::RecommendationAIIT::test_create_user_event
apache_beam/ml/gcp/recommendations_ai_test_it.py::RecommendationAIIT::test_predict
[gw2] [32mPASSED[0m apache_beam/io/gcp/pubsub_integration_test.py::PubSubIntegrationTest::test_streaming_with_attributes
apache_beam/ml/inference/base_test.py::RunInferenceBaseTest::test_run_inference_with_side_inputin_streaming
[gw2] [33mSKIPPED[0m apache_beam/ml/inference/base_test.py::RunInferenceBaseTest::test_run_inference_with_side_inputin_streaming
[gw1] [32mPASSED[0m apache_beam/io/gcp/bigquery_test.py::PubSubBigQueryIT::test_streaming_inserts
apache_beam/io/gcp/bigquery_test.py::BigQueryFileLoadsIntegrationTests::test_avro_file_load
[gw0] [32mPASSED[0m apache_beam/io/gcp/healthcare/dicomio_integration_test.py::DICOMIoIntegrationTest::test_dicom_search_instances
apache_beam/io/gcp/healthcare/dicomio_integration_test.py::DICOMIoIntegrationTest::test_dicom_store_instance_from_gcs
[gw3] [32mPASSED[0m apache_beam/ml/gcp/recommendations_ai_test_it.py::RecommendationAIIT::test_predict
[gw7] [32mPASSED[0m apache_beam/io/gcp/bigquery_read_it_test.py::ReadTests::test_table_schema_retrieve_specifying_only_table
apache_beam/io/gcp/bigquery_read_it_test.py::ReadTests::test_table_schema_retrieve_with_direct_read
[gw1] [32mPASSED[0m apache_beam/io/gcp/bigquery_test.py::BigQueryFileLoadsIntegrationTests::test_avro_file_load
apache_beam/ml/inference/sklearn_inference_it_test.py::SklearnInference::test_sklearn_mnist_classification
[gw0] [32mPASSED[0m apache_beam/io/gcp/healthcare/dicomio_integration_test.py::DICOMIoIntegrationTest::test_dicom_store_instance_from_gcs
[gw7] [32mPASSED[0m apache_beam/io/gcp/bigquery_read_it_test.py::ReadTests::test_table_schema_retrieve_with_direct_read
apache_beam/io/gcp/bigquery_read_it_test.py::ReadUsingStorageApiTests::test_iobase_source
[gw1] [32mPASSED[0m apache_beam/ml/inference/sklearn_inference_it_test.py::SklearnInference::test_sklearn_mnist_classification
apache_beam/ml/inference/sklearn_inference_it_test.py::SklearnInference::test_sklearn_mnist_classification_large_model
[gw7] [32mPASSED[0m apache_beam/io/gcp/bigquery_read_it_test.py::ReadUsingStorageApiTests::test_iobase_source
apache_beam/io/gcp/bigquery_read_it_test.py::ReadUsingStorageApiTests::test_iobase_source_with_column_selection
[gw1] [32mPASSED[0m apache_beam/ml/inference/sklearn_inference_it_test.py::SklearnInference::test_sklearn_mnist_classification_large_model
apache_beam/ml/inference/sklearn_inference_it_test.py::SklearnInference::test_sklearn_regression
[gw7] [32mPASSED[0m apache_beam/io/gcp/bigquery_read_it_test.py::ReadUsingStorageApiTests::test_iobase_source_with_column_selection
apache_beam/io/gcp/bigquery_read_it_test.py::ReadUsingStorageApiTests::test_iobase_source_with_column_selection_and_row_restriction
[gw1] [32mPASSED[0m apache_beam/ml/inference/sklearn_inference_it_test.py::SklearnInference::test_sklearn_regression
[gw7] [32mPASSED[0m apache_beam/io/gcp/bigquery_read_it_test.py::ReadUsingStorageApiTests::test_iobase_source_with_column_selection_and_row_restriction
apache_beam/io/gcp/bigquery_read_it_test.py::ReadUsingStorageApiTests::test_iobase_source_with_column_selection_and_row_restriction_rows
[gw7] [32mPASSED[0m apache_beam/io/gcp/bigquery_read_it_test.py::ReadUsingStorageApiTests::test_iobase_source_with_column_selection_and_row_restriction_rows
apache_beam/io/gcp/bigquery_read_it_test.py::ReadUsingStorageApiTests::test_iobase_source_with_native_datetime
[gw7] [32mPASSED[0m apache_beam/io/gcp/bigquery_read_it_test.py::ReadUsingStorageApiTests::test_iobase_source_with_native_datetime
apache_beam/io/gcp/bigquery_read_it_test.py::ReadUsingStorageApiTests::test_iobase_source_with_query
[gw7] [32mPASSED[0m apache_beam/io/gcp/bigquery_read_it_test.py::ReadUsingStorageApiTests::test_iobase_source_with_query
apache_beam/io/gcp/bigquery_read_it_test.py::ReadUsingStorageApiTests::test_iobase_source_with_query_and_filters
[gw7] [32mPASSED[0m apache_beam/io/gcp/bigquery_read_it_test.py::ReadUsingStorageApiTests::test_iobase_source_with_query_and_filters
apache_beam/io/gcp/bigquery_read_it_test.py::ReadUsingStorageApiTests::test_iobase_source_with_row_restriction
[gw7] [32mPASSED[0m apache_beam/io/gcp/bigquery_read_it_test.py::ReadUsingStorageApiTests::test_iobase_source_with_row_restriction
apache_beam/io/gcp/bigquery_read_it_test.py::ReadUsingStorageApiTests::test_iobase_source_with_very_selective_filters
[gw7] [32mPASSED[0m apache_beam/io/gcp/bigquery_read_it_test.py::ReadUsingStorageApiTests::test_iobase_source_with_very_selective_filters
apache_beam/io/gcp/bigquery_read_it_test.py::ReadNewTypesTests::test_iobase_source
[gw7] [32mPASSED[0m apache_beam/io/gcp/bigquery_read_it_test.py::ReadNewTypesTests::test_iobase_source
apache_beam/io/gcp/bigquery_read_it_test.py::ReadNewTypesTests::test_native_source
[gw7] [32mPASSED[0m apache_beam/io/gcp/bigquery_read_it_test.py::ReadNewTypesTests::test_native_source
apache_beam/io/gcp/bigquery_read_it_test.py::ReadAllBQTests::test_read_queries
[gw7] [32mPASSED[0m apache_beam/io/gcp/bigquery_read_it_test.py::ReadAllBQTests::test_read_queries
apache_beam/io/gcp/bigquery_read_it_test.py::ReadInteractiveRunnerTests::test_read_in_interactive_runner
[gw7] [32mPASSED[0m apache_beam/io/gcp/bigquery_read_it_test.py::ReadInteractiveRunnerTests::test_read_in_interactive_runner
[33m=============================== warnings summary ===============================[0m
apache_beam/examples/complete/game/hourly_team_score_it_test.py::HourlyTeamScoreIT::test_hourly_team_score_it
apache_beam/examples/complete/game/game_stats_it_test.py::GameStatsIT::test_game_stats_it
apache_beam/examples/complete/game/leader_board_it_test.py::LeaderBoardIT::test_leader_board_it
apache_beam/io/gcp/bigquery_test.py::PubSubBigQueryIT::test_file_loads
apache_beam/io/gcp/bigquery_test.py::PubSubBigQueryIT::test_streaming_inserts
<https://ci-beam.apache.org/job/beam_PostCommit_Python38/ws/src/sdks/python/apache_beam/io/gcp/tests/utils.py>:63: PendingDeprecationWarning: Client.dataset is deprecated and will be removed in a future version. Use a string like 'my_project.my_dataset' or a cloud.google.bigquery.DatasetReference object, instead.
dataset_ref = client.dataset(unique_dataset_name, project=project)
apache_beam/examples/cookbook/bigquery_tornadoes_it_test.py::BigqueryTornadoesIT::test_bigquery_tornadoes_it
<https://ci-beam.apache.org/job/beam_PostCommit_Python38/ws/src/sdks/python/apache_beam/io/gcp/tests/utils.py>:100: PendingDeprecationWarning: Client.dataset is deprecated and will be removed in a future version. Use a string like 'my_project.my_dataset' or a cloud.google.bigquery.DatasetReference object, instead.
table_ref = client.dataset(dataset_id).table(table_id)
apache_beam/examples/dataframe/flight_delays_it_test.py::FlightDelaysTest::test_flight_delays
<https://ci-beam.apache.org/job/beam_PostCommit_Python38/ws/src/sdks/python/apache_beam/examples/dataframe/flight_delays.py>:47: FutureWarning: The default value of numeric_only in DataFrame.mean is deprecated. In a future version, it will default to False. In addition, specifying 'numeric_only=None' is deprecated. Select only valid columns or specify the value of numeric_only to silence this warning.
return airline_df[at_top_airports].mean()
apache_beam/io/gcp/bigquery_read_it_test.py::ReadTests::test_native_source
<https://ci-beam.apache.org/job/beam_PostCommit_Python38/ws/src/sdks/python/apache_beam/io/gcp/bigquery_read_it_test.py>:170: BeamDeprecationWarning: BigQuerySource is deprecated since 2.25.0. Use ReadFromBigQuery instead.
beam.io.BigQuerySource(query=self.query, use_standard_sql=True)))
apache_beam/io/gcp/bigquery_read_it_test.py::ReadNewTypesTests::test_native_source
<https://ci-beam.apache.org/job/beam_PostCommit_Python38/ws/src/sdks/python/apache_beam/io/gcp/bigquery_read_it_test.py>:706: BeamDeprecationWarning: BigQuerySource is deprecated since 2.25.0. Use ReadFromBigQuery instead.
beam.io.BigQuerySource(query=self.query, use_standard_sql=True)))
-- Docs: https://docs.pytest.org/en/stable/how-to/capture-warnings.html
- generated xml file: <https://ci-beam.apache.org/job/beam_PostCommit_Python38/ws/src/sdks/python/pytest_postCommitIT-df-py38.xml> -
[33m=========== [32m83 passed[0m, [33m[1m49 skipped[0m, [33m[1m9 warnings[0m[33m in 9049.64s (2:30:49)[0m[33m ============[0m
FAILURE: Build completed with 2 failures.
1: Task failed with an exception.
-----------
* Where:
Script '<https://ci-beam.apache.org/job/beam_PostCommit_Python38/ws/src/sdks/python/test-suites/direct/common.gradle'> line: 52
* What went wrong:
Execution failed for task ':sdks:python:test-suites:direct:py38:postCommitIT'.
> Process 'command 'sh'' finished with non-zero exit value 1
* Try:
> Run with --stacktrace option to get the stack trace.
> Run with --info or --debug option to get more log output.
> Get more help at https://help.gradle.org.
==============================================================================
2: Task failed with an exception.
-----------
* Where:
Script '<https://ci-beam.apache.org/job/beam_PostCommit_Python38/ws/src/sdks/python/test-suites/dataflow/common.gradle'> line: 448
* What went wrong:
Execution failed for task ':sdks:python:test-suites:dataflow:py38:vertexAIInferenceTest'.
> Process 'command 'sh'' finished with non-zero exit value 1
* Try:
> Run with --stacktrace option to get the stack trace.
> Run with --info or --debug option to get more log output.
> Get more help at https://help.gradle.org.
==============================================================================
Deprecated Gradle features were used in this build, making it incompatible with Gradle 9.0.
You can use '--warning-mode all' to show the individual deprecation warnings and determine if they come from your own scripts or plugins.
For more on this, please refer to https://docs.gradle.org/8.4/userguide/command_line_interface.html#sec:command_line_warnings in the Gradle documentation.
BUILD FAILED in 2h 59m 37s
224 actionable tasks: 159 executed, 61 from cache, 4 up-to-date
Publishing build scan...
https://ge.apache.org/s/zdno2cy6mhoqu
Build step 'Invoke Gradle script' changed build result to FAILURE
Build step 'Invoke Gradle script' marked build as failure
---------------------------------------------------------------------
To unsubscribe, e-mail: builds-unsubscribe@beam.apache.org
For additional commands, e-mail: builds-help@beam.apache.org