You are viewing a plain text version of this content. The canonical link for it is here.
Posted to builds@beam.apache.org by Apache Jenkins Server <je...@builds.apache.org> on 2023/08/22 14:09:35 UTC

Build failed in Jenkins: beam_PostCommit_Python_Xlang_Gcp_Dataflow #590

See <https://ci-beam.apache.org/job/beam_PostCommit_Python_Xlang_Gcp_Dataflow/590/display/redirect>

Changes:


------------------------------------------
[...truncated 206.26 KB...]
Collecting numpy
  Downloading numpy-1.25.2-cp311-cp311-manylinux_2_17_x86_64.manylinux2014_x86_64.whl (18.2 MB)
     ━━━━━━━━━━━━━━━━━━━━━━━━━━━━━━━━━━━━━━━━ 18.2/18.2 MB 64.5 MB/s eta 0:00:00
Installing collected packages: numpy, cython
Successfully installed cython-0.29.36 numpy-1.25.2
Requirement already satisfied: setuptools in /opt/_internal/cpython-3.11.0rc1/lib/python3.11/site-packages (63.4.2)
Collecting setuptools
  Downloading setuptools-68.1.2-py3-none-any.whl (805 kB)
     ━━━━━━━━━━━━━━━━━━━━━━━━━━━━━━━━━━━━━━ 805.1/805.1 kB 13.3 MB/s eta 0:00:00
Installing collected packages: setuptools
  Attempting uninstall: setuptools
    Found existing installation: setuptools 63.4.2
    Uninstalling setuptools-63.4.2:
      Successfully uninstalled setuptools-63.4.2
Successfully installed setuptools-68.1.2

                                                                      ✓ 13.28s
Building wheel...

    + rm -rf /tmp/cibuildwheel/built_wheel
    + mkdir -p /tmp/cibuildwheel/built_wheel
    + python -m pip wheel /project --wheel-dir=/tmp/cibuildwheel/built_wheel --no-deps

[notice] A new release of pip available: 22.2.2 -> 23.2.1
[notice] To update, run: pip install --upgrade pip
Processing /project
  Preparing metadata (setup.py): started
  Preparing metadata (setup.py): finished with status 'done'
Building wheels for collected packages: apache-beam
  Building wheel for apache-beam (setup.py): started
  Building wheel for apache-beam (setup.py): still running...
  Building wheel for apache-beam (setup.py): still running...
  Building wheel for apache-beam (setup.py): still running...
  Building wheel for apache-beam (setup.py): finished with status 'done'
  Created wheel for apache-beam: filename=apache_beam-2.51.0.dev0-cp311-cp311-linux_x86_64.whl size=15742692 sha256=ed3ce5018ab2aed03b65843c771dc346396960d260cb1b1a371113df13c853fe
  Stored in directory: /tmp/pip-ephem-wheel-cache-6wzuo4v8/wheels/aa/0c/49/7c4d39428e78274ff9f1db5b9c539aa0d6bd6becda70207fa7
Successfully built apache-beam
    + /opt/python/cp38-cp38/bin/python -c 'import sys, json, glob; json.dump(glob.glob('"'"'/tmp/cibuildwheel/built_wheel/*.whl'"'"'), sys.stdout)'
    + rm -rf /tmp/cibuildwheel/repaired_wheel
    + mkdir -p /tmp/cibuildwheel/repaired_wheel

                                                                     ✓ 240.55s
Repairing wheel...

    + sh -c 'auditwheel repair -w /tmp/cibuildwheel/repaired_wheel /tmp/cibuildwheel/built_wheel/apache_beam-2.51.0.dev0-cp311-cp311-linux_x86_64.whl'
INFO:auditwheel.main_repair:Repairing apache_beam-2.51.0.dev0-cp311-cp311-linux_x86_64.whl
INFO:auditwheel.wheeltools:Previous filename tags: linux_x86_64
INFO:auditwheel.wheeltools:New filename tags: manylinux_2_17_x86_64, manylinux2014_x86_64
INFO:auditwheel.wheeltools:Previous WHEEL info tags: cp311-cp311-linux_x86_64
INFO:auditwheel.wheeltools:New WHEEL info tags: cp311-cp311-manylinux_2_17_x86_64, cp311-cp311-manylinux2014_x86_64
INFO:auditwheel.main_repair:
Fixed-up wheel written to /tmp/cibuildwheel/repaired_wheel/apache_beam-2.51.0.dev0-cp311-cp311-manylinux_2_17_x86_64.manylinux2014_x86_64.whl
    + /opt/python/cp38-cp38/bin/python -c 'import sys, json, glob; json.dump(glob.glob('"'"'/tmp/cibuildwheel/repaired_wheel/*.whl'"'"'), sys.stdout)'
    + mkdir -p /output
    + mv /tmp/cibuildwheel/repaired_wheel/apache_beam-2.51.0.dev0-cp311-cp311-manylinux_2_17_x86_64.manylinux2014_x86_64.whl /output

                                                                       ✓ 6.71s

✓ cp311-manylinux_x86_64 finished in 260.96s
Copying wheels back to host...


                                                                       ✓ 0.15s

1 wheels produced in 5 minutes:
  apache_beam-2.51.0.dev0-cp311-cp311-manylinux_2_17_x86_64.manylinux2014_x86_64.whl   15,390 kB

> Task :sdks:python:test-suites:dataflow:py311:initializeForDataflowJob

> Task :sdks:python:bdistPy38linux
Requirement already satisfied: cibuildwheel==2.9.0 in <https://ci-beam.apache.org/job/beam_PostCommit_Python_Xlang_Gcp_Dataflow/ws/src/build/gradleenv/1922375555/lib/python3.8/site-packages> (2.9.0)
Requirement already satisfied: bashlex!=0.13 in <https://ci-beam.apache.org/job/beam_PostCommit_Python_Xlang_Gcp_Dataflow/ws/src/build/gradleenv/1922375555/lib/python3.8/site-packages> (from cibuildwheel==2.9.0) (0.18)
Requirement already satisfied: bracex in <https://ci-beam.apache.org/job/beam_PostCommit_Python_Xlang_Gcp_Dataflow/ws/src/build/gradleenv/1922375555/lib/python3.8/site-packages> (from cibuildwheel==2.9.0) (2.3.post1)
Requirement already satisfied: certifi in <https://ci-beam.apache.org/job/beam_PostCommit_Python_Xlang_Gcp_Dataflow/ws/src/build/gradleenv/1922375555/lib/python3.8/site-packages> (from cibuildwheel==2.9.0) (2023.7.22)
Requirement already satisfied: filelock in <https://ci-beam.apache.org/job/beam_PostCommit_Python_Xlang_Gcp_Dataflow/ws/src/build/gradleenv/1922375555/lib/python3.8/site-packages> (from cibuildwheel==2.9.0) (3.12.2)
Requirement already satisfied: packaging>=20.9 in <https://ci-beam.apache.org/job/beam_PostCommit_Python_Xlang_Gcp_Dataflow/ws/src/build/gradleenv/1922375555/lib/python3.8/site-packages> (from cibuildwheel==2.9.0) (23.1)
Requirement already satisfied: platformdirs in <https://ci-beam.apache.org/job/beam_PostCommit_Python_Xlang_Gcp_Dataflow/ws/src/build/gradleenv/1922375555/lib/python3.8/site-packages> (from cibuildwheel==2.9.0) (3.10.0)
Requirement already satisfied: tomli in <https://ci-beam.apache.org/job/beam_PostCommit_Python_Xlang_Gcp_Dataflow/ws/src/build/gradleenv/1922375555/lib/python3.8/site-packages> (from cibuildwheel==2.9.0) (2.0.1)
cp38-manylinux_x86_64

     _ _       _ _   _       _           _
 ___|_| |_ _ _|_| |_| |_ _ _| |_ ___ ___| |
|  _| | . | | | | | . | | | |   | -_| -_| |
|___|_|___|___|_|_|___|_____|_|_|___|___|_|

cibuildwheel version 2.9.0

Build options:
  platform: 'linux'
  architectures: {<Architecture.i686: 'i686'>, <Architecture.x86_64: 'x86_64'>}
  build_selector: {'build_config': 'cp38-manylinux_*64*', 'skip_config': '', 'requires_python': None, 'prerelease_pythons': False}
  container_engine: 'docker'
  output_dir: PosixPath('<https://ci-beam.apache.org/job/beam_PostCommit_Python_Xlang_Gcp_Dataflow/ws/src/sdks/python/build')>
  package_dir: PosixPath('<https://ci-beam.apache.org/job/beam_PostCommit_Python_Xlang_Gcp_Dataflow/ws/src/sdks/python')>
  test_selector: {'skip_config': ''}
  before_all: ''
  before_build: 'pip install cython==0.29.36 numpy && pip install --upgrade setuptools'
  before_test: ''
  build_frontend: 'pip'
  build_verbosity: 0
  dependency_constraints: DependencyConstraints(PosixPath('<https://ci-beam.apache.org/job/beam_PostCommit_Python_Xlang_Gcp_Dataflow/ws/src/build/gradleenv/1922375555/lib/python3.8/site-packages/cibuildwheel/resources/constraints.txt'))>
  environment: {'assignments': [SETUPTOOLS_USE_DISTUTILS=stdlib]}
    cp38-manylinux_x86_64: ParsedEnvironment(['SETUPTOOLS_USE_DISTUTILS=stdlib'])
  manylinux_images: {'x86_64': 'quay.io/pypa/manylinux2014_x86_64:2022-08-09-51a01be', 'i686': 'quay.io/pypa/manylinux2014_i686:2022-08-09-51a01be', 'pypy_x86_64': 'quay.io/pypa/manylinux2014_x86_64:2022-08-09-51a01be', 'aarch64': 'quay.io/pypa/manylinux2014_aarch64:2022-08-09-51a01be', 'ppc64le': 'quay.io/pypa/manylinux2014_ppc64le:2022-08-09-51a01be', 's390x': 'quay.io/pypa/manylinux2014_s390x:2022-08-09-51a01be', 'pypy_aarch64': 'quay.io/pypa/manylinux2014_aarch64:2022-08-09-51a01be', 'pypy_i686': 'quay.io/pypa/manylinux2014_i686:2022-08-09-51a01be'}
  musllinux_images: {'x86_64': 'quay.io/pypa/musllinux_1_1_x86_64:2022-08-09-51a01be', 'i686': 'quay.io/pypa/musllinux_1_1_i686:2022-08-09-51a01be', 'aarch64': 'quay.io/pypa/musllinux_1_1_aarch64:2022-08-09-51a01be', 'ppc64le': 'quay.io/pypa/musllinux_1_1_ppc64le:2022-08-09-51a01be', 's390x': 'quay.io/pypa/musllinux_1_1_s390x:2022-08-09-51a01be'}
  repair_command: 'auditwheel repair -w {dest_dir} {wheel}'
  test_command: ''
  test_extras: ''
  test_requires: []
Cache folder: /home/jenkins/.cache/cibuildwheel

Here we go!

Starting container image quay.io/pypa/manylinux2014_x86_64:2022-08-09-51a01be...

info: This container will host the build for cp38-manylinux_x86_64...
fcdc24bd67e448c0a78b1deac9bd51515e3f1ce05cab120cd325a3f20232e4e3
    + /bin/true
    + mkdir -p /project

                                                                       ✓ 0.46s
Copying project into container...

    + mkdir -p /project

                                                                       ✓ 0.26s

Building cp38-manylinux_x86_64 wheel
CPython 3.8 manylinux x86_64

Setting up build environment...

    + /opt/python/cp38-cp38/bin/python -c 'import sys, json, os; json.dump(os.environ.copy(), sys.stdout)'
    + which python
    + which pip

                                                                       ✓ 0.14s
Running before_build...

    + sh -c 'pip install cython==0.29.36 numpy && pip install --upgrade setuptools'
WARNING: Running pip as the 'root' user can result in broken permissions and conflicting behaviour with the system package manager. It is recommended to use a virtual environment instead: https://pip.pypa.io/warnings/venv

[notice] A new release of pip available: 22.2.2 -> 23.2.1
[notice] To update, run: python -m pip install --upgrade pip
WARNING: Running pip as the 'root' user can result in broken permissions and conflicting behaviour with the system package manager. It is recommended to use a virtual environment instead: https://pip.pypa.io/warnings/venv

[notice] A new release of pip available: 22.2.2 -> 23.2.1
[notice] To update, run: python -m pip install --upgrade pip
Collecting cython==0.29.36
  Downloading Cython-0.29.36-cp38-cp38-manylinux_2_17_x86_64.manylinux2014_x86_64.manylinux_2_24_x86_64.whl (1.9 MB)
     ━━━━━━━━━━━━━━━━━━━━━━━━━━━━━━━━━━━━━━━━ 1.9/1.9 MB 23.8 MB/s eta 0:00:00
Collecting numpy
  Downloading numpy-1.24.4-cp38-cp38-manylinux_2_17_x86_64.manylinux2014_x86_64.whl (17.3 MB)
     ━━━━━━━━━━━━━━━━━━━━━━━━━━━━━━━━━━━━━━━━ 17.3/17.3 MB 56.9 MB/s eta 0:00:00
Installing collected packages: numpy, cython
Successfully installed cython-0.29.36 numpy-1.24.4
Requirement already satisfied: setuptools in /opt/_internal/cpython-3.8.13/lib/python3.8/site-packages (63.4.2)
Collecting setuptools
  Downloading setuptools-68.1.2-py3-none-any.whl (805 kB)
     ━━━━━━━━━━━━━━━━━━━━━━━━━━━━━━━━━━━━━━ 805.1/805.1 kB 12.9 MB/s eta 0:00:00
Installing collected packages: setuptools
  Attempting uninstall: setuptools
    Found existing installation: setuptools 63.4.2
    Uninstalling setuptools-63.4.2:
      Successfully uninstalled setuptools-63.4.2
Successfully installed setuptools-68.1.2

                                                                      ✓ 11.07s
Building wheel...

    + rm -rf /tmp/cibuildwheel/built_wheel
    + mkdir -p /tmp/cibuildwheel/built_wheel
    + python -m pip wheel /project --wheel-dir=/tmp/cibuildwheel/built_wheel --no-deps

[notice] A new release of pip available: 22.2.2 -> 23.2.1
[notice] To update, run: pip install --upgrade pip
Processing /project
  Preparing metadata (setup.py): started
  Preparing metadata (setup.py): finished with status 'done'
Building wheels for collected packages: apache-beam
  Building wheel for apache-beam (setup.py): started
  Building wheel for apache-beam (setup.py): still running...
  Building wheel for apache-beam (setup.py): still running...
  Building wheel for apache-beam (setup.py): still running...
  Building wheel for apache-beam (setup.py): finished with status 'done'
  Created wheel for apache-beam: filename=apache_beam-2.51.0.dev0-cp38-cp38-linux_x86_64.whl size=15323531 sha256=279f1be978eb4fd616ddf4fc760927a5eacf59a87ca92681e41a3ed16fb5b02f
  Stored in directory: /tmp/pip-ephem-wheel-cache-gp12wfkr/wheels/d4/3a/c0/4dc152b1840724d5b992a8268bb4ef33fdbe42ffe1429b845c
Successfully built apache-beam
    + /opt/python/cp38-cp38/bin/python -c 'import sys, json, glob; json.dump(glob.glob('"'"'/tmp/cibuildwheel/built_wheel/*.whl'"'"'), sys.stdout)'
    + rm -rf /tmp/cibuildwheel/repaired_wheel
    + mkdir -p /tmp/cibuildwheel/repaired_wheel

                                                                     ✓ 244.95s
Repairing wheel...

    + sh -c 'auditwheel repair -w /tmp/cibuildwheel/repaired_wheel /tmp/cibuildwheel/built_wheel/apache_beam-2.51.0.dev0-cp38-cp38-linux_x86_64.whl'
INFO:auditwheel.main_repair:Repairing apache_beam-2.51.0.dev0-cp38-cp38-linux_x86_64.whl
INFO:auditwheel.wheeltools:Previous filename tags: linux_x86_64
INFO:auditwheel.wheeltools:New filename tags: manylinux_2_17_x86_64, manylinux2014_x86_64
INFO:auditwheel.wheeltools:Previous WHEEL info tags: cp38-cp38-linux_x86_64
INFO:auditwheel.wheeltools:New WHEEL info tags: cp38-cp38-manylinux_2_17_x86_64, cp38-cp38-manylinux2014_x86_64
INFO:auditwheel.main_repair:
Fixed-up wheel written to /tmp/cibuildwheel/repaired_wheel/apache_beam-2.51.0.dev0-cp38-cp38-manylinux_2_17_x86_64.manylinux2014_x86_64.whl
    + /opt/python/cp38-cp38/bin/python -c 'import sys, json, glob; json.dump(glob.glob('"'"'/tmp/cibuildwheel/repaired_wheel/*.whl'"'"'), sys.stdout)'
    + mkdir -p /output
    + mv /tmp/cibuildwheel/repaired_wheel/apache_beam-2.51.0.dev0-cp38-cp38-manylinux_2_17_x86_64.manylinux2014_x86_64.whl /output

                                                                       ✓ 6.11s

✓ cp38-manylinux_x86_64 finished in 262.38s
Copying wheels back to host...


                                                                       ✓ 0.15s

1 wheels produced in 4 minutes:
  apache_beam-2.51.0.dev0-cp38-cp38-manylinux_2_17_x86_64.manylinux2014_x86_64.whl   14,981 kB

> Task :sdks:python:test-suites:dataflow:py38:initializeForDataflowJob

FAILURE: Build failed with an exception.

* What went wrong:
Execution failed for task ':release:go-licenses:java:dockerRun'.
> Process 'command 'docker'' finished with non-zero exit value 1

* Try:
> Run with --stacktrace option to get the stack trace.
> Run with --info or --debug option to get more log output.

* Get more help at https://help.gradle.org

Deprecated Gradle features were used in this build, making it incompatible with Gradle 8.0.

You can use '--warning-mode all' to show the individual deprecation warnings and determine if they come from your own scripts or plugins.

See https://docs.gradle.org/7.6.2/userguide/command_line_interface.html#sec:command_line_warnings

Execution optimizations have been disabled for 1 invalid unit(s) of work during this build to ensure correctness.
Please consult deprecation warnings for more details.

BUILD FAILED in 11m 9s
110 actionable tasks: 74 executed, 32 from cache, 4 up-to-date

Publishing build scan...
https://ge.apache.org/s/ptnwkmff5nl5c

Build step 'Invoke Gradle script' changed build result to FAILURE
Build step 'Invoke Gradle script' marked build as failure

---------------------------------------------------------------------
To unsubscribe, e-mail: builds-unsubscribe@beam.apache.org
For additional commands, e-mail: builds-help@beam.apache.org


Jenkins build is back to normal : beam_PostCommit_Python_Xlang_Gcp_Dataflow #592

Posted by Apache Jenkins Server <je...@builds.apache.org>.
See <https://ci-beam.apache.org/job/beam_PostCommit_Python_Xlang_Gcp_Dataflow/592/display/redirect>


---------------------------------------------------------------------
To unsubscribe, e-mail: builds-unsubscribe@beam.apache.org
For additional commands, e-mail: builds-help@beam.apache.org


Build failed in Jenkins: beam_PostCommit_Python_Xlang_Gcp_Dataflow #591

Posted by Apache Jenkins Server <je...@builds.apache.org>.
See <https://ci-beam.apache.org/job/beam_PostCommit_Python_Xlang_Gcp_Dataflow/591/display/redirect?page=changes>

Changes:

[noreply] Loosen environment validation checks for RCs (#28100)


------------------------------------------
[...truncated 652.98 KB...]
    
        Every call to this method is controlled by the following three
        parameters, each of which has a specific, distinct role, even though all three
        may look very similar: ``timeout``, ``retry`` and ``polling``. In most
        cases users do not need to specify any custom values for any of these
        parameters and may simply rely on default ones instead.
    
        If you choose to specify custom parameters, please make sure you've
        read the documentation below carefully.
    
        First, please check :class:`google.api_core.retry.Retry`
        class documentation for the proper definition of timeout and deadline
        terms and for the definition the three different types of timeouts.
        This class operates in terms of Retry Timeout and Polling Timeout. It
        does not let customizing RPC timeout and the user is expected to rely on
        default behavior for it.
    
        The roles of each argument of this method are as follows:
    
        ``timeout`` (int): (Optional) The Polling Timeout as defined in
        :class:`google.api_core.retry.Retry`. If the operation does not complete
        within this timeout an exception will be thrown. This parameter affects
        neither Retry Timeout nor RPC Timeout.
    
        ``retry`` (google.api_core.retry.Retry): (Optional) How to retry the
        polling RPC. The ``retry.timeout`` property of this parameter is the
        Retry Timeout as defined in :class:`google.api_core.retry.Retry`.
        This parameter defines ONLY how the polling RPC call is retried
        (i.e. what to do if the RPC we used for polling returned an error). It
        does NOT define how the polling is done (i.e. how frequently and for
        how long to call the polling RPC); use the ``polling`` parameter for that.
        If a polling RPC throws and error and retrying it fails, the whole
        future fails with the corresponding exception. If you want to tune which
        server response error codes are not fatal for operation polling, use this
        parameter to control that (``retry.predicate`` in particular).
    
        ``polling`` (google.api_core.retry.Retry): (Optional) How often and
        for how long to call the polling RPC periodically (i.e. what to do if
        a polling rpc returned successfully but its returned result indicates
        that the long running operation is not completed yet, so we need to
        check it again at some point in future). This parameter does NOT define
        how to retry each individual polling RPC in case of an error; use the
        ``retry`` parameter for that. The ``polling.timeout`` of this parameter
        is Polling Timeout as defined in as defined in
        :class:`google.api_core.retry.Retry`.
    
        For each of the arguments, there are also default values in place, which
        will be used if a user does not specify their own. The default values
        for the three parameters are not to be confused with the default values
        for the corresponding arguments in this method (those serve as "not set"
        markers for the resolution logic).
    
        If ``timeout`` is provided (i.e.``timeout is not _DEFAULT VALUE``; note
        the ``None`` value means "infinite timeout"), it will be used to control
        the actual Polling Timeout. Otherwise, the ``polling.timeout`` value
        will be used instead (see below for how the ``polling`` config itself
        gets resolved). In other words, this parameter  effectively overrides
        the ``polling.timeout`` value if specified. This is so to preserve
        backward compatibility.
    
        If ``retry`` is provided (i.e. ``retry is not None``) it will be used to
        control retry behavior for the polling RPC and the ``retry.timeout``
        will determine the Retry Timeout. If not provided, the
        polling RPC will be called with whichever default retry config was
        specified for the polling RPC at the moment of the construction of the
        polling RPC's client. For example, if the polling RPC is
        ``operations_client.get_operation()``, the ``retry`` parameter will be
        controlling its retry behavior (not polling  behavior) and, if not
        specified, that specific method (``operations_client.get_operation()``)
        will be retried according to the default retry config provided during
        creation of ``operations_client`` client instead. This argument exists
        mainly for backward compatibility; users are very unlikely to ever need
        to set this parameter explicitly.
    
        If ``polling`` is provided (i.e. ``polling is not None``), it will be used
        to control the overall polling behavior and ``polling.timeout`` will
        control Polling Timeout unless it is overridden by ``timeout`` parameter
        as described above. If not provided, the``polling`` parameter specified
        during construction of this future (the ``polling`` argument in the
        constructor) will be used instead. Note: since the ``timeout`` argument may
        override ``polling.timeout`` value, this parameter should be viewed as
        coupled with the ``timeout`` parameter as described above.
    
        Args:
            timeout (int): (Optional) How long (in seconds) to wait for the
                operation to complete. If None, wait indefinitely.
            retry (google.api_core.retry.Retry): (Optional) How to retry the
                polling RPC. This defines ONLY how the polling RPC call is
                retried (i.e. what to do if the RPC we used for polling returned
                an error). It does  NOT define how the polling is done (i.e. how
                frequently and for how long to call the polling RPC).
            polling (google.api_core.retry.Retry): (Optional) How often and
                for how long to call polling RPC periodically. This parameter
                does NOT define how to retry each individual polling RPC call
                (use the ``retry`` parameter for that).
    
        Returns:
            google.protobuf.Message: The Operation's result.
    
        Raises:
            google.api_core.GoogleAPICallError: If the operation errors or if
                the timeout is reached before the operation completes.
        """
    
        self._blocking_poll(timeout=timeout, retry=retry, polling=polling)
    
        if self._exception is not None:
            # pylint: disable=raising-bad-type
            # Pylint doesn't recognize that this is valid in this case.
>           raise self._exception
E           google.api_core.exceptions.Cancelled: 499 Operation successfully rolled back : Not enough servers to allocate the requested nodes. We have temporarily sold out of Cloud Bigtable in this zone. Our support team has been notified and will be bringing more resources on board. Please try a different zone or try again later. 1: Operation successfully rolled back : Not enough servers to allocate the requested nodes. We have temporarily sold out of Cloud Bigtable in this zone. Our support team has been notified and will be bringing more resources on board. Please try a different zone or try again later.

../../build/gradleenv/-1734967051/lib/python3.8/site-packages/google/api_core/future/polling.py:261: Cancelled
=============================== warnings summary ===============================
../../build/gradleenv/-1734967051/lib/python3.8/site-packages/hdfs/config.py:28
  <https://ci-beam.apache.org/job/beam_PostCommit_Python_Xlang_Gcp_Dataflow/ws/src/build/gradleenv/-1734967051/lib/python3.8/site-packages/hdfs/config.py>:28: DeprecationWarning: the imp module is deprecated in favour of importlib; see the module's documentation for alternative uses
    from imp import load_source

../../build/gradleenv/-1734967051/lib/python3.8/site-packages/google/rpc/__init__.py:18
  <https://ci-beam.apache.org/job/beam_PostCommit_Python_Xlang_Gcp_Dataflow/ws/src/build/gradleenv/-1734967051/lib/python3.8/site-packages/google/rpc/__init__.py>:18: DeprecationWarning: pkg_resources is deprecated as an API. See https://setuptools.pypa.io/en/latest/pkg_resources.html
    import pkg_resources

../../build/gradleenv/-1734967051/lib/python3.8/site-packages/pkg_resources/__init__.py:2871: 20 warnings
  <https://ci-beam.apache.org/job/beam_PostCommit_Python_Xlang_Gcp_Dataflow/ws/src/build/gradleenv/-1734967051/lib/python3.8/site-packages/pkg_resources/__init__.py>:2871: DeprecationWarning: Deprecated call to `pkg_resources.declare_namespace('google')`.
  Implementing implicit namespace packages (as specified in PEP 420) is preferred to `pkg_resources.declare_namespace`. See https://setuptools.pypa.io/en/latest/references/keywords.html#keyword-namespace-packages
    declare_namespace(pkg)

../../build/gradleenv/-1734967051/lib/python3.8/site-packages/pkg_resources/__init__.py:2871: 16 warnings
  <https://ci-beam.apache.org/job/beam_PostCommit_Python_Xlang_Gcp_Dataflow/ws/src/build/gradleenv/-1734967051/lib/python3.8/site-packages/pkg_resources/__init__.py>:2871: DeprecationWarning: Deprecated call to `pkg_resources.declare_namespace('google.cloud')`.
  Implementing implicit namespace packages (as specified in PEP 420) is preferred to `pkg_resources.declare_namespace`. See https://setuptools.pypa.io/en/latest/references/keywords.html#keyword-namespace-packages
    declare_namespace(pkg)

../../build/gradleenv/-1734967051/lib/python3.8/site-packages/pkg_resources/__init__.py:2350
../../build/gradleenv/-1734967051/lib/python3.8/site-packages/pkg_resources/__init__.py:2350
../../build/gradleenv/-1734967051/lib/python3.8/site-packages/pkg_resources/__init__.py:2350
../../build/gradleenv/-1734967051/lib/python3.8/site-packages/pkg_resources/__init__.py:2350
  <https://ci-beam.apache.org/job/beam_PostCommit_Python_Xlang_Gcp_Dataflow/ws/src/build/gradleenv/-1734967051/lib/python3.8/site-packages/pkg_resources/__init__.py>:2350: DeprecationWarning: Deprecated call to `pkg_resources.declare_namespace('google')`.
  Implementing implicit namespace packages (as specified in PEP 420) is preferred to `pkg_resources.declare_namespace`. See https://setuptools.pypa.io/en/latest/references/keywords.html#keyword-namespace-packages
    declare_namespace(parent)

../../build/gradleenv/-1734967051/lib/python3.8/site-packages/pkg_resources/__init__.py:2871
  <https://ci-beam.apache.org/job/beam_PostCommit_Python_Xlang_Gcp_Dataflow/ws/src/build/gradleenv/-1734967051/lib/python3.8/site-packages/pkg_resources/__init__.py>:2871: DeprecationWarning: Deprecated call to `pkg_resources.declare_namespace('google.logging')`.
  Implementing implicit namespace packages (as specified in PEP 420) is preferred to `pkg_resources.declare_namespace`. See https://setuptools.pypa.io/en/latest/references/keywords.html#keyword-namespace-packages
    declare_namespace(pkg)

../../build/gradleenv/-1734967051/lib/python3.8/site-packages/pkg_resources/__init__.py:2871
  <https://ci-beam.apache.org/job/beam_PostCommit_Python_Xlang_Gcp_Dataflow/ws/src/build/gradleenv/-1734967051/lib/python3.8/site-packages/pkg_resources/__init__.py>:2871: DeprecationWarning: Deprecated call to `pkg_resources.declare_namespace('google.iam')`.
  Implementing implicit namespace packages (as specified in PEP 420) is preferred to `pkg_resources.declare_namespace`. See https://setuptools.pypa.io/en/latest/references/keywords.html#keyword-namespace-packages
    declare_namespace(pkg)

../../build/gradleenv/-1734967051/lib/python3.8/site-packages/google/rpc/__init__.py:20
  <https://ci-beam.apache.org/job/beam_PostCommit_Python_Xlang_Gcp_Dataflow/ws/src/build/gradleenv/-1734967051/lib/python3.8/site-packages/google/rpc/__init__.py>:20: DeprecationWarning: Deprecated call to `pkg_resources.declare_namespace('google.rpc')`.
  Implementing implicit namespace packages (as specified in PEP 420) is preferred to `pkg_resources.declare_namespace`. See https://setuptools.pypa.io/en/latest/references/keywords.html#keyword-namespace-packages
    pkg_resources.declare_namespace(__name__)

apache_beam/examples/snippets/snippets_test.py::SnippetsTest::test_model_bigqueryio_xlang
  <https://ci-beam.apache.org/job/beam_PostCommit_Python_Xlang_Gcp_Dataflow/ws/src/sdks/python/apache_beam/examples/snippets/snippets_test.py>:767: BeamDeprecationWarning: options is deprecated since First stable release. References to <pipeline>.options will not be supported
    p.options.view_as(GoogleCloudOptions).temp_location = 'gs://mylocation'

apache_beam/examples/snippets/snippets_test.py::SnippetsTest::test_model_bigqueryio_xlang
apache_beam/examples/snippets/snippets_test.py::SnippetsTest::test_model_bigqueryio_xlang
apache_beam/io/external/xlang_bigqueryio_it_test.py::BigQueryXlangStorageWriteIT::test_all_types
apache_beam/io/external/xlang_bigqueryio_it_test.py::BigQueryXlangStorageWriteIT::test_nested_records_and_lists
apache_beam/io/external/xlang_bigqueryio_it_test.py::BigQueryXlangStorageWriteIT::test_streaming
apache_beam/io/external/xlang_bigqueryio_it_test.py::BigQueryXlangStorageWriteIT::test_streaming_with_at_least_once
apache_beam/io/external/xlang_bigqueryio_it_test.py::BigQueryXlangStorageWriteIT::test_streaming_with_auto_sharding
apache_beam/io/external/xlang_bigqueryio_it_test.py::BigQueryXlangStorageWriteIT::test_with_at_least_once_semantics
  <https://ci-beam.apache.org/job/beam_PostCommit_Python_Xlang_Gcp_Dataflow/ws/src/sdks/python/apache_beam/io/gcp/bigquery.py>:2101: BeamDeprecationWarning: options is deprecated since First stable release. References to <pipeline>.options will not be supported
    is_streaming_pipeline = p.options.view_as(StandardOptions).streaming

apache_beam/examples/snippets/snippets_test.py::SnippetsTest::test_model_bigqueryio_xlang
apache_beam/examples/snippets/snippets_test.py::SnippetsTest::test_model_bigqueryio_xlang
apache_beam/io/external/xlang_bigqueryio_it_test.py::BigQueryXlangStorageWriteIT::test_all_types
apache_beam/io/external/xlang_bigqueryio_it_test.py::BigQueryXlangStorageWriteIT::test_nested_records_and_lists
apache_beam/io/external/xlang_bigqueryio_it_test.py::BigQueryXlangStorageWriteIT::test_streaming
apache_beam/io/external/xlang_bigqueryio_it_test.py::BigQueryXlangStorageWriteIT::test_streaming_with_at_least_once
apache_beam/io/external/xlang_bigqueryio_it_test.py::BigQueryXlangStorageWriteIT::test_streaming_with_auto_sharding
apache_beam/io/external/xlang_bigqueryio_it_test.py::BigQueryXlangStorageWriteIT::test_with_at_least_once_semantics
  <https://ci-beam.apache.org/job/beam_PostCommit_Python_Xlang_Gcp_Dataflow/ws/src/sdks/python/apache_beam/io/gcp/bigquery.py>:2107: BeamDeprecationWarning: options is deprecated since First stable release. References to <pipeline>.options will not be supported
    experiments = p.options.view_as(DebugOptions).experiments or []

apache_beam/examples/snippets/snippets_test.py: 2 warnings
apache_beam/io/external/xlang_bigqueryio_it_test.py: 10 warnings
  <https://ci-beam.apache.org/job/beam_PostCommit_Python_Xlang_Gcp_Dataflow/ws/src/sdks/python/apache_beam/transforms/external.py>:679: BeamDeprecationWarning: options is deprecated since First stable release. References to <pipeline>.options will not be supported
    self._expansion_service, pipeline.options)

-- Docs: https://docs.pytest.org/en/stable/how-to/capture-warnings.html
- generated xml file: <https://ci-beam.apache.org/job/beam_PostCommit_Python_Xlang_Gcp_Dataflow/ws/src/sdks/python/pytest_gcpCrossLanguage.xml> -
=========================== short test summary info ============================
FAILED apache_beam/io/gcp/bigtableio_it_test.py::TestReadFromBigTableIT::test_read_xlang - google.api_core.exceptions.Cancelled: 499 Operation successfully rolled back : Not enough servers to allocate the requested nodes. We have temporarily sold out of Cloud Bigtable in this zone. Our support team has been notified and will be bringing more resources on board. Please try a different zone or try again later. 1: Operation successfully rolled back : Not enough servers to allocate the requested nodes. We have temporarily sold out of Cloud Bigtable in this zone. Our support team has been notified and will be bringing more resources on board. Please try a different zone or try again later.
ERROR apache_beam/io/gcp/bigtableio_it_test.py::TestWriteToBigtableXlangIT::test_delete_cells_mutation - google.api_core.exceptions.Cancelled: 499 Operation successfully rolled back : Not enough servers to allocate the requested nodes. We have temporarily sold out of Cloud Bigtable in this zone. Our support team has been notified and will be bringing more resources on board. Please try a different zone or try again later. 1: Operation successfully rolled back : Not enough servers to allocate the requested nodes. We have temporarily sold out of Cloud Bigtable in this zone. Our support team has been notified and will be bringing more resources on board. Please try a different zone or try again later.
ERROR apache_beam/io/gcp/bigtableio_it_test.py::TestWriteToBigtableXlangIT::test_delete_cells_with_timerange_mutation - google.api_core.exceptions.Cancelled: 499 Operation successfully rolled back : Not enough servers to allocate the requested nodes. We have temporarily sold out of Cloud Bigtable in this zone. Our support team has been notified and will be bringing more resources on board. Please try a different zone or try again later. 1: Operation successfully rolled back : Not enough servers to allocate the requested nodes. We have temporarily sold out of Cloud Bigtable in this zone. Our support team has been notified and will be bringing more resources on board. Please try a different zone or try again later.
ERROR apache_beam/io/gcp/bigtableio_it_test.py::TestWriteToBigtableXlangIT::test_delete_column_family_mutation - google.api_core.exceptions.Cancelled: 499 Operation successfully rolled back : Not enough servers to allocate the requested nodes. We have temporarily sold out of Cloud Bigtable in this zone. Our support team has been notified and will be bringing more resources on board. Please try a different zone or try again later. 1: Operation successfully rolled back : Not enough servers to allocate the requested nodes. We have temporarily sold out of Cloud Bigtable in this zone. Our support team has been notified and will be bringing more resources on board. Please try a different zone or try again later.
ERROR apache_beam/io/gcp/bigtableio_it_test.py::TestWriteToBigtableXlangIT::test_delete_row_mutation - google.api_core.exceptions.Cancelled: 499 Operation successfully rolled back : Not enough servers to allocate the requested nodes. We have temporarily sold out of Cloud Bigtable in this zone. Our support team has been notified and will be bringing more resources on board. Please try a different zone or try again later. 1: Operation successfully rolled back : Not enough servers to allocate the requested nodes. We have temporarily sold out of Cloud Bigtable in this zone. Our support team has been notified and will be bringing more resources on board. Please try a different zone or try again later.
ERROR apache_beam/io/gcp/bigtableio_it_test.py::TestWriteToBigtableXlangIT::test_set_mutation - google.api_core.exceptions.Cancelled: 499 Operation successfully rolled back : Not enough servers to allocate the requested nodes. We have temporarily sold out of Cloud Bigtable in this zone. Our support team has been notified and will be bringing more resources on board. Please try a different zone or try again later. 1: Operation successfully rolled back : Not enough servers to allocate the requested nodes. We have temporarily sold out of Cloud Bigtable in this zone. Our support team has been notified and will be bringing more resources on board. Please try a different zone or try again later.
= 1 failed, 8 passed, 16 skipped, 6954 deselected, 74 warnings, 5 errors in 3077.37s (0:51:17) =

> Task :sdks:python:test-suites:dataflow:py38:gcpCrossLanguagePythonUsingJava FAILED

> Task :sdks:python:test-suites:dataflow:py38:gcpCrossLanguageCleanup
Stopping expansion service pid: 2002938.
Skipping invalid pid: 2002939.

> Task :sdks:python:test-suites:xlang:fnApiJobServerCleanup
Killing process at 1848324

FAILURE: Build completed with 2 failures.

1: Task failed with an exception.
-----------
* What went wrong:
Execution failed for task ':sdks:python:test-suites:dataflow:py311:gcpCrossLanguagePythonUsingJava'.
> Process 'command 'sh'' finished with non-zero exit value 1

* Try:
> Run with --stacktrace option to get the stack trace.
> Run with --info or --debug option to get more log output.
==============================================================================

2: Task failed with an exception.
-----------
* What went wrong:
Execution failed for task ':sdks:python:test-suites:dataflow:py38:gcpCrossLanguagePythonUsingJava'.
> Process 'command 'sh'' finished with non-zero exit value 1

* Try:
> Run with --stacktrace option to get the stack trace.
> Run with --info or --debug option to get more log output.
==============================================================================

* Get more help at https://help.gradle.org

Deprecated Gradle features were used in this build, making it incompatible with Gradle 8.0.

You can use '--warning-mode all' to show the individual deprecation warnings and determine if they come from your own scripts or plugins.

See https://docs.gradle.org/7.6.2/userguide/command_line_interface.html#sec:command_line_warnings

Execution optimizations have been disabled for 1 invalid unit(s) of work during this build to ensure correctness.
Please consult deprecation warnings for more details.

BUILD FAILED in 1h 8m 18s
119 actionable tasks: 83 executed, 32 from cache, 4 up-to-date

Publishing build scan...
https://ge.apache.org/s/z4p755yclpyy6

Build step 'Invoke Gradle script' changed build result to FAILURE
Build step 'Invoke Gradle script' marked build as failure

---------------------------------------------------------------------
To unsubscribe, e-mail: builds-unsubscribe@beam.apache.org
For additional commands, e-mail: builds-help@beam.apache.org