You are viewing a plain text version of this content. The canonical link for it is here.
Posted to builds@solr.apache.org by Policeman Jenkins Server via builds <bu...@solr.apache.org> on 2026/04/19 22:48:27 UTC

[JENKINS] Solr-main-macOS (64bit/hotspot/jdk-21.0.7) - Build # 8889 - Still Unstable!

Build: https://jenkins.thetaphi.de/job/Solr-main-macOS/8889/
Java: 64bit/hotspot/jdk-21.0.7 -XX:-UseCompressedOops -XX:+UseG1GC

1 tests failed.
FAILED:  org.apache.solr.cloud.LeaderTragicEventTest.classMethod

Error Message:
java.lang.Exception: Suite timeout exceeded (>= 7200000 msec).

Stack Trace:
java.lang.Exception: Suite timeout exceeded (>= 7200000 msec).
	at __randomizedtesting.SeedInfo.seed([391F7C55F71CF7AC]:0)

[JENKINS] Solr-main-macOS (64bit/hotspot/jdk-21.0.7) - Build # 8890 - Still Unstable!

Posted by Policeman Jenkins Server via builds <bu...@solr.apache.org>.
Build: https://jenkins.thetaphi.de/job/Solr-main-macOS/8890/
Java: 64bit/hotspot/jdk-21.0.7 -XX:+UseCompressedOops -XX:+UseZGC

1 tests failed.
FAILED:  org.apache.solr.cloud.LeaderTragicEventTest.classMethod

Error Message:
java.lang.Exception: Suite timeout exceeded (>= 7200000 msec).

Stack Trace:
java.lang.Exception: Suite timeout exceeded (>= 7200000 msec).
	at __randomizedtesting.SeedInfo.seed([C2D3B8723677A709]:0)