You are viewing a plain text version of this content. The canonical link for it is here.
Posted to builds@hbase.apache.org by Apache Jenkins Server <je...@builds.apache.org> on 2015/05/26 01:31:18 UTC
Build failed in Jenkins: HBase-TRUNK #6515
See <https://builds.apache.org/job/HBase-TRUNK/6515/changes>
Changes:
[apurtell] HBASE-13746 list_replicated_tables command is not listing table in hbase shell
------------------------------------------
[...truncated 5256 lines...]
java.lang.Thread.State: RUNNABLE
at java.net.SocketInputStream.socketRead0(Native Method)
at java.net.SocketInputStream.read(SocketInputStream.java:129)
at org.apache.http.impl.io.AbstractSessionInputBuffer.fillBuffer(AbstractSessionInputBuffer.java:166)
at org.apache.http.impl.io.SocketInputBuffer.fillBuffer(SocketInputBuffer.java:90)
at org.apache.http.impl.io.AbstractSessionInputBuffer.readLine(AbstractSessionInputBuffer.java:281)
at org.apache.http.impl.io.HttpRequestParser.parseHead(HttpRequestParser.java:96)
at org.apache.http.impl.io.AbstractMessageParser.parse(AbstractMessageParser.java:254)
at org.apache.axis2.transport.http.server.AxisHttpConnectionImpl.receiveRequest(AxisHttpConnectionImpl.java:137)
at org.apache.axis2.transport.http.server.AxisHttpService.handleRequest(AxisHttpService.java:142)
at org.apache.axis2.transport.http.server.HttpServiceProcessor.run(HttpServiceProcessor.java:82)
at java.util.concurrent.ThreadPoolExecutor$Worker.runTask(ThreadPoolExecutor.java:895)
at java.util.concurrent.ThreadPoolExecutor$Worker.run(ThreadPoolExecutor.java:918)
at java.lang.Thread.run(Thread.java:662)
"Axis2 Task" daemon prio=10 tid=0xcbff5400 nid=0x720 waiting on condition [0xcdc7d000]
java.lang.Thread.State: WAITING (parking)
at sun.misc.Unsafe.park(Native Method)
- parking to wait for <0xf280a288> (a java.util.concurrent.locks.AbstractQueuedSynchronizer$ConditionObject)
at java.util.concurrent.locks.LockSupport.park(LockSupport.java:156)
at java.util.concurrent.locks.AbstractQueuedSynchronizer$ConditionObject.await(AbstractQueuedSynchronizer.java:1987)
at java.util.concurrent.LinkedBlockingQueue.take(LinkedBlockingQueue.java:399)
at java.util.concurrent.ThreadPoolExecutor.getTask(ThreadPoolExecutor.java:957)
at java.util.concurrent.ThreadPoolExecutor$Worker.run(ThreadPoolExecutor.java:917)
at java.lang.Thread.run(Thread.java:662)
"Timer-2" daemon prio=10 tid=0xcb5d0800 nid=0x71f in Object.wait() [0xcde7d000]
java.lang.Thread.State: TIMED_WAITING (on object monitor)
at java.lang.Object.wait(Native Method)
- waiting on <0xd3feb6e8> (a java.util.TaskQueue)
at java.util.TimerThread.mainLoop(Timer.java:509)
- locked <0xd3feb6e8> (a java.util.TaskQueue)
at java.util.TimerThread.run(Timer.java:462)
"HttpConnection-6060-1" prio=10 tid=0xcb008800 nid=0x71e runnable [0xce07d000]
java.lang.Thread.State: RUNNABLE
at java.net.SocketInputStream.socketRead0(Native Method)
at java.net.SocketInputStream.read(SocketInputStream.java:129)
at org.apache.http.impl.io.AbstractSessionInputBuffer.fillBuffer(AbstractSessionInputBuffer.java:166)
at org.apache.http.impl.io.SocketInputBuffer.fillBuffer(SocketInputBuffer.java:90)
at org.apache.http.impl.io.AbstractSessionInputBuffer.readLine(AbstractSessionInputBuffer.java:281)
at org.apache.http.impl.io.HttpRequestParser.parseHead(HttpRequestParser.java:96)
at org.apache.http.impl.io.AbstractMessageParser.parse(AbstractMessageParser.java:254)
at org.apache.axis2.transport.http.server.AxisHttpConnectionImpl.receiveRequest(AxisHttpConnectionImpl.java:137)
at org.apache.axis2.transport.http.server.AxisHttpService.handleRequest(AxisHttpService.java:142)
at org.apache.axis2.transport.http.server.HttpServiceProcessor.run(HttpServiceProcessor.java:82)
at java.util.concurrent.ThreadPoolExecutor$Worker.runTask(ThreadPoolExecutor.java:895)
at java.util.concurrent.ThreadPoolExecutor$Worker.run(ThreadPoolExecutor.java:918)
at java.lang.Thread.run(Thread.java:662)
"MultiThreadedHttpConnectionManager cleanup" daemon prio=10 tid=0xcb6fe800 nid=0x71d in Object.wait() [0xce27d000]
java.lang.Thread.State: WAITING (on object monitor)
at java.lang.Object.wait(Native Method)
- waiting on <0xd3fef6f0> (a java.lang.ref.ReferenceQueue$Lock)
at java.lang.ref.ReferenceQueue.remove(ReferenceQueue.java:118)
- locked <0xd3fef6f0> (a java.lang.ref.ReferenceQueue$Lock)
at java.lang.ref.ReferenceQueue.remove(ReferenceQueue.java:134)
at org.apache.commons.httpclient.MultiThreadedHttpConnectionManager$ReferenceQueueThread.run(MultiThreadedHttpConnectionManager.java:1122)
"Timer-1" daemon prio=10 tid=0xcb7fd800 nid=0x71c in Object.wait() [0xce47d000]
java.lang.Thread.State: TIMED_WAITING (on object monitor)
at java.lang.Object.wait(Native Method)
- waiting on <0xd3620108> (a java.util.TaskQueue)
at java.util.TimerThread.mainLoop(Timer.java:509)
- locked <0xd3620108> (a java.util.TaskQueue)
at java.util.TimerThread.run(Timer.java:462)
"Timer-0" daemon prio=10 tid=0xcbea4000 nid=0x71a in Object.wait() [0xce867000]
java.lang.Thread.State: TIMED_WAITING (on object monitor)
at java.lang.Object.wait(Native Method)
- waiting on <0xd36201c8> (a java.util.TaskQueue)
at java.util.TimerThread.mainLoop(Timer.java:509)
- locked <0xd36201c8> (a java.util.TaskQueue)
at java.util.TimerThread.run(Timer.java:462)
"Low Memory Detector" daemon prio=10 tid=0xcceb8800 nid=0x718 runnable [0x00000000]
java.lang.Thread.State: RUNNABLE
"C2 CompilerThread1" daemon prio=10 tid=0xcceb6c00 nid=0x717 waiting on condition [0x00000000]
java.lang.Thread.State: RUNNABLE
"C2 CompilerThread0" daemon prio=10 tid=0xcceb4c00 nid=0x716 waiting on condition [0x00000000]
java.lang.Thread.State: RUNNABLE
"Signal Dispatcher" daemon prio=10 tid=0xcceb3400 nid=0x715 runnable [0x00000000]
java.lang.Thread.State: RUNNABLE
"Finalizer" daemon prio=10 tid=0xccea5800 nid=0x714 in Object.wait() [0xcf17d000]
java.lang.Thread.State: WAITING (on object monitor)
at java.lang.Object.wait(Native Method)
- waiting on <0xd3620440> (a java.lang.ref.ReferenceQueue$Lock)
at java.lang.ref.ReferenceQueue.remove(ReferenceQueue.java:118)
- locked <0xd3620440> (a java.lang.ref.ReferenceQueue$Lock)
at java.lang.ref.ReferenceQueue.remove(ReferenceQueue.java:134)
at java.lang.ref.Finalizer$FinalizerThread.run(Finalizer.java:171)
"Reference Handler" daemon prio=10 tid=0xccea4000 nid=0x713 in Object.wait() [0xccd7d000]
java.lang.Thread.State: WAITING (on object monitor)
at java.lang.Object.wait(Native Method)
- waiting on <0xd36204d0> (a java.lang.ref.Reference$Lock)
at java.lang.Object.wait(Object.java:485)
at java.lang.ref.Reference$ReferenceHandler.run(Reference.java:116)
- locked <0xd36204d0> (a java.lang.ref.Reference$Lock)
"main" prio=10 tid=0xf6705c00 nid=0x6ff waiting on condition [0xf68be000]
java.lang.Thread.State: TIMED_WAITING (parking)
at sun.misc.Unsafe.park(Native Method)
- parking to wait for <0xd36a7010> (a java.util.concurrent.locks.AbstractQueuedSynchronizer$ConditionObject)
at java.util.concurrent.locks.LockSupport.parkNanos(LockSupport.java:196)
at java.util.concurrent.locks.AbstractQueuedSynchronizer$ConditionObject.awaitNanos(AbstractQueuedSynchronizer.java:2025)
at java.util.concurrent.ThreadPoolExecutor.awaitTermination(ThreadPoolExecutor.java:1261)
at org.apache.axis2.transport.http.server.SimpleHttpServer.destroy(SimpleHttpServer.java:87)
at org.apache.axis2.transport.http.SimpleHTTPServer.stop(SimpleHTTPServer.java:225)
at org.apache.axis2.jaxws.utility.SimpleServer.stop(SimpleServer.java:82)
at org.apache.axis2.jaxws.framework.StopServer.testStopServer(StopServer.java:33)
at org.apache.axis2.jaxws.framework.AbstractTestCase$2.tearDown(AbstractTestCase.java:70)
at junit.extensions.TestSetup$1.protect(TestSetup.java:24)
at junit.framework.TestResult.runProtected(TestResult.java:128)
at junit.extensions.TestSetup.run(TestSetup.java:27)
at org.junit.internal.runners.JUnit38ClassRunner.run(JUnit38ClassRunner.java:81)
at org.apache.maven.surefire.junit4.JUnit4Provider.execute(JUnit4Provider.java:264)
at org.apache.maven.surefire.junit4.JUnit4Provider.executeTestSet(JUnit4Provider.java:153)
at org.apache.maven.surefire.junit4.JUnit4Provider.invoke(JUnit4Provider.java:124)
at sun.reflect.NativeMethodAccessorImpl.invoke0(Native Method)
at sun.reflect.NativeMethodAccessorImpl.invoke(NativeMethodAccessorImpl.java:39)
at sun.reflect.DelegatingMethodAccessorImpl.invoke(DelegatingMethodAccessorImpl.java:25)
at java.lang.reflect.Method.invoke(Method.java:597)
at org.apache.maven.surefire.util.ReflectionUtils.invokeMethodWithArray2(ReflectionUtils.java:208)
at org.apache.maven.surefire.booter.ProviderFactory$ProviderProxy.invoke(ProviderFactory.java:158)
at org.apache.maven.surefire.booter.ProviderFactory.invokeProvider(ProviderFactory.java:86)
at org.apache.maven.surefire.booter.ForkedBooter.runSuitesInProcess(ForkedBooter.java:153)
at org.apache.maven.surefire.booter.ForkedBooter.main(ForkedBooter.java:95)
"VM Thread" prio=10 tid=0xccea0400 nid=0x712 runnable
"GC task thread#0 (ParallelGC)" prio=10 tid=0xf670d400 nid=0x700 runnable
"GC task thread#1 (ParallelGC)" prio=10 tid=0xf670e800 nid=0x701 runnable
"GC task thread#2 (ParallelGC)" prio=10 tid=0xf6710000 nid=0x702 runnable
"GC task thread#3 (ParallelGC)" prio=10 tid=0xf6711400 nid=0x703 runnable
"GC task thread#4 (ParallelGC)" prio=10 tid=0xf6712c00 nid=0x704 runnable
"GC task thread#5 (ParallelGC)" prio=10 tid=0xf6714000 nid=0x705 runnable
"GC task thread#6 (ParallelGC)" prio=10 tid=0xf6715800 nid=0x706 runnable
"GC task thread#7 (ParallelGC)" prio=10 tid=0xf6717000 nid=0x707 runnable
"GC task thread#8 (ParallelGC)" prio=10 tid=0xf6718400 nid=0x708 runnable
"GC task thread#9 (ParallelGC)" prio=10 tid=0xf6719c00 nid=0x709 runnable
"GC task thread#10 (ParallelGC)" prio=10 tid=0xf671b000 nid=0x70a runnable
"GC task thread#11 (ParallelGC)" prio=10 tid=0xf671c800 nid=0x70b runnable
"GC task thread#12 (ParallelGC)" prio=10 tid=0xf671dc00 nid=0x70c runnable
"GC task thread#13 (ParallelGC)" prio=10 tid=0xf671f400 nid=0x70d runnable
"GC task thread#14 (ParallelGC)" prio=10 tid=0xf6720800 nid=0x70e runnable
"GC task thread#15 (ParallelGC)" prio=10 tid=0xf6722000 nid=0x70f runnable
"GC task thread#16 (ParallelGC)" prio=10 tid=0xf6723400 nid=0x710 runnable
"GC task thread#17 (ParallelGC)" prio=10 tid=0xf6724c00 nid=0x711 runnable
"VM Periodic Task Thread" prio=10 tid=0xccec2400 nid=0x719 waiting on condition
JNI global references: 1218
+ echo '************ END zombies jstack extract'
************ END zombies jstack extract
+ JIRA_COMMENT='
{color:red}-1 core zombie tests{color}. There are 1 zombie test(s): at org.apache.axis2.jaxws.framework.StopServer.testStopServer(StopServer.java:33)'
+ BAD=1
+ jps
+ grep surefirebooter
+ cut -d ' ' -f 1
+ xargs kill -9
POST BUILD TASK : SUCCESS
END OF POST BUILD TASK : 0
Archiving artifacts
Sending artifact delta relative to HBase-TRUNK #6514
Archived 2172 artifacts
Archive block size is 32768
Received 78 blocks and 424379021 bytes
Compression is 0.6%
Took 3 min 29 sec
Recording test results
[FINDBUGS] Collecting findbugs analysis files...
[FINDBUGS] Finding all files that match the pattern **/findbugs.xml,**/findbugsXml.xml
[FINDBUGS] Parsing 24 files in <https://builds.apache.org/job/HBase-TRUNK/ws/>
[FINDBUGS] Successfully parsed file <https://builds.apache.org/job/HBase-TRUNK/6515/artifact/hbase-annotations/target/findbugs.xml> of module with 0 warnings.
[FINDBUGS] Successfully parsed file <https://builds.apache.org/job/HBase-TRUNK/6515/artifact/hbase-annotations/target/findbugsXml.xml> of module with 0 warnings.
[FINDBUGS] Successfully parsed file <https://builds.apache.org/job/HBase-TRUNK/6515/artifact/hbase-client/target/findbugs.xml> of module with 0 warnings.
[FINDBUGS] Successfully parsed file <https://builds.apache.org/job/HBase-TRUNK/6515/artifact/hbase-client/target/findbugsXml.xml> of module with 9 warnings.
[FINDBUGS] Successfully parsed file <https://builds.apache.org/job/HBase-TRUNK/6515/artifact/hbase-common/target/findbugs.xml> of module with 0 warnings.
[FINDBUGS] Successfully parsed file <https://builds.apache.org/job/HBase-TRUNK/6515/artifact/hbase-common/target/findbugsXml.xml> of module with 1 warnings.
[FINDBUGS] Successfully parsed file <https://builds.apache.org/job/HBase-TRUNK/6515/artifact/hbase-examples/target/findbugs.xml> of module with 0 warnings.
[FINDBUGS] Successfully parsed file <https://builds.apache.org/job/HBase-TRUNK/6515/artifact/hbase-examples/target/findbugsXml.xml> of module with 0 warnings.
[FINDBUGS] Successfully parsed file <https://builds.apache.org/job/HBase-TRUNK/6515/artifact/hbase-hadoop-compat/target/findbugs.xml> of module with 0 warnings.
[FINDBUGS] Successfully parsed file <https://builds.apache.org/job/HBase-TRUNK/6515/artifact/hbase-hadoop-compat/target/findbugsXml.xml> of module with 0 warnings.
[FINDBUGS] Successfully parsed file <https://builds.apache.org/job/HBase-TRUNK/6515/artifact/hbase-hadoop2-compat/target/findbugs.xml> of module with 0 warnings.
[FINDBUGS] Successfully parsed file <https://builds.apache.org/job/HBase-TRUNK/6515/artifact/hbase-hadoop2-compat/target/findbugsXml.xml> of module with 0 warnings.
[FINDBUGS] Successfully parsed file <https://builds.apache.org/job/HBase-TRUNK/6515/artifact/hbase-prefix-tree/target/findbugs.xml> of module with 0 warnings.
[FINDBUGS] Successfully parsed file <https://builds.apache.org/job/HBase-TRUNK/6515/artifact/hbase-prefix-tree/target/findbugsXml.xml> of module with 0 warnings.
[FINDBUGS] Successfully parsed file <https://builds.apache.org/job/HBase-TRUNK/6515/artifact/hbase-procedure/target/findbugs.xml> of module with 0 warnings.
[FINDBUGS] Successfully parsed file <https://builds.apache.org/job/HBase-TRUNK/6515/artifact/hbase-procedure/target/findbugsXml.xml> of module with 1 warnings.
[FINDBUGS] Successfully parsed file <https://builds.apache.org/job/HBase-TRUNK/6515/artifact/hbase-protocol/target/findbugs.xml> of module with 0 warnings.
[FINDBUGS] Successfully parsed file <https://builds.apache.org/job/HBase-TRUNK/6515/artifact/hbase-protocol/target/findbugsXml.xml> of module with 0 warnings.
[FINDBUGS] Successfully parsed file <https://builds.apache.org/job/HBase-TRUNK/6515/artifact/hbase-rest/target/findbugs.xml> of module with 0 warnings.
[FINDBUGS] Successfully parsed file <https://builds.apache.org/job/HBase-TRUNK/6515/artifact/hbase-rest/target/findbugsXml.xml> of module with 2 warnings.
[FINDBUGS] Successfully parsed file <https://builds.apache.org/job/HBase-TRUNK/6515/artifact/hbase-server/target/findbugs.xml> of module with 0 warnings.
[FINDBUGS] Successfully parsed file <https://builds.apache.org/job/HBase-TRUNK/6515/artifact/hbase-server/target/findbugsXml.xml> of module with 63 warnings.
[FINDBUGS] Successfully parsed file <https://builds.apache.org/job/HBase-TRUNK/6515/artifact/hbase-thrift/target/findbugs.xml> of module with 0 warnings.
[FINDBUGS] Successfully parsed file <https://builds.apache.org/job/HBase-TRUNK/6515/artifact/hbase-thrift/target/findbugsXml.xml> of module with 0 warnings.
[FINDBUGS] Computing warning deltas based on reference build #6514
[CHECKSTYLE] Collecting checkstyle analysis files...
[CHECKSTYLE] Finding all files that match the pattern **/checkstyle-result.xml
[CHECKSTYLE] Parsing 21 files in <https://builds.apache.org/job/HBase-TRUNK/ws/>
[CHECKSTYLE] Successfully parsed file <https://builds.apache.org/job/HBase-TRUNK/6515/artifact/hbase-annotations/target/checkstyle-result.xml> of module with 0 warnings.
[CHECKSTYLE] Successfully parsed file <https://builds.apache.org/job/HBase-TRUNK/6515/artifact/hbase-assembly/target/checkstyle-result.xml> of module with 0 warnings.
[CHECKSTYLE] Successfully parsed file <https://builds.apache.org/job/HBase-TRUNK/6515/artifact/hbase-checkstyle/target/checkstyle-result.xml> of module with 0 warnings.
[CHECKSTYLE] Successfully parsed file <https://builds.apache.org/job/HBase-TRUNK/6515/artifact/hbase-client/target/checkstyle-result.xml> of module with 216 warnings.
[CHECKSTYLE] Successfully parsed file <https://builds.apache.org/job/HBase-TRUNK/6515/artifact/hbase-common/target/checkstyle-result.xml> of module with 127 warnings.
[CHECKSTYLE] Successfully parsed file <https://builds.apache.org/job/HBase-TRUNK/6515/artifact/hbase-examples/target/checkstyle-result.xml> of module with 30 warnings.
[CHECKSTYLE] Successfully parsed file <https://builds.apache.org/job/HBase-TRUNK/6515/artifact/hbase-hadoop-compat/target/checkstyle-result.xml> of module with 2 warnings.
[CHECKSTYLE] Successfully parsed file <https://builds.apache.org/job/HBase-TRUNK/6515/artifact/hbase-hadoop2-compat/target/checkstyle-result.xml> of module with 47 warnings.
[CHECKSTYLE] Successfully parsed file <https://builds.apache.org/job/HBase-TRUNK/6515/artifact/hbase-it/target/checkstyle-result.xml> of module with 0 warnings.
[CHECKSTYLE] Successfully parsed file <https://builds.apache.org/job/HBase-TRUNK/6515/artifact/hbase-prefix-tree/target/checkstyle-result.xml> of module with 23 warnings.
[CHECKSTYLE] Successfully parsed file <https://builds.apache.org/job/HBase-TRUNK/6515/artifact/hbase-procedure/target/checkstyle-result.xml> of module with 0 warnings.
[CHECKSTYLE] Successfully parsed file <https://builds.apache.org/job/HBase-TRUNK/6515/artifact/hbase-protocol/target/checkstyle-result.xml> of module with 3 warnings.
[CHECKSTYLE] Successfully parsed file <https://builds.apache.org/job/HBase-TRUNK/6515/artifact/hbase-rest/target/checkstyle-result.xml> of module with 42 warnings.
[CHECKSTYLE] Successfully parsed file <https://builds.apache.org/job/HBase-TRUNK/6515/artifact/hbase-server/target/checkstyle-result.xml> of module with 1400 warnings.
[CHECKSTYLE] Successfully parsed file <https://builds.apache.org/job/HBase-TRUNK/6515/artifact/hbase-shaded/hbase-shaded-client/target/checkstyle-result.xml> of module with 0 warnings.
[CHECKSTYLE] Successfully parsed file <https://builds.apache.org/job/HBase-TRUNK/6515/artifact/hbase-shaded/hbase-shaded-server/target/checkstyle-result.xml> of module with 0 warnings.
[CHECKSTYLE] Successfully parsed file <https://builds.apache.org/job/HBase-TRUNK/6515/artifact/hbase-shaded/target/checkstyle-result.xml> of module with 0 warnings.
[CHECKSTYLE] Successfully parsed file <https://builds.apache.org/job/HBase-TRUNK/6515/artifact/hbase-shell/target/checkstyle-result.xml> of module with 0 warnings.
[CHECKSTYLE] Successfully parsed file <https://builds.apache.org/job/HBase-TRUNK/6515/artifact/hbase-testing-util/target/checkstyle-result.xml> of module with 0 warnings.
[CHECKSTYLE] Successfully parsed file <https://builds.apache.org/job/HBase-TRUNK/6515/artifact/hbase-thrift/target/checkstyle-result.xml> of module with 28 warnings.
[CHECKSTYLE] Successfully parsed file <https://builds.apache.org/job/HBase-TRUNK/6515/artifact/target/checkstyle-result.xml> of module with 0 warnings.
[CHECKSTYLE] Computing warning deltas based on reference build #6514
Updating HBASE-13746
Jenkins build is back to normal : HBase-TRUNK #6517
Posted by Apache Jenkins Server <je...@builds.apache.org>.
See <https://builds.apache.org/job/HBase-TRUNK/6517/changes>
Build failed in Jenkins: HBase-TRUNK #6516
Posted by Apache Jenkins Server <je...@builds.apache.org>.
See <https://builds.apache.org/job/HBase-TRUNK/6516/changes>
Changes:
[matteo.bertozzi] HBASE-13767 Allow ZKAclReset to set and not just clear ZK ACLs
------------------------------------------
[...truncated 4796 lines...]
Running org.apache.hadoop.hbase.procedure.TestZKProcedureControllers
Running org.apache.hadoop.hbase.ipc.TestHBaseClient
Tests run: 4, Failures: 0, Errors: 0, Skipped: 0, Time elapsed: 2.126 sec - in org.apache.hadoop.hbase.procedure.TestZKProcedureControllers
Tests run: 1, Failures: 0, Errors: 0, Skipped: 0, Time elapsed: 0.575 sec - in org.apache.hadoop.hbase.ipc.TestHBaseClient
Running org.apache.hadoop.hbase.ipc.TestDelayedRpc
Running org.apache.hadoop.hbase.ipc.TestProtoBufRpc
Running org.apache.hadoop.hbase.TestLocalHBaseCluster
Tests run: 1, Failures: 0, Errors: 0, Skipped: 0, Time elapsed: 3.258 sec - in org.apache.hadoop.hbase.ipc.TestProtoBufRpc
Tests run: 4, Failures: 0, Errors: 0, Skipped: 0, Time elapsed: 5.079 sec - in org.apache.hadoop.hbase.ipc.TestDelayedRpc
Running org.apache.hadoop.hbase.TestAcidGuarantees
Tests run: 1, Failures: 0, Errors: 0, Skipped: 0, Time elapsed: 13.185 sec - in org.apache.hadoop.hbase.TestLocalHBaseCluster
Running org.apache.hadoop.hbase.TestServerSideScanMetricsFromClientSide
Tests run: 2, Failures: 0, Errors: 0, Skipped: 0, Time elapsed: 4.133 sec - in org.apache.hadoop.hbase.TestServerSideScanMetricsFromClientSide
Running org.apache.hadoop.hbase.zookeeper.TestRecoverableZooKeeper
Tests run: 1, Failures: 0, Errors: 0, Skipped: 0, Time elapsed: 1.289 sec - in org.apache.hadoop.hbase.zookeeper.TestRecoverableZooKeeper
Running org.apache.hadoop.hbase.zookeeper.TestZooKeeperACL
Tests run: 6, Failures: 0, Errors: 0, Skipped: 0, Time elapsed: 0.371 sec - in org.apache.hadoop.hbase.zookeeper.TestZooKeeperACL
Running org.apache.hadoop.hbase.zookeeper.TestZooKeeperNodeTracker
Tests run: 3, Failures: 0, Errors: 0, Skipped: 0, Time elapsed: 1.464 sec - in org.apache.hadoop.hbase.zookeeper.TestZooKeeperNodeTracker
Running org.apache.hadoop.hbase.zookeeper.TestHQuorumPeer
Tests run: 3, Failures: 0, Errors: 0, Skipped: 0, Time elapsed: 1.243 sec - in org.apache.hadoop.hbase.zookeeper.TestHQuorumPeer
Running org.apache.hadoop.hbase.zookeeper.TestZKLeaderManager
Tests run: 1, Failures: 0, Errors: 0, Skipped: 0, Time elapsed: 0.116 sec - in org.apache.hadoop.hbase.zookeeper.TestZKLeaderManager
Running org.apache.hadoop.hbase.zookeeper.TestZKMulti
Tests run: 8, Failures: 0, Errors: 0, Skipped: 0, Time elapsed: 0.579 sec - in org.apache.hadoop.hbase.zookeeper.TestZKMulti
Running org.apache.hadoop.hbase.zookeeper.lock.TestZKInterProcessReadWriteLock
Running org.apache.hadoop.hbase.TestJMXListener
Tests run: 6, Failures: 0, Errors: 0, Skipped: 0, Time elapsed: 24.511 sec - in org.apache.hadoop.hbase.zookeeper.lock.TestZKInterProcessReadWriteLock
Running org.apache.hadoop.hbase.TestMetaTableAccessorNoCluster
Tests run: 2, Failures: 0, Errors: 0, Skipped: 0, Time elapsed: 16.511 sec - in org.apache.hadoop.hbase.TestJMXListener
Tests run: 2, Failures: 0, Errors: 0, Skipped: 0, Time elapsed: 4.684 sec - in org.apache.hadoop.hbase.TestMetaTableAccessorNoCluster
Running org.apache.hadoop.hbase.TestZooKeeper
Running org.apache.hadoop.hbase.replication.regionserver.TestReplicationWALReaderManager
Tests run: 3, Failures: 0, Errors: 0, Skipped: 0, Time elapsed: 96.971 sec - in org.apache.hadoop.hbase.TestAcidGuarantees
Tests run: 28, Failures: 0, Errors: 0, Skipped: 0, Time elapsed: 347.38 sec - in org.apache.hadoop.hbase.io.encoding.TestDataBlockEncoders
Running org.apache.hadoop.hbase.replication.regionserver.TestRegionReplicaReplicationEndpoint
Running org.apache.hadoop.hbase.replication.regionserver.TestRegionReplicaReplicationEndpointNoMaster
Tests run: 4, Failures: 0, Errors: 0, Skipped: 0, Time elapsed: 47.219 sec - in org.apache.hadoop.hbase.replication.regionserver.TestRegionReplicaReplicationEndpointNoMaster
Running org.apache.hadoop.hbase.replication.regionserver.TestReplicationSink
Tests run: 5, Failures: 0, Errors: 0, Skipped: 0, Time elapsed: 2.488 sec - in org.apache.hadoop.hbase.replication.regionserver.TestReplicationSink
Running org.apache.hadoop.hbase.replication.regionserver.TestReplicationSourceManager
Tests run: 4, Failures: 0, Errors: 0, Skipped: 0, Time elapsed: 4.476 sec - in org.apache.hadoop.hbase.replication.regionserver.TestReplicationSourceManager
Running org.apache.hadoop.hbase.replication.TestReplicationTrackerZKImpl
Tests run: 5, Failures: 0, Errors: 0, Skipped: 0, Time elapsed: 1.417 sec - in org.apache.hadoop.hbase.replication.TestReplicationTrackerZKImpl
Tests run: 9, Failures: 0, Errors: 0, Skipped: 0, Time elapsed: 98 sec - in org.apache.hadoop.hbase.replication.regionserver.TestRegionReplicaReplicationEndpoint
Running org.apache.hadoop.hbase.replication.TestReplicationKillMasterRSCompressed
Running org.apache.hadoop.hbase.replication.TestReplicationKillMasterRS
Tests run: 1, Failures: 0, Errors: 0, Skipped: 0, Time elapsed: 26.312 sec - in org.apache.hadoop.hbase.replication.TestReplicationKillMasterRSCompressed
Running org.apache.hadoop.hbase.replication.TestMultiSlaveReplication
Tests run: 1, Failures: 0, Errors: 0, Skipped: 0, Time elapsed: 27.53 sec - in org.apache.hadoop.hbase.replication.TestReplicationKillMasterRS
Tests run: 12, Failures: 0, Errors: 0, Skipped: 0, Time elapsed: 214.679 sec - in org.apache.hadoop.hbase.TestZooKeeper
Running org.apache.hadoop.hbase.replication.TestReplicationChangingPeerRegionservers
Tests run: 1, Failures: 0, Errors: 0, Skipped: 0, Time elapsed: 36.733 sec - in org.apache.hadoop.hbase.replication.TestMultiSlaveReplication
Tests run: 1, Failures: 0, Errors: 0, Skipped: 0, Time elapsed: 5.816 sec - in org.apache.hadoop.hbase.replication.TestReplicationChangingPeerRegionservers
Running org.apache.hadoop.hbase.replication.TestReplicationKillSlaveRS
Running org.apache.hadoop.hbase.replication.TestPerTableCFReplication
Running org.apache.hadoop.hbase.replication.TestReplicationDisableInactivePeer
Tests run: 1, Failures: 0, Errors: 0, Skipped: 0, Time elapsed: 22.502 sec - in org.apache.hadoop.hbase.replication.TestReplicationKillSlaveRS
Running org.apache.hadoop.hbase.replication.TestMasterReplication
Tests run: 1, Failures: 0, Errors: 0, Skipped: 0, Time elapsed: 20.792 sec - in org.apache.hadoop.hbase.replication.TestReplicationDisableInactivePeer
Tests run: 2, Failures: 0, Errors: 0, Skipped: 0, Time elapsed: 42.988 sec - in org.apache.hadoop.hbase.replication.TestPerTableCFReplication
Running org.apache.hadoop.hbase.replication.TestReplicationWithTags
Tests run: 1, Failures: 0, Errors: 0, Skipped: 0, Time elapsed: 2.907 sec - in org.apache.hadoop.hbase.replication.TestReplicationWithTags
Running org.apache.hadoop.hbase.replication.TestReplicationEndpoint
Tests run: 3, Failures: 0, Errors: 0, Skipped: 0, Time elapsed: 2.779 sec - in org.apache.hadoop.hbase.replication.TestReplicationEndpoint
Running org.apache.hadoop.hbase.replication.TestReplicationSmallTests
Running org.apache.hadoop.hbase.replication.TestReplicationSource
Tests run: 1, Failures: 0, Errors: 0, Skipped: 0, Time elapsed: 0.26 sec - in org.apache.hadoop.hbase.replication.TestReplicationSource
Tests run: 8, Failures: 0, Errors: 0, Skipped: 0, Time elapsed: 334.53 sec - in org.apache.hadoop.hbase.replication.regionserver.TestReplicationWALReaderManager
Tests run: 3, Failures: 0, Errors: 0, Skipped: 0, Time elapsed: 73.595 sec - in org.apache.hadoop.hbase.replication.TestMasterReplication
Running org.apache.hadoop.hbase.replication.TestReplicationStateZKImpl
Tests run: 6, Failures: 0, Errors: 0, Skipped: 0, Time elapsed: 0.975 sec - in org.apache.hadoop.hbase.replication.TestReplicationStateZKImpl
Running org.apache.hadoop.hbase.fs.TestBlockReorder
Running org.apache.hadoop.hbase.replication.TestReplicationSyncUpTool
Running org.apache.hadoop.hbase.trace.TestHTraceHooks
Tests run: 1, Failures: 0, Errors: 0, Skipped: 0, Time elapsed: 3.617 sec - in org.apache.hadoop.hbase.trace.TestHTraceHooks
Running org.apache.hadoop.hbase.TestMovedRegionsCleaner
Tests run: 3, Failures: 0, Errors: 0, Skipped: 0, Time elapsed: 26.896 sec - in org.apache.hadoop.hbase.fs.TestBlockReorder
Tests run: 1, Failures: 0, Errors: 0, Skipped: 0, Time elapsed: 13.247 sec - in org.apache.hadoop.hbase.TestMovedRegionsCleaner
Tests run: 10, Failures: 0, Errors: 0, Skipped: 0, Time elapsed: 56.048 sec - in org.apache.hadoop.hbase.replication.TestReplicationSmallTests
Running org.apache.hadoop.hbase.TestMetaTableLocator
Tests run: 7, Failures: 0, Errors: 0, Skipped: 0, Time elapsed: 4.249 sec - in org.apache.hadoop.hbase.TestMetaTableLocator
Running org.apache.hadoop.hbase.mapred.TestTableSnapshotInputFormat
Running org.apache.hadoop.hbase.namespace.TestNamespaceAuditor
Tests run: 1, Failures: 0, Errors: 0, Skipped: 0, Time elapsed: 56.424 sec - in org.apache.hadoop.hbase.replication.TestReplicationSyncUpTool
Running org.apache.hadoop.hbase.mapred.TestTableMapReduceUtil
Tests run: 216, Failures: 0, Errors: 0, Skipped: 0, Time elapsed: 608.89 sec - in org.apache.hadoop.hbase.io.hfile.TestCacheOnWrite
Running org.apache.hadoop.hbase.mapred.TestTableInputFormat
Running org.apache.hadoop.hbase.mapred.TestTableMapReduce
Tests run: 12, Failures: 0, Errors: 0, Skipped: 0, Time elapsed: 114.586 sec - in org.apache.hadoop.hbase.namespace.TestNamespaceAuditor
Tests run: 4, Failures: 0, Errors: 0, Skipped: 0, Time elapsed: 101.565 sec - in org.apache.hadoop.hbase.mapred.TestTableMapReduceUtil
Running org.apache.hadoop.hbase.TestMultiVersions
Tests run: 3, Failures: 0, Errors: 0, Skipped: 0, Time elapsed: 9.47 sec - in org.apache.hadoop.hbase.TestMultiVersions
Tests run: 8, Failures: 0, Errors: 0, Skipped: 0, Time elapsed: 97.669 sec - in org.apache.hadoop.hbase.mapred.TestTableInputFormat
Tests run: 2, Failures: 0, Errors: 0, Skipped: 0, Time elapsed: 94.454 sec - in org.apache.hadoop.hbase.mapred.TestTableMapReduce
Tests run: 6, Failures: 0, Errors: 0, Skipped: 0, Time elapsed: 316.533 sec - in org.apache.hadoop.hbase.mapred.TestTableSnapshotInputFormat
Results :
Failed tests:
TestFastFail.testFastFail:271 There should be atleast one thread that retried instead of failing
Tests run: 2465, Failures: 1, Errors: 0, Skipped: 19
[INFO] ------------------------------------------------------------------------
[INFO] Reactor Summary:
[INFO]
[INFO] HBase ............................................. SUCCESS [ 2.819 s]
[INFO] HBase - Checkstyle ................................ SUCCESS [ 0.701 s]
[INFO] HBase - Annotations ............................... SUCCESS [ 0.204 s]
[INFO] HBase - Protocol .................................. SUCCESS [ 2.631 s]
[INFO] HBase - Common .................................... SUCCESS [03:08 min]
[INFO] HBase - Procedure ................................. SUCCESS [01:28 min]
[INFO] HBase - Client .................................... SUCCESS [01:47 min]
[INFO] HBase - Hadoop Compatibility ...................... SUCCESS [ 11.307 s]
[INFO] HBase - Hadoop Two Compatibility .................. SUCCESS [ 14.533 s]
[INFO] HBase - Prefix Tree ............................... SUCCESS [ 17.872 s]
[INFO] HBase - Server .................................... FAILURE [ 01:43 h]
[INFO] HBase - Testing Util .............................. SKIPPED
[INFO] HBase - Thrift .................................... SKIPPED
[INFO] HBase - Shell ..................................... SKIPPED
[INFO] HBase - Integration Tests ......................... SKIPPED
[INFO] HBase - Examples .................................. SKIPPED
[INFO] HBase - Rest ...................................... SKIPPED
[INFO] HBase - Assembly .................................. SKIPPED
[INFO] HBase - Shaded .................................... SKIPPED
[INFO] HBase - Shaded - Client ........................... SKIPPED
[INFO] HBase - Shaded - Server ........................... SKIPPED
[INFO] ------------------------------------------------------------------------
[INFO] BUILD FAILURE
[INFO] ------------------------------------------------------------------------
[INFO] Total time: 01:51 h
[INFO] Finished at: 2015-05-27T20:06:08+00:00
[INFO] Final Memory: 61M/560M
[INFO] ------------------------------------------------------------------------
[ERROR] Failed to execute goal org.apache.maven.plugins:maven-surefire-plugin:2.18:test (secondPartTestsExecution) on project hbase-server: There are test failures.
[ERROR]
[ERROR] Please refer to <https://builds.apache.org/job/HBase-TRUNK/ws/hbase-server/target/surefire-reports> for the individual test results.
[ERROR] -> [Help 1]
[ERROR]
[ERROR] To see the full stack trace of the errors, re-run Maven with the -e switch.
[ERROR] Re-run Maven using the -X switch to enable full debug logging.
[ERROR]
[ERROR] For more information about the errors and possible solutions, please read the following articles:
[ERROR] [Help 1] http://cwiki.apache.org/confluence/display/MAVEN/MojoFailureException
[ERROR]
[ERROR] After correcting the problems, you can resume the build with the command
[ERROR] mvn <goals> -rf :hbase-server
Build step 'Invoke top-level Maven targets' marked build as failure
Performing Post build task...
Match found for :.* : True
Logical operation result is TRUE
Running script : ZOMBIE_TESTS_COUNT=`jps | grep surefirebooter | wc -l`
if [[ $ZOMBIE_TESTS_COUNT != 0 ]] ; then
#It seems sometimes the tests are not dying immediately. Let's give them 10s
echo "Suspicious java process found - waiting 10s to see if there are just slow to stop"
sleep 10
ZOMBIE_TESTS_COUNT=`jps | grep surefirebooter | wc -l`
if [[ $ZOMBIE_TESTS_COUNT != 0 ]] ; then
echo "There are $ZOMBIE_TESTS_COUNT zombie tests, they should have been killed by surefire but survived"
echo "************ BEGIN zombies jstack extract"
ZB_STACK=`jps | grep surefirebooter | cut -d ' ' -f 1 | xargs -n 1 jstack | grep ".test" | grep "\.java"`
jps | grep surefirebooter | cut -d ' ' -f 1 | xargs -n 1 jstack
echo "************ END zombies jstack extract"
JIRA_COMMENT="$JIRA_COMMENT
{color:red}-1 core zombie tests{color}. There are ${ZOMBIE_TESTS_COUNT} zombie test(s): ${ZB_STACK}"
BAD=1
jps | grep surefirebooter | cut -d ' ' -f 1 | xargs kill -9
else
echo "We're ok: there is no zombie test, but some tests took some time to stop"
fi
else
echo "We're ok: there is no zombie test"
fi
[HBase-TRUNK] $ /bin/bash -xe /tmp/hudson5537249837590248440.sh
++ jps
++ grep surefirebooter
++ wc -l
+ ZOMBIE_TESTS_COUNT=0
+ [[ 0 != 0 ]]
+ echo 'We'\''re ok: there is no zombie test'
We're ok: there is no zombie test
POST BUILD TASK : SUCCESS
END OF POST BUILD TASK : 0
Archiving artifacts
Sending artifact delta relative to HBase-TRUNK #6514
Archived 2172 artifacts
Archive block size is 32768
Received 123 blocks and 425539847 bytes
Compression is 0.9%
Took 3 min 7 sec
Recording test results
[FINDBUGS] Collecting findbugs analysis files...
[FINDBUGS] Finding all files that match the pattern **/findbugs.xml,**/findbugsXml.xml
[FINDBUGS] Parsing 24 files in <https://builds.apache.org/job/HBase-TRUNK/ws/>
[FINDBUGS] Successfully parsed file <https://builds.apache.org/job/HBase-TRUNK/6516/artifact/hbase-annotations/target/findbugs.xml> of module with 0 warnings.
[FINDBUGS] Successfully parsed file <https://builds.apache.org/job/HBase-TRUNK/6516/artifact/hbase-annotations/target/findbugsXml.xml> of module with 0 warnings.
[FINDBUGS] Successfully parsed file <https://builds.apache.org/job/HBase-TRUNK/6516/artifact/hbase-client/target/findbugs.xml> of module with 0 warnings.
[FINDBUGS] Successfully parsed file <https://builds.apache.org/job/HBase-TRUNK/6516/artifact/hbase-client/target/findbugsXml.xml> of module with 9 warnings.
[FINDBUGS] Successfully parsed file <https://builds.apache.org/job/HBase-TRUNK/6516/artifact/hbase-common/target/findbugs.xml> of module with 0 warnings.
[FINDBUGS] Successfully parsed file <https://builds.apache.org/job/HBase-TRUNK/6516/artifact/hbase-common/target/findbugsXml.xml> of module with 1 warnings.
[FINDBUGS] Successfully parsed file <https://builds.apache.org/job/HBase-TRUNK/6516/artifact/hbase-examples/target/findbugs.xml> of module with 0 warnings.
[FINDBUGS] Successfully parsed file <https://builds.apache.org/job/HBase-TRUNK/6516/artifact/hbase-examples/target/findbugsXml.xml> of module with 0 warnings.
[FINDBUGS] Successfully parsed file <https://builds.apache.org/job/HBase-TRUNK/6516/artifact/hbase-hadoop-compat/target/findbugs.xml> of module with 0 warnings.
[FINDBUGS] Successfully parsed file <https://builds.apache.org/job/HBase-TRUNK/6516/artifact/hbase-hadoop-compat/target/findbugsXml.xml> of module with 0 warnings.
[FINDBUGS] Successfully parsed file <https://builds.apache.org/job/HBase-TRUNK/6516/artifact/hbase-hadoop2-compat/target/findbugs.xml> of module with 0 warnings.
[FINDBUGS] Successfully parsed file <https://builds.apache.org/job/HBase-TRUNK/6516/artifact/hbase-hadoop2-compat/target/findbugsXml.xml> of module with 0 warnings.
[FINDBUGS] Successfully parsed file <https://builds.apache.org/job/HBase-TRUNK/6516/artifact/hbase-prefix-tree/target/findbugs.xml> of module with 0 warnings.
[FINDBUGS] Successfully parsed file <https://builds.apache.org/job/HBase-TRUNK/6516/artifact/hbase-prefix-tree/target/findbugsXml.xml> of module with 0 warnings.
[FINDBUGS] Successfully parsed file <https://builds.apache.org/job/HBase-TRUNK/6516/artifact/hbase-procedure/target/findbugs.xml> of module with 0 warnings.
[FINDBUGS] Successfully parsed file <https://builds.apache.org/job/HBase-TRUNK/6516/artifact/hbase-procedure/target/findbugsXml.xml> of module with 1 warnings.
[FINDBUGS] Successfully parsed file <https://builds.apache.org/job/HBase-TRUNK/6516/artifact/hbase-protocol/target/findbugs.xml> of module with 0 warnings.
[FINDBUGS] Successfully parsed file <https://builds.apache.org/job/HBase-TRUNK/6516/artifact/hbase-protocol/target/findbugsXml.xml> of module with 0 warnings.
[FINDBUGS] Successfully parsed file <https://builds.apache.org/job/HBase-TRUNK/6516/artifact/hbase-rest/target/findbugs.xml> of module with 0 warnings.
[FINDBUGS] Successfully parsed file <https://builds.apache.org/job/HBase-TRUNK/6516/artifact/hbase-rest/target/findbugsXml.xml> of module with 2 warnings.
[FINDBUGS] Successfully parsed file <https://builds.apache.org/job/HBase-TRUNK/6516/artifact/hbase-server/target/findbugs.xml> of module with 0 warnings.
[FINDBUGS] Successfully parsed file <https://builds.apache.org/job/HBase-TRUNK/6516/artifact/hbase-server/target/findbugsXml.xml> of module with 63 warnings.
[FINDBUGS] Successfully parsed file <https://builds.apache.org/job/HBase-TRUNK/6516/artifact/hbase-thrift/target/findbugs.xml> of module with 0 warnings.
[FINDBUGS] Successfully parsed file <https://builds.apache.org/job/HBase-TRUNK/6516/artifact/hbase-thrift/target/findbugsXml.xml> of module with 0 warnings.
[FINDBUGS] Computing warning deltas based on reference build #6514
[CHECKSTYLE] Collecting checkstyle analysis files...
[CHECKSTYLE] Finding all files that match the pattern **/checkstyle-result.xml
[CHECKSTYLE] Parsing 21 files in <https://builds.apache.org/job/HBase-TRUNK/ws/>
[CHECKSTYLE] Successfully parsed file <https://builds.apache.org/job/HBase-TRUNK/6516/artifact/hbase-annotations/target/checkstyle-result.xml> of module with 0 warnings.
[CHECKSTYLE] Successfully parsed file <https://builds.apache.org/job/HBase-TRUNK/6516/artifact/hbase-assembly/target/checkstyle-result.xml> of module with 0 warnings.
[CHECKSTYLE] Successfully parsed file <https://builds.apache.org/job/HBase-TRUNK/6516/artifact/hbase-checkstyle/target/checkstyle-result.xml> of module with 0 warnings.
[CHECKSTYLE] Successfully parsed file <https://builds.apache.org/job/HBase-TRUNK/6516/artifact/hbase-client/target/checkstyle-result.xml> of module with 216 warnings.
[CHECKSTYLE] Successfully parsed file <https://builds.apache.org/job/HBase-TRUNK/6516/artifact/hbase-common/target/checkstyle-result.xml> of module with 127 warnings.
[CHECKSTYLE] Successfully parsed file <https://builds.apache.org/job/HBase-TRUNK/6516/artifact/hbase-examples/target/checkstyle-result.xml> of module with 30 warnings.
[CHECKSTYLE] Successfully parsed file <https://builds.apache.org/job/HBase-TRUNK/6516/artifact/hbase-hadoop-compat/target/checkstyle-result.xml> of module with 2 warnings.
[CHECKSTYLE] Successfully parsed file <https://builds.apache.org/job/HBase-TRUNK/6516/artifact/hbase-hadoop2-compat/target/checkstyle-result.xml> of module with 47 warnings.
[CHECKSTYLE] Successfully parsed file <https://builds.apache.org/job/HBase-TRUNK/6516/artifact/hbase-it/target/checkstyle-result.xml> of module with 0 warnings.
[CHECKSTYLE] Successfully parsed file <https://builds.apache.org/job/HBase-TRUNK/6516/artifact/hbase-prefix-tree/target/checkstyle-result.xml> of module with 23 warnings.
[CHECKSTYLE] Successfully parsed file <https://builds.apache.org/job/HBase-TRUNK/6516/artifact/hbase-procedure/target/checkstyle-result.xml> of module with 0 warnings.
[CHECKSTYLE] Successfully parsed file <https://builds.apache.org/job/HBase-TRUNK/6516/artifact/hbase-protocol/target/checkstyle-result.xml> of module with 3 warnings.
[CHECKSTYLE] Successfully parsed file <https://builds.apache.org/job/HBase-TRUNK/6516/artifact/hbase-rest/target/checkstyle-result.xml> of module with 42 warnings.
[CHECKSTYLE] Successfully parsed file <https://builds.apache.org/job/HBase-TRUNK/6516/artifact/hbase-server/target/checkstyle-result.xml> of module with 1400 warnings.
[CHECKSTYLE] Successfully parsed file <https://builds.apache.org/job/HBase-TRUNK/6516/artifact/hbase-shaded/hbase-shaded-client/target/checkstyle-result.xml> of module with 0 warnings.
[CHECKSTYLE] Successfully parsed file <https://builds.apache.org/job/HBase-TRUNK/6516/artifact/hbase-shaded/hbase-shaded-server/target/checkstyle-result.xml> of module with 0 warnings.
[CHECKSTYLE] Successfully parsed file <https://builds.apache.org/job/HBase-TRUNK/6516/artifact/hbase-shaded/target/checkstyle-result.xml> of module with 0 warnings.
[CHECKSTYLE] Successfully parsed file <https://builds.apache.org/job/HBase-TRUNK/6516/artifact/hbase-shell/target/checkstyle-result.xml> of module with 0 warnings.
[CHECKSTYLE] Successfully parsed file <https://builds.apache.org/job/HBase-TRUNK/6516/artifact/hbase-testing-util/target/checkstyle-result.xml> of module with 0 warnings.
[CHECKSTYLE] Successfully parsed file <https://builds.apache.org/job/HBase-TRUNK/6516/artifact/hbase-thrift/target/checkstyle-result.xml> of module with 28 warnings.
[CHECKSTYLE] Successfully parsed file <https://builds.apache.org/job/HBase-TRUNK/6516/artifact/target/checkstyle-result.xml> of module with 0 warnings.
[CHECKSTYLE] Computing warning deltas based on reference build #6514
Updating HBASE-13767