You are viewing a plain text version of this content. The canonical link for it is here.
Posted to dev@geronimo.apache.org by ga...@apache.org on 2011/02/21 13:41:33 UTC
[BUILD] trunk: Failed for Revision: 1072877
Geronimo Revision: 1072877 built with tests included
See the full build-0300.log file at http://people.apache.org/builds/geronimo/server/binaries/trunk/20110221/build-0300.log
Download the binaries from http://people.apache.org/builds/geronimo/server/binaries/trunk/20110221
[INFO] BUILD SUCCESSFUL
[INFO] ------------------------------------------------------------------------
[INFO] Total time: 52 minutes 28 seconds
[INFO] Finished at: Mon Feb 21 04:00:24 EST 2011
[INFO] Final Memory: 536M/1005M
[INFO] ------------------------------------------------------------------------
TESTSUITE RESULTS (Failures only)
=================================
Assembly: tomcat
=================================
See full test results and logs at http://people.apache.org/builds/geronimo/server/binaries/trunk/20110221/logs-0300-tomcat/
Running TestSuite
Tests run: 1, Failures: 1, Errors: 0, Skipped: 0, Time elapsed: 60.529 sec <<< FAILURE!
Running TestSuite
Tests run: 1, Failures: 1, Errors: 0, Skipped: 0, Time elapsed: 60.476 sec <<< FAILURE!
Assembly: jetty
=================================
See full test results and logs at http://people.apache.org/builds/geronimo/server/binaries/trunk/20110221/logs-0300-jetty/
Running TestSuite
Tests run: 2, Failures: 1, Errors: 0, Skipped: 0, Time elapsed: 1.465 sec <<< FAILURE!
--
Running TestSuite
Tests run: 1, Failures: 1, Errors: 0, Skipped: 0, Time elapsed: 60.534 sec <<< FAILURE!
Running TestSuite
Tests run: 1, Failures: 1, Errors: 0, Skipped: 0, Time elapsed: 60.54 sec <<< FAILURE!
Samples: trunk
=================================
Log: http://people.apache.org/builds/geronimo/server/binaries/trunk/20110221/samples-0300.log
Build status: FAILED