You are viewing a plain text version of this content. The canonical link for it is here.
Posted to dev@tapestry.apache.org by Apache Hudson Server <hu...@hudson.zones.apache.org> on 2010/05/26 01:41:16 UTC

Build failed in Hudson: tapestry-5.2-freestyle #110

See <http://hudson.zones.apache.org/hudson/job/tapestry-5.2-freestyle/110/changes>

Changes:

[hlship] TAP5-1170: Remove automatic injection of service id into parameters of type String

------------------------------------------
[...truncated 52625 lines...]
hudson
</dd><dt>user.timezone</dt><dd>
Etc/Zulu
</dd></dl></div><script type="text/javascript">Tapestry.DEBUG_ENABLED = true;
Tapestry.onDOMLoaded(function() {
Tapestry.stackFrameToggle('toggleStack');
});
</script></body> on session 3540cc300b0c4252a8e6ea7c5fcadeff
[INFO] SeleniumDriverResourceHandler Command request: open[/encodeentities, true] on session 3540cc300b0c4252a8e6ea7c5fcadeff
Hibernate: 
    select
        user0_.id as id0_,
        user0_.email as email0_,
        user0_.encodedPassword as encodedP3_0_,
        user0_.firstName as firstName0_,
        user0_.lastName as lastName0_,
        user0_.version as version0_ 
    from
        User user0_ 
    order by
        user0_.id desc
127.0.0.1 - - [25/May/2010:23:41:04 +0000] "GET /encodeentities HTTP/1.1" 200 253 "-" "Mozilla/5.0 (X11; U; Linux x86_64; en-US; rv:1.9.0.17) Gecko/2010010605 Ubuntu/8.10 (intrepid) Firefox/3.0.17" -
[INFO] SeleniumDriverResourceHandler Got result: OK on session 3540cc300b0c4252a8e6ea7c5fcadeff
[INFO] SeleniumDriverResourceHandler Command request: getText[//span[@id='name'], ] on session 3540cc300b0c4252a8e6ea7c5fcadeff
[INFO] SeleniumDriverResourceHandler Got result: OK, on session 3540cc300b0c4252a8e6ea7c5fcadeff
[INFO] SeleniumDriverResourceHandler Command request: click[link=create an entity, ] on session 3540cc300b0c4252a8e6ea7c5fcadeff
[INFO] SeleniumDriverResourceHandler Got result: OK on session 3540cc300b0c4252a8e6ea7c5fcadeff
[INFO] SeleniumDriverResourceHandler Command request: waitForPageToLoad[15000, ] on session 3540cc300b0c4252a8e6ea7c5fcadeff
Hibernate: 
    insert 
    into
        User
        (id, email, encodedPassword, firstName, lastName, version) 
    values
        (null, ?, ?, ?, ?, ?)
Hibernate: 
    call identity()
Hibernate: 
    select
        user0_.id as id0_,
        user0_.email as email0_,
        user0_.encodedPassword as encodedP3_0_,
        user0_.firstName as firstName0_,
        user0_.lastName as lastName0_,
        user0_.version as version0_ 
    from
        User user0_ 
    order by
        user0_.id desc
127.0.0.1 - - [25/May/2010:23:41:04 +0000] "GET /encodeentities:create HTTP/1.1" 302 0 "http://localhost:9999/encodeentities" "Mozilla/5.0 (X11; U; Linux x86_64; en-US; rv:1.9.0.17) Gecko/2010010605 Ubuntu/8.10 (intrepid) Firefox/3.0.17" -
Hibernate: 
    select
        user0_.id as id0_0_,
        user0_.email as email0_0_,
        user0_.encodedPassword as encodedP3_0_0_,
        user0_.firstName as firstName0_0_,
        user0_.lastName as lastName0_0_,
        user0_.version as version0_0_ 
    from
        User user0_ 
    where
        user0_.id=?
Hibernate: 
    select
        user0_.id as id0_,
        user0_.email as email0_,
        user0_.encodedPassword as encodedP3_0_,
        user0_.firstName as firstName0_,
        user0_.lastName as lastName0_,
        user0_.version as version0_ 
    from
        User user0_ 
    order by
        user0_.id desc
127.0.0.1 - - [25/May/2010:23:41:04 +0000] "GET /encodeentities/1 HTTP/1.1" 200 262 "http://localhost:9999/encodeentities" "Mozilla/5.0 (X11; U; Linux x86_64; en-US; rv:1.9.0.17) Gecko/2010010605 Ubuntu/8.10 (intrepid) Firefox/3.0.17" -
[INFO] SeleniumDriverResourceHandler Got result: OK on session 3540cc300b0c4252a8e6ea7c5fcadeff
[INFO] SeleniumDriverResourceHandler Command request: getText[//span[@id='name'], ] on session 3540cc300b0c4252a8e6ea7c5fcadeff
[INFO] SeleniumDriverResourceHandler Got result: OK,name on session 3540cc300b0c4252a8e6ea7c5fcadeff
[INFO] SeleniumDriverResourceHandler Command request: open[/encodeentities/9999, true] on session 3540cc300b0c4252a8e6ea7c5fcadeff
Hibernate: 
    select
        user0_.id as id0_0_,
        user0_.email as email0_0_,
        user0_.encodedPassword as encodedP3_0_0_,
        user0_.firstName as firstName0_0_,
        user0_.lastName as lastName0_0_,
        user0_.version as version0_0_ 
    from
        User user0_ 
    where
        user0_.id=?
[ERROR] User Unable to convert client value '9999' into an entity instance.
Hibernate: 
    select
        user0_.id as id0_,
        user0_.email as email0_,
        user0_.encodedPassword as encodedP3_0_,
        user0_.firstName as firstName0_,
        user0_.lastName as lastName0_,
        user0_.version as version0_ 
    from
        User user0_ 
    order by
        user0_.id desc
127.0.0.1 - - [25/May/2010:23:41:04 +0000] "GET /encodeentities/9999 HTTP/1.1" 200 259 "-" "Mozilla/5.0 (X11; U; Linux x86_64; en-US; rv:1.9.0.17) Gecko/2010010605 Ubuntu/8.10 (intrepid) Firefox/3.0.17" -
[INFO] SeleniumDriverResourceHandler Got result: OK on session 3540cc300b0c4252a8e6ea7c5fcadeff
[INFO] SeleniumDriverResourceHandler Command request: getText[//span[@id='name'], ] on session 3540cc300b0c4252a8e6ea7c5fcadeff
[INFO] SeleniumDriverResourceHandler Got result: OK, on session 3540cc300b0c4252a8e6ea7c5fcadeff
[INFO] SeleniumDriverResourceHandler Command request: testComplete[, ] on session 3540cc300b0c4252a8e6ea7c5fcadeff
[INFO] FirefoxChromeLauncher Killing Firefox...
[INFO] SeleniumDriverResourceHandler Got result: OK on session 3540cc300b0c4252a8e6ea7c5fcadeff
[INFO] ThreadedServer Stopping Acceptor ServerSocket[addr=0.0.0.0/0.0.0.0,port=0,localport=4444]
[INFO] SocketListener Stopped SocketListener on 0.0.0.0:4444
[INFO] Container Stopped HttpContext[/selenium-server/driver,/selenium-server/driver]
[INFO] Container Stopped HttpContext[/selenium-server,/selenium-server]
[INFO] Container Stopped HttpContext[/,/]
[INFO] Container Stopped org.openqa.jetty.jetty.servlet.ServletHandler@a632be
[INFO] Container Stopped HttpContext[/wd,/wd]
[INFO] Container Stopped org.openqa.jetty.jetty.Server@f18d37
Stopping Jetty instance on port 9999
[INFO] ThreadedServer Stopping Acceptor ServerSocket[addr=0.0.0.0/0.0.0.0,port=0,localport=9999]
[INFO] SocketListener Stopped SocketListener on 0.0.0.0:9999
[INFO] SessionFactoryImpl closing
[INFO] DriverManagerConnectionProvider cleaning up connection pool: jdbc:hsqldb:mem:test
[INFO] Container Stopped org.mortbay.jetty.servlet.WebApplicationHandler@1c13d0b
[INFO] DriverManagerConnectionProvider cleaning up connection pool: jdbc:hsqldb:mem:test
[INFO] Container Stopped WebApplicationContext[/,Tapestry-Hibernate Integration Test Application]
[INFO] Container Stopped org.mortbay.jetty.Server@1f21c50
Jetty instance has stopped.
PASSED: hibernate_statistics
PASSED: valueencode_all_entity_types
FAILED: commit_after_on_component_methods
com.thoughtworks.selenium.SeleniumException: ERROR: Element name not found
	at com.thoughtworks.selenium.HttpCommandProcessor.throwAssertionFailureExceptionOrError(HttpCommandProcessor.java:97)
	at com.thoughtworks.selenium.HttpCommandProcessor.doCommand(HttpCommandProcessor.java:91)
	at com.thoughtworks.selenium.HttpCommandProcessor.getString(HttpCommandProcessor.java:262)
	at org.apache.tapestry5.test.ErrorReportingCommandProcessor.getString(ErrorReportingCommandProcessor.java:134)
	at com.thoughtworks.selenium.DefaultSelenium.getText(DefaultSelenium.java:453)
	at org.apache.tapestry5.test.AbstractIntegrationTestSuite.getText(AbstractIntegrationTestSuite.java:646)
	at org.apache.tapestry5.test.AbstractIntegrationTestSuite.assertText(AbstractIntegrationTestSuite.java:183)
	at org.apache.tapestry5.hibernate.integration.TapestryHibernateIntegrationTests.commit_after_on_component_methods(TapestryHibernateIntegrationTests.java:122)
	at org.apache.maven.surefire.testng.TestNGExecutor.run(TestNGExecutor.java:74)
	at org.apache.maven.surefire.testng.TestNGXmlTestSuite.execute(TestNGXmlTestSuite.java:92)
	at org.apache.maven.surefire.Surefire.run(Surefire.java:177)
	at org.apache.maven.surefire.booter.SurefireBooter.runSuitesInProcess(SurefireBooter.java:345)
	at org.apache.maven.surefire.booter.SurefireBooter.main(SurefireBooter.java:1009)
... Removed 24 stack frames
FAILED: grid
com.thoughtworks.selenium.SeleniumException: ERROR: Element link=First Name not found
	at com.thoughtworks.selenium.HttpCommandProcessor.throwAssertionFailureExceptionOrError(HttpCommandProcessor.java:97)
	at com.thoughtworks.selenium.HttpCommandProcessor.doCommand(HttpCommandProcessor.java:91)
	at org.apache.tapestry5.test.ErrorReportingCommandProcessor.doCommand(ErrorReportingCommandProcessor.java:69)
	at com.thoughtworks.selenium.DefaultSelenium.click(DefaultSelenium.java:177)
	at org.apache.tapestry5.test.AbstractIntegrationTestSuite.click(AbstractIntegrationTestSuite.java:329)
	at org.apache.tapestry5.test.AbstractIntegrationTestSuite.clickAndWait(AbstractIntegrationTestSuite.java:232)
	at org.apache.tapestry5.hibernate.integration.TapestryHibernateIntegrationTests.grid(TapestryHibernateIntegrationTests.java:142)
	at org.apache.maven.surefire.testng.TestNGExecutor.run(TestNGExecutor.java:74)
	at org.apache.maven.surefire.testng.TestNGXmlTestSuite.execute(TestNGXmlTestSuite.java:92)
	at org.apache.maven.surefire.Surefire.run(Surefire.java:177)
	at org.apache.maven.surefire.booter.SurefireBooter.runSuitesInProcess(SurefireBooter.java:345)
	at org.apache.maven.surefire.booter.SurefireBooter.main(SurefireBooter.java:1009)
... Removed 24 stack frames
FAILED: persist_entities
com.thoughtworks.selenium.SeleniumException: ERROR: Element //span[@id='name'] not found
	at com.thoughtworks.selenium.HttpCommandProcessor.throwAssertionFailureExceptionOrError(HttpCommandProcessor.java:97)
	at com.thoughtworks.selenium.HttpCommandProcessor.doCommand(HttpCommandProcessor.java:91)
	at com.thoughtworks.selenium.HttpCommandProcessor.getString(HttpCommandProcessor.java:262)
	at org.apache.tapestry5.test.ErrorReportingCommandProcessor.getString(ErrorReportingCommandProcessor.java:134)
	at com.thoughtworks.selenium.DefaultSelenium.getText(DefaultSelenium.java:453)
	at org.apache.tapestry5.test.AbstractIntegrationTestSuite.getText(AbstractIntegrationTestSuite.java:646)
	at org.apache.tapestry5.test.AbstractIntegrationTestSuite.assertText(AbstractIntegrationTestSuite.java:183)
	at org.apache.tapestry5.hibernate.integration.TapestryHibernateIntegrationTests.persist_entities(TapestryHibernateIntegrationTests.java:51)
	at org.apache.maven.surefire.testng.TestNGExecutor.run(TestNGExecutor.java:74)
	at org.apache.maven.surefire.testng.TestNGXmlTestSuite.execute(TestNGXmlTestSuite.java:92)
	at org.apache.maven.surefire.Surefire.run(Surefire.java:177)
	at org.apache.maven.surefire.booter.SurefireBooter.runSuitesInProcess(SurefireBooter.java:345)
	at org.apache.maven.surefire.booter.SurefireBooter.main(SurefireBooter.java:1009)
... Removed 24 stack frames
FAILED: sso_entities
com.thoughtworks.selenium.SeleniumException: ERROR: Element //span[@id='name'] not found
	at com.thoughtworks.selenium.HttpCommandProcessor.throwAssertionFailureExceptionOrError(HttpCommandProcessor.java:97)
	at com.thoughtworks.selenium.HttpCommandProcessor.doCommand(HttpCommandProcessor.java:91)
	at com.thoughtworks.selenium.HttpCommandProcessor.getString(HttpCommandProcessor.java:262)
	at org.apache.tapestry5.test.ErrorReportingCommandProcessor.getString(ErrorReportingCommandProcessor.java:134)
	at com.thoughtworks.selenium.DefaultSelenium.getText(DefaultSelenium.java:453)
	at org.apache.tapestry5.test.AbstractIntegrationTestSuite.getText(AbstractIntegrationTestSuite.java:646)
	at org.apache.tapestry5.test.AbstractIntegrationTestSuite.assertText(AbstractIntegrationTestSuite.java:183)
	at org.apache.tapestry5.hibernate.integration.TapestryHibernateIntegrationTests.sso_entities(TapestryHibernateIntegrationTests.java:79)
	at org.apache.maven.surefire.testng.TestNGExecutor.run(TestNGExecutor.java:74)
	at org.apache.maven.surefire.testng.TestNGXmlTestSuite.execute(TestNGXmlTestSuite.java:92)
	at org.apache.maven.surefire.Surefire.run(Surefire.java:177)
	at org.apache.maven.surefire.booter.SurefireBooter.runSuitesInProcess(SurefireBooter.java:345)
	at org.apache.maven.surefire.booter.SurefireBooter.main(SurefireBooter.java:1009)
... Removed 24 stack frames
FAILED: using_cached_with_form
com.thoughtworks.selenium.SeleniumException: ERROR: Element name not found
	at com.thoughtworks.selenium.HttpCommandProcessor.throwAssertionFailureExceptionOrError(HttpCommandProcessor.java:97)
	at com.thoughtworks.selenium.HttpCommandProcessor.doCommand(HttpCommandProcessor.java:91)
	at org.apache.tapestry5.test.ErrorReportingCommandProcessor.doCommand(ErrorReportingCommandProcessor.java:69)
	at com.thoughtworks.selenium.DefaultSelenium.type(DefaultSelenium.java:301)
	at org.apache.tapestry5.test.AbstractIntegrationTestSuite.type(AbstractIntegrationTestSuite.java:464)
	at org.apache.tapestry5.hibernate.integration.TapestryHibernateIntegrationTests.using_cached_with_form(TapestryHibernateIntegrationTests.java:109)
	at org.apache.maven.surefire.testng.TestNGExecutor.run(TestNGExecutor.java:74)
	at org.apache.maven.surefire.testng.TestNGXmlTestSuite.execute(TestNGXmlTestSuite.java:92)
	at org.apache.maven.surefire.Surefire.run(Surefire.java:177)
	at org.apache.maven.surefire.booter.SurefireBooter.runSuitesInProcess(SurefireBooter.java:345)
	at org.apache.maven.surefire.booter.SurefireBooter.main(SurefireBooter.java:1009)
... Removed 24 stack frames

===============================================
    Tapestry Hibernate Integration Tests
    Tests run: 7, Failures: 5, Skips: 0
===============================================


===============================================
Tapestry Hibernate
Total tests run: 11, Failures: 5, Skips: 0
===============================================

[org.testng.internal.PoolService] Shutting down poolservice org.testng.internal.PoolService@133b16a terminated:false
Tests run: 11, Failures: 5, Errors: 0, Skipped: 0, Time elapsed: 15.014 sec <<< FAILURE!

Results :

Failed tests: 
  commit_after_on_component_methods(org.apache.tapestry5.hibernate.integration.TapestryHibernateIntegrationTests)
  grid(org.apache.tapestry5.hibernate.integration.TapestryHibernateIntegrationTests)
  persist_entities(org.apache.tapestry5.hibernate.integration.TapestryHibernateIntegrationTests)
  sso_entities(org.apache.tapestry5.hibernate.integration.TapestryHibernateIntegrationTests)
  using_cached_with_form(org.apache.tapestry5.hibernate.integration.TapestryHibernateIntegrationTests)

Tests run: 11, Failures: 5, Errors: 0, Skipped: 0

[INFO] ------------------------------------------------------------------------
[ERROR] BUILD FAILURE
[INFO] ------------------------------------------------------------------------
[INFO] There are test failures.

Please refer to <http://hudson.zones.apache.org/hudson/job/tapestry-5.2-freestyle/ws/trunk/tapestry-hibernate/target/surefire-reports> for the individual test results.
[INFO] ------------------------------------------------------------------------
[INFO] For more information, run Maven with the -e switch
[INFO] ------------------------------------------------------------------------
[INFO] Total time: 10 minutes 2 seconds
[INFO] Finished at: Tue May 25 23:41:06 UTC 2010
[INFO] Final Memory: 122M/221M
[INFO] ------------------------------------------------------------------------
[TASKS] Skipping publisher since build result is FAILURE
[WARNINGS] Skipping publisher since build result is FAILURE


---------------------------------------------------------------------
To unsubscribe, e-mail: dev-unsubscribe@tapestry.apache.org
For additional commands, e-mail: dev-help@tapestry.apache.org


Hudson build is back to normal : tapestry-5.2-freestyle #112

Posted by Apache Hudson Server <hu...@hudson.zones.apache.org>.
See <http://hudson.zones.apache.org/hudson/job/tapestry-5.2-freestyle/112/changes>



---------------------------------------------------------------------
To unsubscribe, e-mail: dev-unsubscribe@tapestry.apache.org
For additional commands, e-mail: dev-help@tapestry.apache.org


Build failed in Hudson: tapestry-5.2-freestyle #111

Posted by Apache Hudson Server <hu...@hudson.zones.apache.org>.
See <http://hudson.zones.apache.org/hudson/job/tapestry-5.2-freestyle/111/changes>

Changes:

[hlship] TAP5-1170: Fix incorrect injection of service id

[hlship] Add new methods to Predicate and introduce AbstractPredicate

[hlship] Refactor Predicate into the func package

[hlship] Change F to use the new Mapper interface instead of Coercion (to make it easier to combine mappers together).

[hlship] Allow Workers to be combined into composite workers

[hlship] Rename Operation to Worker

[hlship] Move Func to a new public package and rename it F

------------------------------------------
[...truncated 4848 lines...]
PASSED: builtin_coercions(12384584574874385743, class java.math.BigInteger, 12384584574874385743)
PASSED: builtin_coercions(12345678, class java.lang.Long, 12345678)
PASSED: builtin_coercions(-12345678, class java.math.BigInteger, -12345678)
PASSED: builtin_coercions(java.lang.Object@aecd51, interface java.util.List, [java.lang.Object@aecd51])
PASSED: builtin_coercions(null, interface java.lang.Iterable, null)
PASSED: builtin_coercions(null, interface java.util.List, null)
PASSED: builtin_coercions(null, interface java.util.Collection, null)
PASSED: builtin_coercions(null, class java.lang.String, null)
PASSED: builtin_coercions([Ljava.lang.Object;@29b99c, interface java.util.List, [a, 123])
PASSED: builtin_coercions([Ljava.lang.String;@158bc22, interface java.util.List, [a, b])
PASSED: builtin_coercions([B@a76306, interface java.util.List, [12, 56])
PASSED: builtin_coercions([S@1563e06, interface java.util.List, [34, 98])
PASSED: builtin_coercions([I@10204ce, interface java.util.List, [1, 2])
PASSED: builtin_coercions([J@1898b92, interface java.util.List, [123, 321])
PASSED: builtin_coercions([F@12a2a50, interface java.util.List, [3.4, 7.777])
PASSED: builtin_coercions([D@1400eb0, interface java.util.List, [3.4, 7.777])
PASSED: builtin_coercions([C@8455dd, interface java.util.List, [a, b])
PASSED: builtin_coercions([Z@215bee, interface java.util.List, [true, false])
PASSED: builtin_coercions(foo/bar/baz.txt, class java.io.File, foo/bar/baz.txt)
PASSED: builtin_coercions(TimeInterval[7200000 ms], class java.lang.Long, 7200000)
PASSED: builtin_coercions(2 h, class org.apache.tapestry5.ioc.util.TimeInterval, TimeInterval[7200000 ms])
PASSED: builtin_coercions(null, interface org.xml.sax.XMLReader, null)
PASSED: coercion_failure
PASSED: collection_to_object_array
PASSED: combined_coercion
PASSED: explain(class java.lang.StringBuffer, class java.lang.Integer, "Object --> String, String --> Long, Long --> Integer")
PASSED: explain(void, interface java.util.Map, "null --> null")
PASSED: explain(void, class java.lang.Boolean, "null --> Boolean")
PASSED: explain(class [Ljava.lang.Object;, class java.lang.Boolean, "Object[] --> java.util.List, java.util.Collection --> Boolean")
PASSED: explain(class [Ljava.lang.String;, interface java.util.List, "Object[] --> java.util.List")
PASSED: explain(class java.lang.Float, class java.lang.Double, "Float --> Double")
PASSED: explain(class java.lang.Double, class java.math.BigDecimal, "Object --> String, String --> java.math.BigDecimal")
PASSED: explain_primitive_to_wrapper_type
PASSED: explain_to_same_type
PASSED: explain_wrapper_to_primitive_type
PASSED: no_coercion_found
PASSED: no_coercion_necessary
PASSED: object_to_object_array
PASSED: object_whose_toString_returns_null_to_boolean
PASSED: primitive_type_as_target
PASSED: add_listener_and_invoke
PASSED: weak_references_are_not_invoked_once_clears
PASSED: intermediate_type
PASSED: no_value_annotation
PASSED: value_annotation_present
PASSED: for_file_in_parent_folder
PASSED: for_file_in_same_folder
PASSED: for_file_in_subfolder
PASSED: for_file_same_resource
PASSED: for_file_single_dot
PASSED: get_URL_for_missing_resource
PASSED: get_resource_URL
PASSED: leading_slash_on_path_relative_to_root_doesnt_matter
PASSED: localization_of_missing_resource
PASSED: localization_of_resource
PASSED: localization_to_base_resource
PASSED: localization_to_closest_match
PASSED: multiple_slashes_treated_as_single_slash
PASSED: path_and_file
PASSED: relative_to_root_resource
PASSED: relative_to_root_resource_using_leading_slash
PASSED: to_string
PASSED: with_extension
PASSED: with_extension_adds_extension
PASSED: with_extension_missing_resource_is_null
PASSED: with_extension_same_extension
PASSED: copy_map
PASSED: copy_set
PASSED: new_list
PASSED: new_list_copy
PASSED: new_list_from_elements
PASSED: new_map
PASSED: new_set
PASSED: new_threadsafe_list
PASSED: set_from_varargs
PASSED: bad_cast
PASSED: cast_is_also_not_null
PASSED: non_blank_parameter_is_null
PASSED: non_blank_parameter_is_only_whitespace
PASSED: non_blank_parameter_is_valid
PASSED: parameter_is_null
PASSED: parameter_not_null
PASSED: succesful_cast
PASSED: dummy_lock_functions_are_noops
PASSED: generic_bean_with_multiple_parameters
PASSED: generic_return_type_of_non_generic_type
PASSED: generic_return_type_of_parameterized_bean
PASSED: clear
PASSED: clone_test
PASSED: degenerate
PASSED: degenerate_with_namespace
PASSED: simple
PASSED: simple_with_namespace
PASSED: inheritance_of_a_2d_object_array
PASSED: inheritance_of_a_2d_primitive_array
PASSED: inheritance_of_an_interface
PASSED: inheritance_of_an_object_array
PASSED: inheritance_of_object
PASSED: inheritance_of_primitive
PASSED: inheritance_of_primitive_array
PASSED: inheritance_of_string
PASSED: inheritance_of_void
PASSED: inheritance_search_order_for_classes
PASSED: inheritance_search_order_for_interfaces
PASSED: next_when_no_more
PASSED: remove_always_fails
PASSED: add_to_list_map
PASSED: array_size_when_non_null
PASSED: array_size_when_null
PASSED: capitalize("hello", "Hello")
PASSED: capitalize("Goodbye", "Goodbye")
PASSED: capitalize("", "")
PASSED: capitalize("a", "A")
PASSED: capitalize("A", "A")
PASSED: close_ignores_exceptions
PASSED: close_null_is_noop
PASSED: close_success
PASSED: collection_size
PASSED: constructor_with_inject_annotation
PASSED: enumeration_to_list
PASSED: exception_injecting_into_field
PASSED: get_from_map
PASSED: get_from_null_map
PASSED: inject_annotation_on_field
PASSED: inject_service_annotation_on_field
PASSED: join_empty_list
PASSED: join_multiple
PASSED: join_single
PASSED: join_sorted
PASSED: join_sorted_empty
PASSED: join_sorted_null
PASSED: join_sorted_with_blank
PASSED: join_with_blank
PASSED: keys_on_actual_map
PASSED: keys_on_null_is_empty
PASSED: last_term
PASSED: location_of_locatable
PASSED: location_of_location
PASSED: location_of_not_found
PASSED: match_and_sort
PASSED: method_as_string_array_arg
PASSED: method_as_string_no_args
PASSED: method_as_string_primitive_arg
PASSED: method_as_string_primitive_array_arg
PASSED: method_as_string_with_args
PASSED: reverse_iterator
PASSED: reverse_iterator_does_not_support_remove
PASSED: servicedef_to_servicedef2
PASSED: sorted_keys_from_map
PASSED: sorted_keys_from_null_map
PASSED: strip_illegal_member_name
PASSED: strip_member_name("simple", "simple")
PASSED: strip_member_name("_name", "name")
PASSED: strip_member_name("$name", "name")
PASSED: strip_member_name("ruby_style", "ruby_style")
PASSED: strip_member_name("__$ruby_style_", "ruby_style")
PASSED: strip_member_name("$_$__$__$_$___$_$_$_$$name$", "name")
PASSED: strip_member_name("foo_", "foo")
PASSED: strip_member_name("_foo_", "foo")
PASSED: validate_constructor_check_for_public
PASSED: validate_constructor_class_not_public
PASSED: validate_marker_annotation
PASSED: locale_with_just_language
PASSED: locale_with_just_language_no_period
PASSED: locale_with_language_and_country
PASSED: locale_with_variant_but_no_country
PASSED: locale_with_variant_but_no_country_no_period
PASSED: all_three_parameters
PASSED: equality
PASSED: unknown_column
PASSED: unknown_line_and_column
PASSED: standard_args
PASSED: throwable_argument
PASSED: throwable_argument_with_null_message
PASSED: contains_key
PASSED: contains_key_is_case_insensitive
PASSED: format_message
PASSED: format_message_is_case_insensitive
PASSED: format_unknown_key
PASSED: formatters_are_cached
PASSED: get_formatter
PASSED: get_message_from_catalog
PASSED: get_message_from_catalog_is_case_insensitive
PASSED: get_unknown_message_from_catalog
PASSED: basic_locking
PASSED: locking_method_includes_check
PASSED: case_insensitivity
PASSED: dependency_cycle
PASSED: duplicate_id
PASSED: failed_override
PASSED: leader
PASSED: missing_constraint_type
PASSED: no_dependencies
PASSED: nulls_not_included_in_result
PASSED: override
PASSED: pre_and_post_reqs
PASSED: prereqs
PASSED: toString_DependencyNode
PASSED: toString_Orderable
PASSED: trailer
PASSED: unknown_constraint_type
FAILED: try_write_lock_inside_read_lock
java.lang.AssertionError: expected:<100> but was:<69>
	at org.apache.tapestry5.ioc.internal.util.ConcurrentBarrierTest.runOperationAndCheckCounter(ConcurrentBarrierTest.java:191)
	at org.apache.tapestry5.ioc.internal.util.ConcurrentBarrierTest.try_write_lock_inside_read_lock(ConcurrentBarrierTest.java:152)
	at org.apache.maven.surefire.testng.TestNGExecutor.run(TestNGExecutor.java:74)
	at org.apache.maven.surefire.testng.TestNGXmlTestSuite.execute(TestNGXmlTestSuite.java:92)
	at org.apache.maven.surefire.Surefire.run(Surefire.java:177)
	at org.apache.maven.surefire.booter.SurefireBooter.runSuitesInProcess(SurefireBooter.java:345)
	at org.apache.maven.surefire.booter.SurefireBooter.main(SurefireBooter.java:1009)
... Removed 29 stack frames

===============================================
    Internals
    Tests run: 486, Failures: 1, Skips: 0
===============================================

[ERROR] SerializationSupport Unexpected service proxy provider when clearing the provider. This may indicate that you have multiple IoC Registries.

===============================================
Tapestry IOC
Total tests run: 684, Failures: 1, Skips: 0
===============================================

[org.testng.internal.PoolService] Shutting down poolservice org.testng.internal.PoolService@1c5dd1 terminated:false
Tests run: 684, Failures: 1, Errors: 0, Skipped: 0, Time elapsed: 13.425 sec <<< FAILURE!

Results :

Failed tests: 
  try_write_lock_inside_read_lock(org.apache.tapestry5.ioc.internal.util.ConcurrentBarrierTest)

Tests run: 684, Failures: 1, Errors: 0, Skipped: 0

[INFO] ------------------------------------------------------------------------
[ERROR] BUILD FAILURE
[INFO] ------------------------------------------------------------------------
[INFO] There are test failures.

Please refer to <http://hudson.zones.apache.org/hudson/job/tapestry-5.2-freestyle/ws/trunk/tapestry-ioc/target/surefire-reports> for the individual test results.
[INFO] ------------------------------------------------------------------------
[INFO] For more information, run Maven with the -e switch
[INFO] ------------------------------------------------------------------------
[INFO] Total time: 1 minute 11 seconds
[INFO] Finished at: Wed May 26 01:32:13 UTC 2010
[INFO] Final Memory: 47M/204M
[INFO] ------------------------------------------------------------------------
[TASKS] Skipping publisher since build result is FAILURE
[WARNINGS] Skipping publisher since build result is FAILURE


---------------------------------------------------------------------
To unsubscribe, e-mail: dev-unsubscribe@tapestry.apache.org
For additional commands, e-mail: dev-help@tapestry.apache.org


Re: Build failed in Hudson: tapestry-5.2-freestyle #110

Posted by Howard Lewis Ship <hl...@gmail.com>.
My bad, just checked in a fix.

On Tue, May 25, 2010 at 4:41 PM, Apache Hudson Server
<hu...@hudson.zones.apache.org> wrote:
> See <http://hudson.zones.apache.org/hudson/job/tapestry-5.2-freestyle/110/changes>
>
> Changes:
>
> [hlship] TAP5-1170: Remove automatic injection of service id into parameters of type String
>
> ------------------------------------------
> [...truncated 52625 lines...]
> hudson
> </dd><dt>user.timezone</dt><dd>
> Etc/Zulu
> </dd></dl></div><script type="text/javascript">Tapestry.DEBUG_ENABLED = true;
> Tapestry.onDOMLoaded(function() {
> Tapestry.stackFrameToggle('toggleStack');
> });
> </script></body> on session 3540cc300b0c4252a8e6ea7c5fcadeff
> [INFO] SeleniumDriverResourceHandler Command request: open[/encodeentities, true] on session 3540cc300b0c4252a8e6ea7c5fcadeff
> Hibernate:
>    select
>        user0_.id as id0_,
>        user0_.email as email0_,
>        user0_.encodedPassword as encodedP3_0_,
>        user0_.firstName as firstName0_,
>        user0_.lastName as lastName0_,
>        user0_.version as version0_
>    from
>        User user0_
>    order by
>        user0_.id desc
> 127.0.0.1 - - [25/May/2010:23:41:04 +0000] "GET /encodeentities HTTP/1.1" 200 253 "-" "Mozilla/5.0 (X11; U; Linux x86_64; en-US; rv:1.9.0.17) Gecko/2010010605 Ubuntu/8.10 (intrepid) Firefox/3.0.17" -
> [INFO] SeleniumDriverResourceHandler Got result: OK on session 3540cc300b0c4252a8e6ea7c5fcadeff
> [INFO] SeleniumDriverResourceHandler Command request: getText[//span[@id='name'], ] on session 3540cc300b0c4252a8e6ea7c5fcadeff
> [INFO] SeleniumDriverResourceHandler Got result: OK, on session 3540cc300b0c4252a8e6ea7c5fcadeff
> [INFO] SeleniumDriverResourceHandler Command request: click[link=create an entity, ] on session 3540cc300b0c4252a8e6ea7c5fcadeff
> [INFO] SeleniumDriverResourceHandler Got result: OK on session 3540cc300b0c4252a8e6ea7c5fcadeff
> [INFO] SeleniumDriverResourceHandler Command request: waitForPageToLoad[15000, ] on session 3540cc300b0c4252a8e6ea7c5fcadeff
> Hibernate:
>    insert
>    into
>        User
>        (id, email, encodedPassword, firstName, lastName, version)
>    values
>        (null, ?, ?, ?, ?, ?)
> Hibernate:
>    call identity()
> Hibernate:
>    select
>        user0_.id as id0_,
>        user0_.email as email0_,
>        user0_.encodedPassword as encodedP3_0_,
>        user0_.firstName as firstName0_,
>        user0_.lastName as lastName0_,
>        user0_.version as version0_
>    from
>        User user0_
>    order by
>        user0_.id desc
> 127.0.0.1 - - [25/May/2010:23:41:04 +0000] "GET /encodeentities:create HTTP/1.1" 302 0 "http://localhost:9999/encodeentities" "Mozilla/5.0 (X11; U; Linux x86_64; en-US; rv:1.9.0.17) Gecko/2010010605 Ubuntu/8.10 (intrepid) Firefox/3.0.17" -
> Hibernate:
>    select
>        user0_.id as id0_0_,
>        user0_.email as email0_0_,
>        user0_.encodedPassword as encodedP3_0_0_,
>        user0_.firstName as firstName0_0_,
>        user0_.lastName as lastName0_0_,
>        user0_.version as version0_0_
>    from
>        User user0_
>    where
>        user0_.id=?
> Hibernate:
>    select
>        user0_.id as id0_,
>        user0_.email as email0_,
>        user0_.encodedPassword as encodedP3_0_,
>        user0_.firstName as firstName0_,
>        user0_.lastName as lastName0_,
>        user0_.version as version0_
>    from
>        User user0_
>    order by
>        user0_.id desc
> 127.0.0.1 - - [25/May/2010:23:41:04 +0000] "GET /encodeentities/1 HTTP/1.1" 200 262 "http://localhost:9999/encodeentities" "Mozilla/5.0 (X11; U; Linux x86_64; en-US; rv:1.9.0.17) Gecko/2010010605 Ubuntu/8.10 (intrepid) Firefox/3.0.17" -
> [INFO] SeleniumDriverResourceHandler Got result: OK on session 3540cc300b0c4252a8e6ea7c5fcadeff
> [INFO] SeleniumDriverResourceHandler Command request: getText[//span[@id='name'], ] on session 3540cc300b0c4252a8e6ea7c5fcadeff
> [INFO] SeleniumDriverResourceHandler Got result: OK,name on session 3540cc300b0c4252a8e6ea7c5fcadeff
> [INFO] SeleniumDriverResourceHandler Command request: open[/encodeentities/9999, true] on session 3540cc300b0c4252a8e6ea7c5fcadeff
> Hibernate:
>    select
>        user0_.id as id0_0_,
>        user0_.email as email0_0_,
>        user0_.encodedPassword as encodedP3_0_0_,
>        user0_.firstName as firstName0_0_,
>        user0_.lastName as lastName0_0_,
>        user0_.version as version0_0_
>    from
>        User user0_
>    where
>        user0_.id=?
> [ERROR] User Unable to convert client value '9999' into an entity instance.
> Hibernate:
>    select
>        user0_.id as id0_,
>        user0_.email as email0_,
>        user0_.encodedPassword as encodedP3_0_,
>        user0_.firstName as firstName0_,
>        user0_.lastName as lastName0_,
>        user0_.version as version0_
>    from
>        User user0_
>    order by
>        user0_.id desc
> 127.0.0.1 - - [25/May/2010:23:41:04 +0000] "GET /encodeentities/9999 HTTP/1.1" 200 259 "-" "Mozilla/5.0 (X11; U; Linux x86_64; en-US; rv:1.9.0.17) Gecko/2010010605 Ubuntu/8.10 (intrepid) Firefox/3.0.17" -
> [INFO] SeleniumDriverResourceHandler Got result: OK on session 3540cc300b0c4252a8e6ea7c5fcadeff
> [INFO] SeleniumDriverResourceHandler Command request: getText[//span[@id='name'], ] on session 3540cc300b0c4252a8e6ea7c5fcadeff
> [INFO] SeleniumDriverResourceHandler Got result: OK, on session 3540cc300b0c4252a8e6ea7c5fcadeff
> [INFO] SeleniumDriverResourceHandler Command request: testComplete[, ] on session 3540cc300b0c4252a8e6ea7c5fcadeff
> [INFO] FirefoxChromeLauncher Killing Firefox...
> [INFO] SeleniumDriverResourceHandler Got result: OK on session 3540cc300b0c4252a8e6ea7c5fcadeff
> [INFO] ThreadedServer Stopping Acceptor ServerSocket[addr=0.0.0.0/0.0.0.0,port=0,localport=4444]
> [INFO] SocketListener Stopped SocketListener on 0.0.0.0:4444
> [INFO] Container Stopped HttpContext[/selenium-server/driver,/selenium-server/driver]
> [INFO] Container Stopped HttpContext[/selenium-server,/selenium-server]
> [INFO] Container Stopped HttpContext[/,/]
> [INFO] Container Stopped org.openqa.jetty.jetty.servlet.ServletHandler@a632be
> [INFO] Container Stopped HttpContext[/wd,/wd]
> [INFO] Container Stopped org.openqa.jetty.jetty.Server@f18d37
> Stopping Jetty instance on port 9999
> [INFO] ThreadedServer Stopping Acceptor ServerSocket[addr=0.0.0.0/0.0.0.0,port=0,localport=9999]
> [INFO] SocketListener Stopped SocketListener on 0.0.0.0:9999
> [INFO] SessionFactoryImpl closing
> [INFO] DriverManagerConnectionProvider cleaning up connection pool: jdbc:hsqldb:mem:test
> [INFO] Container Stopped org.mortbay.jetty.servlet.WebApplicationHandler@1c13d0b
> [INFO] DriverManagerConnectionProvider cleaning up connection pool: jdbc:hsqldb:mem:test
> [INFO] Container Stopped WebApplicationContext[/,Tapestry-Hibernate Integration Test Application]
> [INFO] Container Stopped org.mortbay.jetty.Server@1f21c50
> Jetty instance has stopped.
> PASSED: hibernate_statistics
> PASSED: valueencode_all_entity_types
> FAILED: commit_after_on_component_methods
> com.thoughtworks.selenium.SeleniumException: ERROR: Element name not found
>        at com.thoughtworks.selenium.HttpCommandProcessor.throwAssertionFailureExceptionOrError(HttpCommandProcessor.java:97)
>        at com.thoughtworks.selenium.HttpCommandProcessor.doCommand(HttpCommandProcessor.java:91)
>        at com.thoughtworks.selenium.HttpCommandProcessor.getString(HttpCommandProcessor.java:262)
>        at org.apache.tapestry5.test.ErrorReportingCommandProcessor.getString(ErrorReportingCommandProcessor.java:134)
>        at com.thoughtworks.selenium.DefaultSelenium.getText(DefaultSelenium.java:453)
>        at org.apache.tapestry5.test.AbstractIntegrationTestSuite.getText(AbstractIntegrationTestSuite.java:646)
>        at org.apache.tapestry5.test.AbstractIntegrationTestSuite.assertText(AbstractIntegrationTestSuite.java:183)
>        at org.apache.tapestry5.hibernate.integration.TapestryHibernateIntegrationTests.commit_after_on_component_methods(TapestryHibernateIntegrationTests.java:122)
>        at org.apache.maven.surefire.testng.TestNGExecutor.run(TestNGExecutor.java:74)
>        at org.apache.maven.surefire.testng.TestNGXmlTestSuite.execute(TestNGXmlTestSuite.java:92)
>        at org.apache.maven.surefire.Surefire.run(Surefire.java:177)
>        at org.apache.maven.surefire.booter.SurefireBooter.runSuitesInProcess(SurefireBooter.java:345)
>        at org.apache.maven.surefire.booter.SurefireBooter.main(SurefireBooter.java:1009)
> ... Removed 24 stack frames
> FAILED: grid
> com.thoughtworks.selenium.SeleniumException: ERROR: Element link=First Name not found
>        at com.thoughtworks.selenium.HttpCommandProcessor.throwAssertionFailureExceptionOrError(HttpCommandProcessor.java:97)
>        at com.thoughtworks.selenium.HttpCommandProcessor.doCommand(HttpCommandProcessor.java:91)
>        at org.apache.tapestry5.test.ErrorReportingCommandProcessor.doCommand(ErrorReportingCommandProcessor.java:69)
>        at com.thoughtworks.selenium.DefaultSelenium.click(DefaultSelenium.java:177)
>        at org.apache.tapestry5.test.AbstractIntegrationTestSuite.click(AbstractIntegrationTestSuite.java:329)
>        at org.apache.tapestry5.test.AbstractIntegrationTestSuite.clickAndWait(AbstractIntegrationTestSuite.java:232)
>        at org.apache.tapestry5.hibernate.integration.TapestryHibernateIntegrationTests.grid(TapestryHibernateIntegrationTests.java:142)
>        at org.apache.maven.surefire.testng.TestNGExecutor.run(TestNGExecutor.java:74)
>        at org.apache.maven.surefire.testng.TestNGXmlTestSuite.execute(TestNGXmlTestSuite.java:92)
>        at org.apache.maven.surefire.Surefire.run(Surefire.java:177)
>        at org.apache.maven.surefire.booter.SurefireBooter.runSuitesInProcess(SurefireBooter.java:345)
>        at org.apache.maven.surefire.booter.SurefireBooter.main(SurefireBooter.java:1009)
> ... Removed 24 stack frames
> FAILED: persist_entities
> com.thoughtworks.selenium.SeleniumException: ERROR: Element //span[@id='name'] not found
>        at com.thoughtworks.selenium.HttpCommandProcessor.throwAssertionFailureExceptionOrError(HttpCommandProcessor.java:97)
>        at com.thoughtworks.selenium.HttpCommandProcessor.doCommand(HttpCommandProcessor.java:91)
>        at com.thoughtworks.selenium.HttpCommandProcessor.getString(HttpCommandProcessor.java:262)
>        at org.apache.tapestry5.test.ErrorReportingCommandProcessor.getString(ErrorReportingCommandProcessor.java:134)
>        at com.thoughtworks.selenium.DefaultSelenium.getText(DefaultSelenium.java:453)
>        at org.apache.tapestry5.test.AbstractIntegrationTestSuite.getText(AbstractIntegrationTestSuite.java:646)
>        at org.apache.tapestry5.test.AbstractIntegrationTestSuite.assertText(AbstractIntegrationTestSuite.java:183)
>        at org.apache.tapestry5.hibernate.integration.TapestryHibernateIntegrationTests.persist_entities(TapestryHibernateIntegrationTests.java:51)
>        at org.apache.maven.surefire.testng.TestNGExecutor.run(TestNGExecutor.java:74)
>        at org.apache.maven.surefire.testng.TestNGXmlTestSuite.execute(TestNGXmlTestSuite.java:92)
>        at org.apache.maven.surefire.Surefire.run(Surefire.java:177)
>        at org.apache.maven.surefire.booter.SurefireBooter.runSuitesInProcess(SurefireBooter.java:345)
>        at org.apache.maven.surefire.booter.SurefireBooter.main(SurefireBooter.java:1009)
> ... Removed 24 stack frames
> FAILED: sso_entities
> com.thoughtworks.selenium.SeleniumException: ERROR: Element //span[@id='name'] not found
>        at com.thoughtworks.selenium.HttpCommandProcessor.throwAssertionFailureExceptionOrError(HttpCommandProcessor.java:97)
>        at com.thoughtworks.selenium.HttpCommandProcessor.doCommand(HttpCommandProcessor.java:91)
>        at com.thoughtworks.selenium.HttpCommandProcessor.getString(HttpCommandProcessor.java:262)
>        at org.apache.tapestry5.test.ErrorReportingCommandProcessor.getString(ErrorReportingCommandProcessor.java:134)
>        at com.thoughtworks.selenium.DefaultSelenium.getText(DefaultSelenium.java:453)
>        at org.apache.tapestry5.test.AbstractIntegrationTestSuite.getText(AbstractIntegrationTestSuite.java:646)
>        at org.apache.tapestry5.test.AbstractIntegrationTestSuite.assertText(AbstractIntegrationTestSuite.java:183)
>        at org.apache.tapestry5.hibernate.integration.TapestryHibernateIntegrationTests.sso_entities(TapestryHibernateIntegrationTests.java:79)
>        at org.apache.maven.surefire.testng.TestNGExecutor.run(TestNGExecutor.java:74)
>        at org.apache.maven.surefire.testng.TestNGXmlTestSuite.execute(TestNGXmlTestSuite.java:92)
>        at org.apache.maven.surefire.Surefire.run(Surefire.java:177)
>        at org.apache.maven.surefire.booter.SurefireBooter.runSuitesInProcess(SurefireBooter.java:345)
>        at org.apache.maven.surefire.booter.SurefireBooter.main(SurefireBooter.java:1009)
> ... Removed 24 stack frames
> FAILED: using_cached_with_form
> com.thoughtworks.selenium.SeleniumException: ERROR: Element name not found
>        at com.thoughtworks.selenium.HttpCommandProcessor.throwAssertionFailureExceptionOrError(HttpCommandProcessor.java:97)
>        at com.thoughtworks.selenium.HttpCommandProcessor.doCommand(HttpCommandProcessor.java:91)
>        at org.apache.tapestry5.test.ErrorReportingCommandProcessor.doCommand(ErrorReportingCommandProcessor.java:69)
>        at com.thoughtworks.selenium.DefaultSelenium.type(DefaultSelenium.java:301)
>        at org.apache.tapestry5.test.AbstractIntegrationTestSuite.type(AbstractIntegrationTestSuite.java:464)
>        at org.apache.tapestry5.hibernate.integration.TapestryHibernateIntegrationTests.using_cached_with_form(TapestryHibernateIntegrationTests.java:109)
>        at org.apache.maven.surefire.testng.TestNGExecutor.run(TestNGExecutor.java:74)
>        at org.apache.maven.surefire.testng.TestNGXmlTestSuite.execute(TestNGXmlTestSuite.java:92)
>        at org.apache.maven.surefire.Surefire.run(Surefire.java:177)
>        at org.apache.maven.surefire.booter.SurefireBooter.runSuitesInProcess(SurefireBooter.java:345)
>        at org.apache.maven.surefire.booter.SurefireBooter.main(SurefireBooter.java:1009)
> ... Removed 24 stack frames
>
> ===============================================
>    Tapestry Hibernate Integration Tests
>    Tests run: 7, Failures: 5, Skips: 0
> ===============================================
>
>
> ===============================================
> Tapestry Hibernate
> Total tests run: 11, Failures: 5, Skips: 0
> ===============================================
>
> [org.testng.internal.PoolService] Shutting down poolservice org.testng.internal.PoolService@133b16a terminated:false
> Tests run: 11, Failures: 5, Errors: 0, Skipped: 0, Time elapsed: 15.014 sec <<< FAILURE!
>
> Results :
>
> Failed tests:
>  commit_after_on_component_methods(org.apache.tapestry5.hibernate.integration.TapestryHibernateIntegrationTests)
>  grid(org.apache.tapestry5.hibernate.integration.TapestryHibernateIntegrationTests)
>  persist_entities(org.apache.tapestry5.hibernate.integration.TapestryHibernateIntegrationTests)
>  sso_entities(org.apache.tapestry5.hibernate.integration.TapestryHibernateIntegrationTests)
>  using_cached_with_form(org.apache.tapestry5.hibernate.integration.TapestryHibernateIntegrationTests)
>
> Tests run: 11, Failures: 5, Errors: 0, Skipped: 0
>
> [INFO] ------------------------------------------------------------------------
> [ERROR] BUILD FAILURE
> [INFO] ------------------------------------------------------------------------
> [INFO] There are test failures.
>
> Please refer to <http://hudson.zones.apache.org/hudson/job/tapestry-5.2-freestyle/ws/trunk/tapestry-hibernate/target/surefire-reports> for the individual test results.
> [INFO] ------------------------------------------------------------------------
> [INFO] For more information, run Maven with the -e switch
> [INFO] ------------------------------------------------------------------------
> [INFO] Total time: 10 minutes 2 seconds
> [INFO] Finished at: Tue May 25 23:41:06 UTC 2010
> [INFO] Final Memory: 122M/221M
> [INFO] ------------------------------------------------------------------------
> [TASKS] Skipping publisher since build result is FAILURE
> [WARNINGS] Skipping publisher since build result is FAILURE
>
>
> ---------------------------------------------------------------------
> To unsubscribe, e-mail: dev-unsubscribe@tapestry.apache.org
> For additional commands, e-mail: dev-help@tapestry.apache.org
>
>



-- 
Howard M. Lewis Ship

Creator of Apache Tapestry

The source for Tapestry training, mentoring and support. Contact me to
learn how I can get you up and productive in Tapestry fast!

(971) 678-5210
http://howardlewisship.com

---------------------------------------------------------------------
To unsubscribe, e-mail: dev-unsubscribe@tapestry.apache.org
For additional commands, e-mail: dev-help@tapestry.apache.org