You are viewing a plain text version of this content. The canonical link for it is here.
Posted to builds@cassandra.apache.org by Apache Jenkins Server <je...@builds.apache.org> on 2022/07/21 17:30:45 UTC
Build complete: Cassandra-3.0 #288 [UNSTABLE] 09692d5a58d96089c699f59e9b7daacd066e902d
-------------------------------------------------------------------------------
Build Cassandra-3.0 #288 Still Unstable
URL: https://ci-cassandra.apache.org/job/Cassandra-3.0/288/
-------------------------------------------------------------------------------
Changes:
No changes
-------------------------------------------------------------------------------
Failed Tests:
9 tests failed.
FAILED: org.apache.cassandra.db.ScrubTest.testScrubCorruptedCounterRow
FAILED: org.apache.cassandra.db.ScrubTest.testScrubCorruptedCounterRow
FAILED: org.apache.cassandra.cql3.ViewComplexTest.testMVWithDifferentColumnsWithoutFlush
FAILED: dtest.repair_tests.repair_test.TestRepair.test_failure_during_validation
FAILED: dtest-novnode.repair_tests.repair_test.TestRepair.test_dead_sync_initiator
FAILED: dtest-novnode.repair_tests.repair_test.TestRepair.test_failure_during_validation
FAILED: dtest.repair_tests.repair_test.TestRepair.test_dead_sync_initiator
FAILED: dtest-upgrade.upgrade_internal_auth_test.TestAuthUpgrade.test_upgrade_legacy_table
FAILED: dtest-upgrade.upgrade_internal_auth_test.TestAuthUpgrade.test_upgrade_to_30
-------------------------------------------------------------------------------
For complete test report and logs see https://nightlies.apache.org/cassandra/Cassandra-3.0/288/