You are viewing a plain text version of this content. The canonical link for it is here.
Posted to java-dev@axis.apache.org by Apache Jenkins Server <je...@builds.apache.org> on 2012/07/11 12:43:23 UTC
Build failed in Jenkins: Axis2-trunk-java-1.6 #1011
See <https://builds.apache.org/job/Axis2-trunk-java-1.6/1011/>
------------------------------------------
[...truncated 9396 lines...]
Downloading: http://repo1.maven.org/maven2/jetty/jetty/5.1.10/jetty-5.1.10.pom
Downloaded: http://repo1.maven.org/maven2/jetty/jetty/5.1.10/jetty-5.1.10.pom (2 KB at 18.0 KB/sec)
Downloading: http://repo1.maven.org/maven2/com/sun/xml/messaging/saaj/saaj-impl/1.3.2/saaj-impl-1.3.2.pom
Downloaded: http://repo1.maven.org/maven2/com/sun/xml/messaging/saaj/saaj-impl/1.3.2/saaj-impl-1.3.2.pom (350 B at 6.4 KB/sec)
Downloading: http://repo1.maven.org/maven2/com/sun/xml/parsers/jaxp-ri/1.4.2/jaxp-ri-1.4.2.pom
Downloaded: http://repo1.maven.org/maven2/com/sun/xml/parsers/jaxp-ri/1.4.2/jaxp-ri-1.4.2.pom (346 B at 14.7 KB/sec)
Downloading: http://repo1.maven.org/maven2/javax/xml/parsers/jaxp-api/1.4.2/jaxp-api-1.4.2.pom
Downloaded: http://repo1.maven.org/maven2/javax/xml/parsers/jaxp-api/1.4.2/jaxp-api-1.4.2.pom (196 B at 4.2 KB/sec)
Downloading: http://repo1.maven.org/maven2/org/apache/geronimo/specs/geronimo-saaj_1.3_spec/1.0.1/geronimo-saaj_1.3_spec-1.0.1.jar
Downloading: http://repo1.maven.org/maven2/log4j/log4j/1.2.15/log4j-1.2.15.jar
Downloading: http://repo1.maven.org/maven2/jetty/jetty/5.1.10/jetty-5.1.10.jar
Downloading: http://repo1.maven.org/maven2/com/sun/xml/parsers/jaxp-ri/1.4.2/jaxp-ri-1.4.2.jar
Downloading: http://repo1.maven.org/maven2/com/sun/xml/messaging/saaj/saaj-impl/1.3.2/saaj-impl-1.3.2.jar
Downloaded: http://repo1.maven.org/maven2/log4j/log4j/1.2.15/log4j-1.2.15.jar (383 KB at 9110.7 KB/sec)
Downloading: http://repo1.maven.org/maven2/javax/xml/parsers/jaxp-api/1.4.2/jaxp-api-1.4.2.jar
Downloaded: http://repo1.maven.org/maven2/org/apache/geronimo/specs/geronimo-saaj_1.3_spec/1.0.1/geronimo-saaj_1.3_spec-1.0.1.jar (29 KB at 355.0 KB/sec)
Downloaded: http://repo1.maven.org/maven2/javax/xml/parsers/jaxp-api/1.4.2/jaxp-api-1.4.2.jar (215 KB at 5785.9 KB/sec)
Downloaded: http://repo1.maven.org/maven2/com/sun/xml/messaging/saaj/saaj-impl/1.3.2/saaj-impl-1.3.2.jar (272 KB at 2771.7 KB/sec)
Downloaded: http://repo1.maven.org/maven2/com/sun/xml/parsers/jaxp-ri/1.4.2/jaxp-ri-1.4.2.jar (4403 KB at 16367.7 KB/sec)
Downloaded: http://repo1.maven.org/maven2/jetty/jetty/5.1.10/jetty-5.1.10.jar (661 KB at 1585.1 KB/sec)
mojoStarted org.apache.maven.plugins:maven-clean-plugin:2.2(default-clean)
[INFO]
[INFO] --- maven-clean-plugin:2.2:clean (default-clean) @ axis2-saaj ---
mojoSucceeded org.apache.maven.plugins:maven-clean-plugin:2.2(default-clean)
mojoStarted org.apache.maven.plugins:maven-remote-resources-plugin:1.1(default)
[INFO]
[INFO] --- maven-remote-resources-plugin:1.1:process (default) @ axis2-saaj ---
mojoSucceeded org.apache.maven.plugins:maven-remote-resources-plugin:1.1(default)
mojoStarted org.apache.maven.plugins:maven-resources-plugin:2.4.2(default-resources)[INFO] Using 'UTF-8' encoding to copy filtered resources.
[INFO] Copying 4 resources
[INFO] Copying 2 resources
[INFO]
[INFO] --- maven-resources-plugin:2.4.2:resources (default-resources) @ axis2-saaj ---
mojoSucceeded org.apache.maven.plugins:maven-resources-plugin:2.4.2(default-resources)
mojoStarted org.apache.maven.plugins:maven-compiler-plugin:2.3.1(default-compile)[INFO] Compiling 27 source files to <https://builds.apache.org/job/Axis2-trunk-java-1.6/ws/axis2/modules/saaj/target/classes>
[INFO]
[INFO] --- maven-compiler-plugin:2.3.1:compile (default-compile) @ axis2-saaj ---
mojoSucceeded org.apache.maven.plugins:maven-compiler-plugin:2.3.1(default-compile)
mojoStarted org.apache.maven.plugins:maven-resources-plugin:2.4.2(default-testResources)[INFO] Using 'UTF-8' encoding to copy filtered resources.
[INFO] Copying 13 resources
[INFO] Copying 2 resources
[INFO]
[INFO] --- maven-resources-plugin:2.4.2:testResources (default-testResources) @ axis2-saaj ---
mojoSucceeded org.apache.maven.plugins:maven-resources-plugin:2.4.2(default-testResources)
mojoStarted org.apache.maven.plugins:maven-compiler-plugin:2.3.1(default-testCompile)[INFO] Compiling 24 source files to <https://builds.apache.org/job/Axis2-trunk-java-1.6/ws/axis2/modules/saaj/target/test-classes>
[INFO]
[INFO] --- maven-compiler-plugin:2.3.1:testCompile (default-testCompile) @ axis2-saaj ---
[INFO] -------------------------------------------------------------
[ERROR] COMPILATION ERROR :
[INFO] -------------------------------------------------------------
[ERROR] <https://builds.apache.org/job/Axis2-trunk-java-1.6/ws/axis2/modules/saaj/test/org/apache/axis2/saaj/SOAPPartTest.java>:[227,59] cannot find symbol
symbol : method createSOAPMessage(org.apache.axiom.soap.SOAPEnvelope,<nulltype>)
location: class org.apache.axiom.soap.impl.dom.soap11.SOAP11Factory
[INFO] 1error
[INFO] -------------------------------------------------------------
mojoFailed org.apache.maven.plugins:maven-compiler-plugin:2.3.1(default-testCompile)
projectFailed org.apache.axis2:axis2-saaj:1.7.0-SNAPSHOT
sessionEnded
[INFO] ------------------------------------------------------------------------
[INFO] Reactor Summary:
[INFO]
[INFO] Apache Axis2 - Parent ............................. SUCCESS [21.821s]
[INFO] Apache Axis2 - Resource bundle .................... SUCCESS [6.071s]
[INFO] Apache Axis2 - Kernel ............................. SUCCESS [52.428s]
[INFO] Apache Axis2 - Data Binding ....................... SUCCESS [15.505s]
[INFO] Apache Axis2 - Transport - Local .................. SUCCESS [9.695s]
[INFO] Apache Axis2 - Transport - HTTP ................... SUCCESS [14.292s]
[INFO] Apache Axis2 - Code Generation .................... SUCCESS [18.107s]
[INFO] Apache Axis2 - ADB Codegen ........................ SUCCESS [43.717s]
[INFO] Apache Axis2 - Addressing ......................... SUCCESS [9.772s]
[INFO] Apache Axis2 - Java2WSDL .......................... SUCCESS [22.322s]
[INFO] Apache Axis2 - tool - Repository Maven Plugin ..... SUCCESS [8.779s]
[INFO] Apache Axis2 - Fast Infoset ....................... SUCCESS [20.753s]
[INFO] Apache Axis2 - Clustering ......................... SUCCESS [1:45.120s]
[INFO] Apache Axis2 - Scripting .......................... SUCCESS [6.764s]
[INFO] Apache Axis2 - SAAJ ............................... FAILURE [9.414s]
[INFO] Apache Axis2 - Metadata ........................... SKIPPED
[INFO] Apache Axis2 - JAXWS .............................. SKIPPED
[INFO] Apache Axis2 - Test Utilities ..................... SKIPPED
[INFO] Apache Axis2 - XMLBeans Data Binding .............. SKIPPED
[INFO] Apache Axis2 - tool - WSDL2Code Maven Plugin ...... SKIPPED
[INFO] Apache Axis2 - JAXWS Integration Tests ............ SKIPPED
[INFO] Apache Axis2 - MTOM Policy ........................ SKIPPED
[INFO] Apache Axis2 - spring ............................. SKIPPED
[INFO] Apache Axis2 - OSGi Integration ................... SKIPPED
[INFO] Apache Axis2 - Integration ........................ SKIPPED
[INFO] Apache Axis2 - JiBX Data Binding .................. SKIPPED
[INFO] Apache Axis2 - JSON ............................... SKIPPED
[INFO] Apache Axis2 - MEX ................................ SKIPPED
[INFO] Apache Axis2 - MTOM Policy module ................. SKIPPED
[INFO] Apache Axis2 - Ping ............................... SKIPPED
[INFO] Apache Axis2 - Version Service .................... SKIPPED
[INFO] Apache Axis2 - SOAP Monitor Servlet ............... SKIPPED
[INFO] Apache Axis2 - SOAP Monitor Module ................ SKIPPED
[INFO] Apache Axis2 - tool - AAR Maven Plugin ............ SKIPPED
[INFO] Apache Axis2 - tool - Ant Plugin .................. SKIPPED
[INFO] Apache Axis2 - tool - Eclipse Codegen Plugin ...... SKIPPED
[INFO] Apache Axis2 - tool - Eclipse service Plugin ...... SKIPPED
[INFO] Apache Axis2 - tool - Intellij IDEA Plugin ........ SKIPPED
[INFO] Apache Axis2 - tool - Java2WSDL Maven Plugin ...... SKIPPED
[INFO] Apache Axis2 - tool - MAR Maven Plugin ............ SKIPPED
[INFO] Apache Axis2 Simple HTTP server Maven Plugin ...... SKIPPED
[INFO] Axis2 quickstart archetype ........................ SKIPPED
[INFO] Axis2 quickstart-web archetype .................... SKIPPED
[INFO] Apache Axis2 - JAXB-RI Data Binding ............... SKIPPED
[INFO] Apache Axis2 - CORBA .............................. SKIPPED
[INFO] Apache Axis2 - JAXWS (mar) ........................ SKIPPED
[INFO] Apache Axis2 - Web Application module ............. SKIPPED
[INFO] Apache Axis2 - Root ............................... SKIPPED
[INFO] ------------------------------------------------------------------------
[INFO] BUILD FAILURE
[INFO] ------------------------------------------------------------------------
[INFO] Total time: 6:25.940s
[INFO] Finished at: Wed Jul 11 10:42:44 UTC 2012
[INFO] Final Memory: 41M/528M
[INFO] ------------------------------------------------------------------------
Projects to build: [MavenProject: org.apache.axis2:axis2-parent:1.7.0-SNAPSHOT @ <https://builds.apache.org/job/Axis2-trunk-java-1.6/ws/axis2/modules/parent/pom.xml,> MavenProject: org.apache.axis2:axis2-resource-bundle:1.7.0-SNAPSHOT @ <https://builds.apache.org/job/Axis2-trunk-java-1.6/ws/axis2/modules/resource-bundle/pom.xml,> MavenProject: org.apache.axis2:axis2-kernel:1.7.0-SNAPSHOT @ <https://builds.apache.org/job/Axis2-trunk-java-1.6/ws/axis2/modules/kernel/pom.xml,> MavenProject: org.apache.axis2:axis2-adb:1.7.0-SNAPSHOT @ <https://builds.apache.org/job/Axis2-trunk-java-1.6/ws/axis2/modules/adb/pom.xml,> MavenProject: org.apache.axis2:axis2-transport-local:1.7.0-SNAPSHOT @ <https://builds.apache.org/job/Axis2-trunk-java-1.6/ws/axis2/modules/transport/local/pom.xml,> MavenProject: org.apache.axis2:axis2-transport-http:1.7.0-SNAPSHOT @ <https://builds.apache.org/job/Axis2-trunk-java-1.6/ws/axis2/modules/transport/http/pom.xml,> MavenProject: org.apache.axis2:axis2-codegen:1.7.0-SNAPSHOT @ <https://builds.apache.org/job/Axis2-trunk-java-1.6/ws/axis2/modules/codegen/pom.xml,> MavenProject: org.apache.axis2:axis2-adb-codegen:1.7.0-SNAPSHOT @ <https://builds.apache.org/job/Axis2-trunk-java-1.6/ws/axis2/modules/adb-codegen/pom.xml,> MavenProject: org.apache.axis2:addressing:1.7.0-SNAPSHOT @ <https://builds.apache.org/job/Axis2-trunk-java-1.6/ws/axis2/modules/addressing/pom.xml,> MavenProject: org.apache.axis2:axis2-java2wsdl:1.7.0-SNAPSHOT @ <https://builds.apache.org/job/Axis2-trunk-java-1.6/ws/axis2/modules/java2wsdl/pom.xml,> MavenProject: org.apache.axis2:axis2-repo-maven-plugin:1.7.0-SNAPSHOT @ <https://builds.apache.org/job/Axis2-trunk-java-1.6/ws/axis2/modules/tool/axis2-repo-maven-plugin/pom.xml,> MavenProject: org.apache.axis2:axis2-fastinfoset:1.7.0-SNAPSHOT @ <https://builds.apache.org/job/Axis2-trunk-java-1.6/ws/axis2/modules/fastinfoset/pom.xml,> MavenProject: org.apache.axis2:axis2-clustering:1.7.0-SNAPSHOT @ <https://builds.apache.org/job/Axis2-trunk-java-1.6/ws/axis2/modules/clustering/pom.xml,> MavenProject: org.apache.axis2:scripting:1.7.0-SNAPSHOT @ <https://builds.apache.org/job/Axis2-trunk-java-1.6/ws/axis2/modules/scripting/pom.xml,> MavenProject: org.apache.axis2:axis2-saaj:1.7.0-SNAPSHOT @ <https://builds.apache.org/job/Axis2-trunk-java-1.6/ws/axis2/modules/saaj/pom.xml,> MavenProject: org.apache.axis2:axis2-metadata:1.7.0-SNAPSHOT @ <https://builds.apache.org/job/Axis2-trunk-java-1.6/ws/axis2/modules/metadata/pom.xml,> MavenProject: org.apache.axis2:axis2-jaxws:1.7.0-SNAPSHOT @ <https://builds.apache.org/job/Axis2-trunk-java-1.6/ws/axis2/modules/jaxws/pom.xml,> MavenProject: org.apache.axis2:axis2-testutils:1.7.0-SNAPSHOT @ <https://builds.apache.org/job/Axis2-trunk-java-1.6/ws/axis2/modules/testutils/pom.xml,> MavenProject: org.apache.axis2:axis2-xmlbeans:1.7.0-SNAPSHOT @ <https://builds.apache.org/job/Axis2-trunk-java-1.6/ws/axis2/modules/xmlbeans/pom.xml,> MavenProject: org.apache.axis2:axis2-wsdl2code-maven-plugin:1.7.0-SNAPSHOT @ <https://builds.apache.org/job/Axis2-trunk-java-1.6/ws/axis2/modules/tool/axis2-wsdl2code-maven-plugin/pom.xml,> MavenProject: org.apache.axis2:axis2-jaxws-integration:1.7.0-SNAPSHOT @ <https://builds.apache.org/job/Axis2-trunk-java-1.6/ws/axis2/modules/jaxws-integration/pom.xml,> MavenProject: org.apache.axis2:axis2-mtompolicy:1.7.0-SNAPSHOT @ <https://builds.apache.org/job/Axis2-trunk-java-1.6/ws/axis2/modules/mtompolicy/pom.xml,> MavenProject: org.apache.axis2:axis2-spring:1.7.0-SNAPSHOT @ <https://builds.apache.org/job/Axis2-trunk-java-1.6/ws/axis2/modules/spring/pom.xml,> MavenProject: org.apache.axis2:org.apache.axis2.osgi:1.7.0-SNAPSHOT @ <https://builds.apache.org/job/Axis2-trunk-java-1.6/ws/axis2/modules/osgi/pom.xml,> MavenProject: org.apache.axis2:axis2-integration:1.7.0-SNAPSHOT @ <https://builds.apache.org/job/Axis2-trunk-java-1.6/ws/axis2/modules/integration/pom.xml,> MavenProject: org.apache.axis2:axis2-jibx:1.7.0-SNAPSHOT @ <https://builds.apache.org/job/Axis2-trunk-java-1.6/ws/axis2/modules/jibx/pom.xml,> MavenProject: org.apache.axis2:axis2-json:1.7.0-SNAPSHOT @ <https://builds.apache.org/job/Axis2-trunk-java-1.6/ws/axis2/modules/json/pom.xml,> MavenProject: org.apache.axis2:mex:1.7.0-SNAPSHOT @ <https://builds.apache.org/job/Axis2-trunk-java-1.6/ws/axis2/modules/mex/pom.xml,> MavenProject: org.apache.axis2:mtompolicy:1.7.0-SNAPSHOT @ <https://builds.apache.org/job/Axis2-trunk-java-1.6/ws/axis2/modules/mtompolicy-mar/pom.xml,> MavenProject: org.apache.axis2:ping:1.7.0-SNAPSHOT @ <https://builds.apache.org/job/Axis2-trunk-java-1.6/ws/axis2/modules/ping/pom.xml,> MavenProject: org.apache.axis2:version:1.7.0-SNAPSHOT @ <https://builds.apache.org/job/Axis2-trunk-java-1.6/ws/axis2/modules/samples/version/pom.xml,> MavenProject: org.apache.axis2:axis2-soapmonitor-servlet:1.7.0-SNAPSHOT @ <https://builds.apache.org/job/Axis2-trunk-java-1.6/ws/axis2/modules/soapmonitor/servlet/pom.xml,> MavenProject: org.apache.axis2:soapmonitor:1.7.0-SNAPSHOT @ <https://builds.apache.org/job/Axis2-trunk-java-1.6/ws/axis2/modules/soapmonitor/module/pom.xml,> MavenProject: org.apache.axis2:axis2-aar-maven-plugin:1.7.0-SNAPSHOT @ <https://builds.apache.org/job/Axis2-trunk-java-1.6/ws/axis2/modules/tool/axis2-aar-maven-plugin/pom.xml,> MavenProject: org.apache.axis2:axis2-ant-plugin:1.7.0-SNAPSHOT @ <https://builds.apache.org/job/Axis2-trunk-java-1.6/ws/axis2/modules/tool/axis2-ant-plugin/pom.xml,> MavenProject: org.apache.axis2:axis2.eclipse.codegen.plugin:1.7.0-SNAPSHOT @ <https://builds.apache.org/job/Axis2-trunk-java-1.6/ws/axis2/modules/tool/axis2-eclipse-codegen-plugin/pom.xml,> MavenProject: org.apache.axis2:axis2.eclipse.service.plugin:1.7.0-SNAPSHOT @ <https://builds.apache.org/job/Axis2-trunk-java-1.6/ws/axis2/modules/tool/axis2-eclipse-service-plugin/pom.xml,> MavenProject: org.apache.axis2:axis2-idea-plugin:1.7.0-SNAPSHOT @ <https://builds.apache.org/job/Axis2-trunk-java-1.6/ws/axis2/modules/tool/axis2-idea-plugin/pom.xml,> MavenProject: org.apache.axis2:axis2-java2wsdl-maven-plugin:1.7.0-SNAPSHOT @ <https://builds.apache.org/job/Axis2-trunk-java-1.6/ws/axis2/modules/tool/axis2-java2wsdl-maven-plugin/pom.xml,> MavenProject: org.apache.axis2:axis2-mar-maven-plugin:1.7.0-SNAPSHOT @ <https://builds.apache.org/job/Axis2-trunk-java-1.6/ws/axis2/modules/tool/axis2-mar-maven-plugin/pom.xml,> MavenProject: org.apache.axis2:simple-server-maven-plugin:1.7.0-SNAPSHOT @ <https://builds.apache.org/job/Axis2-trunk-java-1.6/ws/axis2/modules/tool/simple-server-maven-plugin/pom.xml,> MavenProject: org.apache.axis2.archetype:quickstart:1.7.0-SNAPSHOT @ <https://builds.apache.org/job/Axis2-trunk-java-1.6/ws/axis2/modules/tool/archetype/quickstart/pom.xml,> MavenProject: org.apache.axis2.archetype:quickstart-webapp:1.7.0-SNAPSHOT @ <https://builds.apache.org/job/Axis2-trunk-java-1.6/ws/axis2/modules/tool/archetype/quickstart-webapp/pom.xml,> MavenProject: org.apache.axis2:axis2-jaxbri:1.7.0-SNAPSHOT @ <https://builds.apache.org/job/Axis2-trunk-java-1.6/ws/axis2/modules/jaxbri/pom.xml,> MavenProject: org.apache.axis2:axis2-corba:1.7.0-SNAPSHOT @ <https://builds.apache.org/job/Axis2-trunk-java-1.6/ws/axis2/modules/corba/pom.xml,> MavenProject: org.apache.axis2:axis2-jaxws-mar:1.7.0-SNAPSHOT @ <https://builds.apache.org/job/Axis2-trunk-java-1.6/ws/axis2/modules/jaxws-mar/pom.xml,> MavenProject: org.apache.axis2:axis2-webapp:1.7.0-SNAPSHOT @ <https://builds.apache.org/job/Axis2-trunk-java-1.6/ws/axis2/modules/webapp/pom.xml,> MavenProject: org.apache.axis2:axis2:1.7.0-SNAPSHOT @ <https://builds.apache.org/job/Axis2-trunk-java-1.6/ws/axis2/pom.xml]>
[JENKINS] Archiving <https://builds.apache.org/job/Axis2-trunk-java-1.6/ws/axis2/modules/integration/pom.xml> to /home/hudson/hudson/jobs/Axis2-trunk-java-1.6/modules/org.apache.axis2$axis2-integration/builds/2012-07-11_10-36-02/archive/org.apache.axis2/axis2-integration/1.7.0-SNAPSHOT/axis2-integration-1.7.0-SNAPSHOT.pom
[JENKINS] Archiving <https://builds.apache.org/job/Axis2-trunk-java-1.6/ws/axis2/modules/mtompolicy-mar/pom.xml> to /home/hudson/hudson/jobs/Axis2-trunk-java-1.6/modules/org.apache.axis2$mtompolicy/builds/2012-07-11_10-36-02/archive/org.apache.axis2/mtompolicy/1.7.0-SNAPSHOT/mtompolicy-1.7.0-SNAPSHOT.pom
[JENKINS] Archiving <https://builds.apache.org/job/Axis2-trunk-java-1.6/ws/axis2/modules/codegen/pom.xml> to /home/hudson/hudson/jobs/Axis2-trunk-java-1.6/modules/org.apache.axis2$axis2-codegen/builds/2012-07-11_10-36-02/archive/org.apache.axis2/axis2-codegen/1.7.0-SNAPSHOT/axis2-codegen-1.7.0-SNAPSHOT.pom
[JENKINS] Archiving <https://builds.apache.org/job/Axis2-trunk-java-1.6/ws/axis2/modules/codegen/target/axis2-codegen-1.7.0-SNAPSHOT.jar> to /home/hudson/hudson/jobs/Axis2-trunk-java-1.6/modules/org.apache.axis2$axis2-codegen/builds/2012-07-11_10-36-02/archive/org.apache.axis2/axis2-codegen/1.7.0-SNAPSHOT/axis2-codegen-1.7.0-SNAPSHOT.jar
[JENKINS] Archiving <https://builds.apache.org/job/Axis2-trunk-java-1.6/ws/axis2/modules/resource-bundle/pom.xml> to /home/hudson/hudson/jobs/Axis2-trunk-java-1.6/modules/org.apache.axis2$axis2-resource-bundle/builds/2012-07-11_10-36-02/archive/org.apache.axis2/axis2-resource-bundle/1.7.0-SNAPSHOT/axis2-resource-bundle-1.7.0-SNAPSHOT.pom
[JENKINS] Archiving <https://builds.apache.org/job/Axis2-trunk-java-1.6/ws/axis2/modules/resource-bundle/target/axis2-resource-bundle-1.7.0-SNAPSHOT.jar> to /home/hudson/hudson/jobs/Axis2-trunk-java-1.6/modules/org.apache.axis2$axis2-resource-bundle/builds/2012-07-11_10-36-02/archive/org.apache.axis2/axis2-resource-bundle/1.7.0-SNAPSHOT/axis2-resource-bundle-1.7.0-SNAPSHOT.jar
[JENKINS] Archiving <https://builds.apache.org/job/Axis2-trunk-java-1.6/ws/axis2/modules/tool/simple-server-maven-plugin/pom.xml> to /home/hudson/hudson/jobs/Axis2-trunk-java-1.6/modules/org.apache.axis2$simple-server-maven-plugin/builds/2012-07-11_10-36-03/archive/org.apache.axis2/simple-server-maven-plugin/1.7.0-SNAPSHOT/simple-server-maven-plugin-1.7.0-SNAPSHOT.pom
[JENKINS] Archiving <https://builds.apache.org/job/Axis2-trunk-java-1.6/ws/axis2/modules/xmlbeans/pom.xml> to /home/hudson/hudson/jobs/Axis2-trunk-java-1.6/modules/org.apache.axis2$axis2-xmlbeans/builds/2012-07-11_10-36-03/archive/org.apache.axis2/axis2-xmlbeans/1.7.0-SNAPSHOT/axis2-xmlbeans-1.7.0-SNAPSHOT.pom
[JENKINS] Archiving <https://builds.apache.org/job/Axis2-trunk-java-1.6/ws/axis2/modules/metadata/pom.xml> to /home/hudson/hudson/jobs/Axis2-trunk-java-1.6/modules/org.apache.axis2$axis2-metadata/builds/2012-07-11_10-36-03/archive/org.apache.axis2/axis2-metadata/1.7.0-SNAPSHOT/axis2-metadata-1.7.0-SNAPSHOT.pom
[JENKINS] Archiving <https://builds.apache.org/job/Axis2-trunk-java-1.6/ws/axis2/modules/tool/axis2-eclipse-service-plugin/pom.xml> to /home/hudson/hudson/jobs/Axis2-trunk-java-1.6/modules/org.apache.axis2$axis2.eclipse.service.plugin/builds/2012-07-11_10-36-03/archive/org.apache.axis2/axis2.eclipse.service.plugin/1.7.0-SNAPSHOT/axis2.eclipse.service.plugin-1.7.0-SNAPSHOT.pom
[JENKINS] Archiving <https://builds.apache.org/job/Axis2-trunk-java-1.6/ws/axis2/modules/jaxbri/pom.xml> to /home/hudson/hudson/jobs/Axis2-trunk-java-1.6/modules/org.apache.axis2$axis2-jaxbri/builds/2012-07-11_10-36-03/archive/org.apache.axis2/axis2-jaxbri/1.7.0-SNAPSHOT/axis2-jaxbri-1.7.0-SNAPSHOT.pom
[JENKINS] Archiving <https://builds.apache.org/job/Axis2-trunk-java-1.6/ws/axis2/modules/tool/axis2-java2wsdl-maven-plugin/pom.xml> to /home/hudson/hudson/jobs/Axis2-trunk-java-1.6/modules/org.apache.axis2$axis2-java2wsdl-maven-plugin/builds/2012-07-11_10-36-03/archive/org.apache.axis2/axis2-java2wsdl-maven-plugin/1.7.0-SNAPSHOT/axis2-java2wsdl-maven-plugin-1.7.0-SNAPSHOT.pom
[JENKINS] Archiving <https://builds.apache.org/job/Axis2-trunk-java-1.6/ws/axis2/modules/clustering/pom.xml> to /home/hudson/hudson/jobs/Axis2-trunk-java-1.6/modules/org.apache.axis2$axis2-clustering/builds/2012-07-11_10-36-03/archive/org.apache.axis2/axis2-clustering/1.7.0-SNAPSHOT/axis2-clustering-1.7.0-SNAPSHOT.pom
[JENKINS] Archiving <https://builds.apache.org/job/Axis2-trunk-java-1.6/ws/axis2/modules/clustering/target/axis2-clustering-1.7.0-SNAPSHOT.jar> to /home/hudson/hudson/jobs/Axis2-trunk-java-1.6/modules/org.apache.axis2$axis2-clustering/builds/2012-07-11_10-36-03/archive/org.apache.axis2/axis2-clustering/1.7.0-SNAPSHOT/axis2-clustering-1.7.0-SNAPSHOT.jar
[JENKINS] Archiving <https://builds.apache.org/job/Axis2-trunk-java-1.6/ws/axis2/modules/adb-codegen/pom.xml> to /home/hudson/hudson/jobs/Axis2-trunk-java-1.6/modules/org.apache.axis2$axis2-adb-codegen/builds/2012-07-11_10-36-02/archive/org.apache.axis2/axis2-adb-codegen/1.7.0-SNAPSHOT/axis2-adb-codegen-1.7.0-SNAPSHOT.pom
[JENKINS] Archiving <https://builds.apache.org/job/Axis2-trunk-java-1.6/ws/axis2/modules/adb-codegen/target/axis2-adb-codegen-1.7.0-SNAPSHOT.jar> to /home/hudson/hudson/jobs/Axis2-trunk-java-1.6/modules/org.apache.axis2$axis2-adb-codegen/builds/2012-07-11_10-36-02/archive/org.apache.axis2/axis2-adb-codegen/1.7.0-SNAPSHOT/axis2-adb-codegen-1.7.0-SNAPSHOT.jar
[JENKINS] Archiving <https://builds.apache.org/job/Axis2-trunk-java-1.6/ws/axis2/modules/spring/pom.xml> to /home/hudson/hudson/jobs/Axis2-trunk-java-1.6/modules/org.apache.axis2$axis2-spring/builds/2012-07-11_10-36-03/archive/org.apache.axis2/axis2-spring/1.7.0-SNAPSHOT/axis2-spring-1.7.0-SNAPSHOT.pom
[JENKINS] Archiving <https://builds.apache.org/job/Axis2-trunk-java-1.6/ws/axis2/modules/mex/pom.xml> to /home/hudson/hudson/jobs/Axis2-trunk-java-1.6/modules/org.apache.axis2$mex/builds/2012-07-11_10-36-02/archive/org.apache.axis2/mex/1.7.0-SNAPSHOT/mex-1.7.0-SNAPSHOT.pom
[JENKINS] Archiving <https://builds.apache.org/job/Axis2-trunk-java-1.6/ws/axis2/modules/parent/pom.xml> to /home/hudson/hudson/jobs/Axis2-trunk-java-1.6/modules/org.apache.axis2$axis2-parent/builds/2012-07-11_10-36-02/archive/org.apache.axis2/axis2-parent/1.7.0-SNAPSHOT/axis2-parent-1.7.0-SNAPSHOT.pom
[JENKINS] Archiving <https://builds.apache.org/job/Axis2-trunk-java-1.6/ws/axis2/modules/soapmonitor/servlet/pom.xml> to /home/hudson/hudson/jobs/Axis2-trunk-java-1.6/modules/org.apache.axis2$axis2-soapmonitor-servlet/builds/2012-07-11_10-36-03/archive/org.apache.axis2/axis2-soapmonitor-servlet/1.7.0-SNAPSHOT/axis2-soapmonitor-servlet-1.7.0-SNAPSHOT.pom
[JENKINS] Archiving <https://builds.apache.org/job/Axis2-trunk-java-1.6/ws/axis2/modules/tool/axis2-ant-plugin/pom.xml> to /home/hudson/hudson/jobs/Axis2-trunk-java-1.6/modules/org.apache.axis2$axis2-ant-plugin/builds/2012-07-11_10-36-03/archive/org.apache.axis2/axis2-ant-plugin/1.7.0-SNAPSHOT/axis2-ant-plugin-1.7.0-SNAPSHOT.pom
[JENKINS] Archiving <https://builds.apache.org/job/Axis2-trunk-java-1.6/ws/axis2/modules/jaxws-mar/pom.xml> to /home/hudson/hudson/jobs/Axis2-trunk-java-1.6/modules/org.apache.axis2$axis2-jaxws-mar/builds/2012-07-11_10-36-03/archive/org.apache.axis2/axis2-jaxws-mar/1.7.0-SNAPSHOT/axis2-jaxws-mar-1.7.0-SNAPSHOT.pom
[JENKINS] Archiving <https://builds.apache.org/job/Axis2-trunk-java-1.6/ws/axis2/modules/ping/pom.xml> to /home/hudson/hudson/jobs/Axis2-trunk-java-1.6/modules/org.apache.axis2$ping/builds/2012-07-11_10-36-03/archive/org.apache.axis2/ping/1.7.0-SNAPSHOT/ping-1.7.0-SNAPSHOT.pom
[JENKINS] Archiving <https://builds.apache.org/job/Axis2-trunk-java-1.6/ws/axis2/modules/tool/axis2-aar-maven-plugin/pom.xml> to /home/hudson/hudson/jobs/Axis2-trunk-java-1.6/modules/org.apache.axis2$axis2-aar-maven-plugin/builds/2012-07-11_10-36-03/archive/org.apache.axis2/axis2-aar-maven-plugin/1.7.0-SNAPSHOT/axis2-aar-maven-plugin-1.7.0-SNAPSHOT.pom
[JENKINS] Archiving <https://builds.apache.org/job/Axis2-trunk-java-1.6/ws/axis2/modules/saaj/pom.xml> to /home/hudson/hudson/jobs/Axis2-trunk-java-1.6/modules/org.apache.axis2$axis2-saaj/builds/2012-07-11_10-36-03/archive/org.apache.axis2/axis2-saaj/1.7.0-SNAPSHOT/axis2-saaj-1.7.0-SNAPSHOT.pom
[JENKINS] Archiving <https://builds.apache.org/job/Axis2-trunk-java-1.6/ws/axis2/modules/jaxws-integration/pom.xml> to /home/hudson/hudson/jobs/Axis2-trunk-java-1.6/modules/org.apache.axis2$axis2-jaxws-integration/builds/2012-07-11_10-36-03/archive/org.apache.axis2/axis2-jaxws-integration/1.7.0-SNAPSHOT/axis2-jaxws-integration-1.7.0-SNAPSHOT.pom
[JENKINS] Archiving <https://builds.apache.org/job/Axis2-trunk-java-1.6/ws/axis2/modules/java2wsdl/pom.xml> to /home/hudson/hudson/jobs/Axis2-trunk-java-1.6/modules/org.apache.axis2$axis2-java2wsdl/builds/2012-07-11_10-36-02/archive/org.apache.axis2/axis2-java2wsdl/1.7.0-SNAPSHOT/axis2-java2wsdl-1.7.0-SNAPSHOT.pom
[JENKINS] Archiving <https://builds.apache.org/job/Axis2-trunk-java-1.6/ws/axis2/modules/java2wsdl/target/axis2-java2wsdl-1.7.0-SNAPSHOT.jar> to /home/hudson/hudson/jobs/Axis2-trunk-java-1.6/modules/org.apache.axis2$axis2-java2wsdl/builds/2012-07-11_10-36-02/archive/org.apache.axis2/axis2-java2wsdl/1.7.0-SNAPSHOT/axis2-java2wsdl-1.7.0-SNAPSHOT.jar
[JENKINS] Archiving <https://builds.apache.org/job/Axis2-trunk-java-1.6/ws/axis2/modules/mtompolicy/pom.xml> to /home/hudson/hudson/jobs/Axis2-trunk-java-1.6/modules/org.apache.axis2$axis2-mtompolicy/builds/2012-07-11_10-36-02/archive/org.apache.axis2/axis2-mtompolicy/1.7.0-SNAPSHOT/axis2-mtompolicy-1.7.0-SNAPSHOT.pom
[JENKINS] Archiving <https://builds.apache.org/job/Axis2-trunk-java-1.6/ws/axis2/modules/webapp/pom.xml> to /home/hudson/hudson/jobs/Axis2-trunk-java-1.6/modules/org.apache.axis2$axis2-webapp/builds/2012-07-11_10-36-03/archive/org.apache.axis2/axis2-webapp/1.7.0-SNAPSHOT/axis2-webapp-1.7.0-SNAPSHOT.pom
[JENKINS] Archiving <https://builds.apache.org/job/Axis2-trunk-java-1.6/ws/axis2/modules/adb/pom.xml> to /home/hudson/hudson/jobs/Axis2-trunk-java-1.6/modules/org.apache.axis2$axis2-adb/builds/2012-07-11_10-36-02/archive/org.apache.axis2/axis2-adb/1.7.0-SNAPSHOT/axis2-adb-1.7.0-SNAPSHOT.pom
[JENKINS] Archiving <https://builds.apache.org/job/Axis2-trunk-java-1.6/ws/axis2/modules/adb/target/axis2-adb-1.7.0-SNAPSHOT.jar> to /home/hudson/hudson/jobs/Axis2-trunk-java-1.6/modules/org.apache.axis2$axis2-adb/builds/2012-07-11_10-36-02/archive/org.apache.axis2/axis2-adb/1.7.0-SNAPSHOT/axis2-adb-1.7.0-SNAPSHOT.jar
[JENKINS] Archiving <https://builds.apache.org/job/Axis2-trunk-java-1.6/ws/axis2/modules/kernel/pom.xml> to /home/hudson/hudson/jobs/Axis2-trunk-java-1.6/modules/org.apache.axis2$axis2-kernel/builds/2012-07-11_10-36-02/archive/org.apache.axis2/axis2-kernel/1.7.0-SNAPSHOT/axis2-kernel-1.7.0-SNAPSHOT.pom
[JENKINS] Archiving <https://builds.apache.org/job/Axis2-trunk-java-1.6/ws/axis2/modules/kernel/target/axis2-kernel-1.7.0-SNAPSHOT.jar> to /home/hudson/hudson/jobs/Axis2-trunk-java-1.6/modules/org.apache.axis2$axis2-kernel/builds/2012-07-11_10-36-02/archive/org.apache.axis2/axis2-kernel/1.7.0-SNAPSHOT/axis2-kernel-1.7.0-SNAPSHOT.jar
[JENKINS] Archiving <https://builds.apache.org/job/Axis2-trunk-java-1.6/ws/axis2/modules/kernel/target/test-zip.zip> to /home/hudson/hudson/jobs/Axis2-trunk-java-1.6/modules/org.apache.axis2$axis2-kernel/builds/2012-07-11_10-36-02/archive/org.apache.axis2/axis2-kernel/1.7.0-SNAPSHOT/axis2-kernel-1.7.0-SNAPSHOT.zip
[JENKINS] Archiving <https://builds.apache.org/job/Axis2-trunk-java-1.6/ws/axis2/modules/tool/axis2-idea-plugin/pom.xml> to /home/hudson/hudson/jobs/Axis2-trunk-java-1.6/modules/org.apache.axis2$axis2-idea-plugin/builds/2012-07-11_10-36-03/archive/org.apache.axis2/axis2-idea-plugin/1.7.0-SNAPSHOT/axis2-idea-plugin-1.7.0-SNAPSHOT.pom
[JENKINS] Archiving <https://builds.apache.org/job/Axis2-trunk-java-1.6/ws/axis2/modules/jaxws/pom.xml> to /home/hudson/hudson/jobs/Axis2-trunk-java-1.6/modules/org.apache.axis2$axis2-jaxws/builds/2012-07-11_10-36-03/archive/org.apache.axis2/axis2-jaxws/1.7.0-SNAPSHOT/axis2-jaxws-1.7.0-SNAPSHOT.pom
[JENKINS] Archiving <https://builds.apache.org/job/Axis2-trunk-java-1.6/ws/axis2/modules/tool/axis2-repo-maven-plugin/pom.xml> to /home/hudson/hudson/jobs/Axis2-trunk-java-1.6/modules/org.apache.axis2$axis2-repo-maven-plugin/builds/2012-07-11_10-36-03/archive/org.apache.axis2/axis2-repo-maven-plugin/1.7.0-SNAPSHOT/axis2-repo-maven-plugin-1.7.0-SNAPSHOT.pom
[JENKINS] Archiving <https://builds.apache.org/job/Axis2-trunk-java-1.6/ws/axis2/modules/tool/axis2-repo-maven-plugin/target/axis2-repo-maven-plugin-1.7.0-SNAPSHOT.jar> to /home/hudson/hudson/jobs/Axis2-trunk-java-1.6/modules/org.apache.axis2$axis2-repo-maven-plugin/builds/2012-07-11_10-36-03/archive/org.apache.axis2/axis2-repo-maven-plugin/1.7.0-SNAPSHOT/axis2-repo-maven-plugin-1.7.0-SNAPSHOT.jar
[JENKINS] Archiving <https://builds.apache.org/job/Axis2-trunk-java-1.6/ws/axis2/modules/tool/axis2-eclipse-codegen-plugin/pom.xml> to /home/hudson/hudson/jobs/Axis2-trunk-java-1.6/modules/org.apache.axis2$axis2.eclipse.codegen.plugin/builds/2012-07-11_10-36-03/archive/org.apache.axis2/axis2.eclipse.codegen.plugin/1.7.0-SNAPSHOT/axis2.eclipse.codegen.plugin-1.7.0-SNAPSHOT.pom
[JENKINS] Archiving <https://builds.apache.org/job/Axis2-trunk-java-1.6/ws/axis2/modules/json/pom.xml> to /home/hudson/hudson/jobs/Axis2-trunk-java-1.6/modules/org.apache.axis2$axis2-json/builds/2012-07-11_10-36-02/archive/org.apache.axis2/axis2-json/1.7.0-SNAPSHOT/axis2-json-1.7.0-SNAPSHOT.pom
[JENKINS] Archiving <https://builds.apache.org/job/Axis2-trunk-java-1.6/ws/axis2/modules/corba/pom.xml> to /home/hudson/hudson/jobs/Axis2-trunk-java-1.6/modules/org.apache.axis2$axis2-corba/builds/2012-07-11_10-36-03/archive/org.apache.axis2/axis2-corba/1.7.0-SNAPSHOT/axis2-corba-1.7.0-SNAPSHOT.pom
[JENKINS] Archiving <https://builds.apache.org/job/Axis2-trunk-java-1.6/ws/axis2/modules/jibx/pom.xml> to /home/hudson/hudson/jobs/Axis2-trunk-java-1.6/modules/org.apache.axis2$axis2-jibx/builds/2012-07-11_10-36-02/archive/org.apache.axis2/axis2-jibx/1.7.0-SNAPSHOT/axis2-jibx-1.7.0-SNAPSHOT.pom
[JENKINS] Archiving <https://builds.apache.org/job/Axis2-trunk-java-1.6/ws/axis2/modules/tool/axis2-wsdl2code-maven-plugin/pom.xml> to /home/hudson/hudson/jobs/Axis2-trunk-java-1.6/modules/org.apache.axis2$axis2-wsdl2code-maven-plugin/builds/2012-07-11_10-36-03/archive/org.apache.axis2/axis2-wsdl2code-maven-plugin/1.7.0-SNAPSHOT/axis2-wsdl2code-maven-plugin-1.7.0-SNAPSHOT.pom
[JENKINS] Archiving <https://builds.apache.org/job/Axis2-trunk-java-1.6/ws/axis2/modules/tool/archetype/quickstart-webapp/pom.xml> to /home/hudson/hudson/jobs/Axis2-trunk-java-1.6/modules/org.apache.axis2.archetype$quickstart-webapp/builds/2012-07-11_10-36-03/archive/org.apache.axis2.archetype/quickstart-webapp/1.7.0-SNAPSHOT/quickstart-webapp-1.7.0-SNAPSHOT.pom
[JENKINS] Archiving <https://builds.apache.org/job/Axis2-trunk-java-1.6/ws/axis2/pom.xml> to /home/hudson/hudson/jobs/Axis2-trunk-java-1.6/modules/org.apache.axis2$axis2/builds/2012-07-11_10-36-02/archive/org.apache.axis2/axis2/1.7.0-SNAPSHOT/axis2-1.7.0-SNAPSHOT.pom
[JENKINS] Archiving <https://builds.apache.org/job/Axis2-trunk-java-1.6/ws/axis2/modules/fastinfoset/pom.xml> to /home/hudson/hudson/jobs/Axis2-trunk-java-1.6/modules/org.apache.axis2$axis2-fastinfoset/builds/2012-07-11_10-36-02/archive/org.apache.axis2/axis2-fastinfoset/1.7.0-SNAPSHOT/axis2-fastinfoset-1.7.0-SNAPSHOT.pom
[JENKINS] Archiving <https://builds.apache.org/job/Axis2-trunk-java-1.6/ws/axis2/modules/fastinfoset/target/axis2-fastinfoset-1.7.0-SNAPSHOT.jar> to /home/hudson/hudson/jobs/Axis2-trunk-java-1.6/modules/org.apache.axis2$axis2-fastinfoset/builds/2012-07-11_10-36-02/archive/org.apache.axis2/axis2-fastinfoset/1.7.0-SNAPSHOT/axis2-fastinfoset-1.7.0-SNAPSHOT.jar
[JENKINS] Archiving <https://builds.apache.org/job/Axis2-trunk-java-1.6/ws/axis2/modules/tool/axis2-mar-maven-plugin/pom.xml> to /home/hudson/hudson/jobs/Axis2-trunk-java-1.6/modules/org.apache.axis2$axis2-mar-maven-plugin/builds/2012-07-11_10-36-03/archive/org.apache.axis2/axis2-mar-maven-plugin/1.7.0-SNAPSHOT/axis2-mar-maven-plugin-1.7.0-SNAPSHOT.pom
[JENKINS] Archiving <https://builds.apache.org/job/Axis2-trunk-java-1.6/ws/axis2/modules/osgi/pom.xml> to /home/hudson/hudson/jobs/Axis2-trunk-java-1.6/modules/org.apache.axis2$org.apache.axis2.osgi/builds/2012-07-11_10-36-03/archive/org.apache.axis2/org.apache.axis2.osgi/1.7.0-SNAPSHOT/org.apache.axis2.osgi-1.7.0-SNAPSHOT.pom
[JENKINS] Archiving <https://builds.apache.org/job/Axis2-trunk-java-1.6/ws/axis2/modules/samples/version/pom.xml> to /home/hudson/hudson/jobs/Axis2-trunk-java-1.6/modules/org.apache.axis2$version/builds/2012-07-11_10-36-03/archive/org.apache.axis2/version/1.7.0-SNAPSHOT/version-1.7.0-SNAPSHOT.pom
[JENKINS] Archiving <https://builds.apache.org/job/Axis2-trunk-java-1.6/ws/axis2/modules/addressing/pom.xml> to /home/hudson/hudson/jobs/Axis2-trunk-java-1.6/modules/org.apache.axis2$addressing/builds/2012-07-11_10-36-02/archive/org.apache.axis2/addressing/1.7.0-SNAPSHOT/addressing-1.7.0-SNAPSHOT.pom
[JENKINS] Archiving <https://builds.apache.org/job/Axis2-trunk-java-1.6/ws/axis2/modules/addressing/target/addressing-1.7.0-SNAPSHOT.mar> to /home/hudson/hudson/jobs/Axis2-trunk-java-1.6/modules/org.apache.axis2$addressing/builds/2012-07-11_10-36-02/archive/org.apache.axis2/addressing/1.7.0-SNAPSHOT/addressing-1.7.0-SNAPSHOT.mar
[JENKINS] Archiving <https://builds.apache.org/job/Axis2-trunk-java-1.6/ws/axis2/modules/addressing/target/addressing-1.7.0-SNAPSHOT-classpath-module.jar> to /home/hudson/hudson/jobs/Axis2-trunk-java-1.6/modules/org.apache.axis2$addressing/builds/2012-07-11_10-36-02/archive/org.apache.axis2/addressing/1.7.0-SNAPSHOT/addressing-1.7.0-SNAPSHOT-classpath-module.jar
[JENKINS] Archiving <https://builds.apache.org/job/Axis2-trunk-java-1.6/ws/axis2/modules/testutils/pom.xml> to /home/hudson/hudson/jobs/Axis2-trunk-java-1.6/modules/org.apache.axis2$axis2-testutils/builds/2012-07-11_10-36-03/archive/org.apache.axis2/axis2-testutils/1.7.0-SNAPSHOT/axis2-testutils-1.7.0-SNAPSHOT.pom
[JENKINS] Archiving <https://builds.apache.org/job/Axis2-trunk-java-1.6/ws/axis2/modules/tool/archetype/quickstart/pom.xml> to /home/hudson/hudson/jobs/Axis2-trunk-java-1.6/modules/org.apache.axis2.archetype$quickstart/builds/2012-07-11_10-36-03/archive/org.apache.axis2.archetype/quickstart/1.7.0-SNAPSHOT/quickstart-1.7.0-SNAPSHOT.pom
[JENKINS] Archiving <https://builds.apache.org/job/Axis2-trunk-java-1.6/ws/axis2/modules/soapmonitor/module/pom.xml> to /home/hudson/hudson/jobs/Axis2-trunk-java-1.6/modules/org.apache.axis2$soapmonitor/builds/2012-07-11_10-36-03/archive/org.apache.axis2/soapmonitor/1.7.0-SNAPSHOT/soapmonitor-1.7.0-SNAPSHOT.pom
[JENKINS] Archiving <https://builds.apache.org/job/Axis2-trunk-java-1.6/ws/axis2/modules/transport/local/pom.xml> to /home/hudson/hudson/jobs/Axis2-trunk-java-1.6/modules/org.apache.axis2$axis2-transport-local/builds/2012-07-11_10-36-04/archive/org.apache.axis2/axis2-transport-local/1.7.0-SNAPSHOT/axis2-transport-local-1.7.0-SNAPSHOT.pom
[JENKINS] Archiving <https://builds.apache.org/job/Axis2-trunk-java-1.6/ws/axis2/modules/transport/local/target/axis2-transport-local-1.7.0-SNAPSHOT.jar> to /home/hudson/hudson/jobs/Axis2-trunk-java-1.6/modules/org.apache.axis2$axis2-transport-local/builds/2012-07-11_10-36-04/archive/org.apache.axis2/axis2-transport-local/1.7.0-SNAPSHOT/axis2-transport-local-1.7.0-SNAPSHOT.jar
[JENKINS] Archiving <https://builds.apache.org/job/Axis2-trunk-java-1.6/ws/axis2/modules/scripting/pom.xml> to /home/hudson/hudson/jobs/Axis2-trunk-java-1.6/modules/org.apache.axis2$scripting/builds/2012-07-11_10-36-03/archive/org.apache.axis2/scripting/1.7.0-SNAPSHOT/scripting-1.7.0-SNAPSHOT.pom
[JENKINS] Archiving <https://builds.apache.org/job/Axis2-trunk-java-1.6/ws/axis2/modules/scripting/target/scripting-1.7.0-SNAPSHOT.mar> to /home/hudson/hudson/jobs/Axis2-trunk-java-1.6/modules/org.apache.axis2$scripting/builds/2012-07-11_10-36-03/archive/org.apache.axis2/scripting/1.7.0-SNAPSHOT/scripting-1.7.0-SNAPSHOT.mar
[JENKINS] Archiving <https://builds.apache.org/job/Axis2-trunk-java-1.6/ws/axis2/modules/transport/http/pom.xml> to /home/hudson/hudson/jobs/Axis2-trunk-java-1.6/modules/org.apache.axis2$axis2-transport-http/builds/2012-07-11_10-36-04/archive/org.apache.axis2/axis2-transport-http/1.7.0-SNAPSHOT/axis2-transport-http-1.7.0-SNAPSHOT.pom
[JENKINS] Archiving <https://builds.apache.org/job/Axis2-trunk-java-1.6/ws/axis2/modules/transport/http/target/axis2-transport-http-1.7.0-SNAPSHOT.jar> to /home/hudson/hudson/jobs/Axis2-trunk-java-1.6/modules/org.apache.axis2$axis2-transport-http/builds/2012-07-11_10-36-04/archive/org.apache.axis2/axis2-transport-http/1.7.0-SNAPSHOT/axis2-transport-http-1.7.0-SNAPSHOT.jar
Waiting for Jenkins to finish collecting data
mavenExecutionResult exceptions not empty
message : Failed to execute goal org.apache.maven.plugins:maven-compiler-plugin:2.3.1:testCompile (default-testCompile) on project axis2-saaj: Compilation failure
<https://builds.apache.org/job/Axis2-trunk-java-1.6/ws/axis2/modules/saaj/test/org/apache/axis2/saaj/SOAPPartTest.java>:[227,59] cannot find symbol
symbol : method createSOAPMessage(org.apache.axiom.soap.SOAPEnvelope,<nulltype>)
location: class org.apache.axiom.soap.impl.dom.soap11.SOAP11Factory
cause : Compilation failure
<https://builds.apache.org/job/Axis2-trunk-java-1.6/ws/axis2/modules/saaj/test/org/apache/axis2/saaj/SOAPPartTest.java>:[227,59] cannot find symbol
symbol : method createSOAPMessage(org.apache.axiom.soap.SOAPEnvelope,<nulltype>)
location: class org.apache.axiom.soap.impl.dom.soap11.SOAP11Factory
Stack trace :
org.apache.maven.lifecycle.LifecycleExecutionException: Failed to execute goal org.apache.maven.plugins:maven-compiler-plugin:2.3.1:testCompile (default-testCompile) on project axis2-saaj: Compilation failure
<https://builds.apache.org/job/Axis2-trunk-java-1.6/ws/axis2/modules/saaj/test/org/apache/axis2/saaj/SOAPPartTest.java>:[227,59] cannot find symbol
symbol : method createSOAPMessage(org.apache.axiom.soap.SOAPEnvelope,<nulltype>)
location: class org.apache.axiom.soap.impl.dom.soap11.SOAP11Factory
at org.apache.maven.lifecycle.internal.MojoExecutor.execute(MojoExecutor.java:213)
at org.apache.maven.lifecycle.internal.MojoExecutor.execute(MojoExecutor.java:153)
at org.apache.maven.lifecycle.internal.MojoExecutor.execute(MojoExecutor.java:145)
at org.apache.maven.lifecycle.internal.LifecycleModuleBuilder.buildProject(LifecycleModuleBuilder.java:84)
at org.apache.maven.lifecycle.internal.LifecycleModuleBuilder.buildProject(LifecycleModuleBuilder.java:59)
at org.apache.maven.lifecycle.internal.LifecycleStarter.singleThreadedBuild(LifecycleStarter.java:183)
at org.apache.maven.lifecycle.internal.LifecycleStarter.execute(LifecycleStarter.java:161)
at org.apache.maven.DefaultMaven.doExecute(DefaultMaven.java:319)
at org.apache.maven.DefaultMaven.execute(DefaultMaven.java:156)
at org.jvnet.hudson.maven3.launcher.Maven3Launcher.main(Maven3Launcher.java:79)
at sun.reflect.NativeMethodAccessorImpl.invoke0(Native Method)
at sun.reflect.NativeMethodAccessorImpl.invoke(NativeMethodAccessorImpl.java:39)
at sun.reflect.DelegatingMethodAccessorImpl.invoke(DelegatingMethodAccessorImpl.java:25)
at java.lang.reflect.Method.invoke(Method.java:597)
at org.codehaus.plexus.classworlds.launcher.Launcher.launchStandard(Launcher.java:329)
at org.codehaus.plexus.classworlds.launcher.Launcher.launch(Launcher.java:239)
at org.jvnet.hudson.maven3.agent.Maven3Main.launch(Maven3Main.java:158)
at hudson.maven.Maven3Builder.call(Maven3Builder.java:98)
at hudson.maven.Maven3Builder.call(Maven3Builder.java:64)
at hudson.remoting.UserRequest.perform(UserRequest.java:118)
at hudson.remoting.UserRequest.perform(UserRequest.java:48)
at hudson.remoting.Request$2.run(Request.java:326)
at hudson.remoting.InterceptingExecutorService$1.call(InterceptingExecutorService.java:72)
at java.util.concurrent.FutureTask$Sync.innerRun(FutureTask.java:303)
at java.util.concurrent.FutureTask.run(FutureTask.java:138)
at java.util.concurrent.ThreadPoolExecutor$Worker.runTask(ThreadPoolExecutor.java:886)
at java.util.concurrent.ThreadPoolExecutor$Worker.run(ThreadPoolExecutor.java:908)
at java.lang.Thread.run(Thread.java:662)
Caused by: org.apache.maven.plugin.CompilationFailureException: Compilation failure
<https://builds.apache.org/job/Axis2-trunk-java-1.6/ws/axis2/modules/saaj/test/org/apache/axis2/saaj/SOAPPartTest.java>:[227,59] cannot find symbol
symbol : method createSOAPMessage(org.apache.axiom.soap.SOAPEnvelope,<nulltype>)
location: class org.apache.axiom.soap.impl.dom.soap11.SOAP11Factory
at org.apache.maven.plugin.AbstractCompilerMojo.execute(AbstractCompilerMojo.java:656)
at org.apache.maven.plugin.TestCompilerMojo.execute(TestCompilerMojo.java:161)
at org.apache.maven.plugin.DefaultBuildPluginManager.executeMojo(DefaultBuildPluginManager.java:101)
at org.apache.maven.lifecycle.internal.MojoExecutor.execute(MojoExecutor.java:209)
... 27 more
Sending e-mails to: java-dev@axis.apache.org
channel stopped
[locks-and-latches] Releasing all the locks
[locks-and-latches] All the locks released
---------------------------------------------------------------------
To unsubscribe, e-mail: java-dev-unsubscribe@axis.apache.org
For additional commands, e-mail: java-dev-help@axis.apache.org
Build failed in Jenkins: Axis2-trunk-java-1.6 #1013
Posted by Apache Jenkins Server <je...@builds.apache.org>.
See <https://builds.apache.org/job/Axis2-trunk-java-1.6/1013/>
------------------------------------------
[...truncated 14260 lines...]
Jul 12, 2012 2:08:09 AM org.apache.jasper.JspC processFile
INFO: Built File: /axis2-web/include/adminheader.jsp
Jul 12, 2012 2:08:09 AM org.apache.jasper.JspC processFile
INFO: Built File: /axis2-web/Error/error500.jsp
Jul 12, 2012 2:08:09 AM org.apache.jasper.JspC processFile
INFO: Built File: /axis2-web/Error/error404.jsp
[INFO] Compiled completed in 0:00:04.101
Copying 40 files to <https://builds.apache.org/job/Axis2-trunk-java-1.6/ws/axis2/modules/webapp/target/classes>
mojoSucceeded org.codehaus.mojo.jspc:jspc-maven-plugin:2.0-alpha-3(default)
mojoStarted org.apache.maven.plugins:maven-antrun-plugin:1.2(default)[INFO] Executing tasks
[delete] Deleting directory <https://builds.apache.org/job/Axis2-trunk-java-1.6/ws/axis2/modules/webapp/target/classes/jsp>
[INFO] Executed tasks
[INFO]
[INFO] --- maven-antrun-plugin:1.2:run (default) @ axis2-webapp ---
mojoSucceeded org.apache.maven.plugins:maven-antrun-plugin:1.2(default)
mojoStarted org.apache.maven.plugins:maven-resources-plugin:2.4.2(default-testResources)[INFO] Using 'UTF-8' encoding to copy filtered resources.
[INFO] skip non existing resourceDirectory <https://builds.apache.org/job/Axis2-trunk-java-1.6/ws/axis2/modules/webapp/src/test/resources>
[INFO] Copying 2 resources
[INFO]
[INFO] --- maven-resources-plugin:2.4.2:testResources (default-testResources) @ axis2-webapp ---
mojoSucceeded org.apache.maven.plugins:maven-resources-plugin:2.4.2(default-testResources)
mojoStarted org.apache.maven.plugins:maven-compiler-plugin:2.3.1(default-testCompile)[INFO] No sources to compile
[INFO]
[INFO] --- maven-compiler-plugin:2.3.1:testCompile (default-testCompile) @ axis2-webapp ---
mojoSucceeded org.apache.maven.plugins:maven-compiler-plugin:2.3.1(default-testCompile)
mojoStarted org.apache.maven.plugins:maven-surefire-plugin:2.4.3(default-test)[INFO] Surefire report directory: <https://builds.apache.org/job/Axis2-trunk-java-1.6/ws/axis2/modules/webapp/target/surefire-reports>
[INFO]
[INFO] --- maven-surefire-plugin:2.4.3:test (default-test) @ axis2-webapp ---
-------------------------------------------------------
T E S T S
-------------------------------------------------------
There are no tests to run.
Results :
Tests run: 0, Failures: 0, Errors: 0, Skipped: 0
mojoSucceeded org.apache.maven.plugins:maven-surefire-plugin:2.4.3(default-test)
[JENKINS] Recording test results
mojoStarted org.apache.maven.plugins:maven-war-plugin:2.1-beta-1(default-war)
[INFO] Downloading: http://repo1.maven.org/maven2/com/thoughtworks/xstream/xstream/1.3.1/xstream-1.3.1.pom
Downloaded: http://repo1.maven.org/maven2/com/thoughtworks/xstream/xstream/1.3.1/xstream-1.3.1.pom (12 KB at 1240.6 KB/sec)
Downloading: http://repo1.maven.org/maven2/com/thoughtworks/xstream/xstream-parent/1.3.1/xstream-parent-1.3.1.pom
Downloaded: http://repo1.maven.org/maven2/com/thoughtworks/xstream/xstream-parent/1.3.1/xstream-parent-1.3.1.pom (14 KB at 1366.1 KB/sec)
Downloading: http://repo1.maven.org/maven2/xpp3/xpp3_min/1.1.4c/xpp3_min-1.1.4c.pom
[INFO] --- maven-war-plugin:2.1-beta-1:war (default-war) @ axis2-webapp ---
Downloaded: http://repo1.maven.org/maven2/xpp3/xpp3_min/1.1.4c/xpp3_min-1.1.4c.pom (2 KB at 262.0 KB/sec)
Downloading: http://repo1.maven.org/maven2/org/codehaus/plexus/plexus-interpolation/1.6/plexus-interpolation-1.6.jar
Downloading: http://repo1.maven.org/maven2/com/thoughtworks/xstream/xstream/1.3.1/xstream-1.3.1.jar
Downloading: http://repo1.maven.org/maven2/xpp3/xpp3_min/1.1.4c/xpp3_min-1.1.4c.jar
Downloaded: http://repo1.maven.org/maven2/org/codehaus/plexus/plexus-interpolation/1.6/plexus-interpolation-1.6.jar (50 KB at 5534.7 KB/sec)
Downloaded: http://repo1.maven.org/maven2/xpp3/xpp3_min/1.1.4c/xpp3_min-1.1.4c.jar (25 KB at 1433.6 KB/sec)
Downloaded: http://repo1.maven.org/maven2/com/thoughtworks/xstream/xstream/1.3.1/xstream-1.3.1.jar (422 KB at 15603.5 KB/sec)
[INFO] Packaging webapp
[INFO] Assembling webapp[axis2-webapp] in [<https://builds.apache.org/job/Axis2-trunk-java-1.6/ws/axis2/modules/webapp/target/axis2-1.7.0-SNAPSHOT]>
[INFO] Processing war project
[INFO] Copying webapp webResources[<https://builds.apache.org/job/Axis2-trunk-java-1.6/ws/axis2/modules/webapp/target/webResources]> to[<https://builds.apache.org/job/Axis2-trunk-java-1.6/ws/axis2/modules/webapp/target/axis2-1.7.0-SNAPSHOT]>
[INFO] Copying webapp webResources[<https://builds.apache.org/job/Axis2-trunk-java-1.6/ws/axis2/modules/webapp/../../legal]> to[<https://builds.apache.org/job/Axis2-trunk-java-1.6/ws/axis2/modules/webapp/target/axis2-1.7.0-SNAPSHOT]>
[INFO] Copying webapp resources[<https://builds.apache.org/job/Axis2-trunk-java-1.6/ws/axis2/modules/webapp/src/main/webapp]>
[INFO] Webapp assembled in [332 msecs]
[INFO] Building war: <https://builds.apache.org/job/Axis2-trunk-java-1.6/ws/axis2/modules/webapp/target/axis2.war>
mojoSucceeded org.apache.maven.plugins:maven-war-plugin:2.1-beta-1(default-war)
[INFO] Installing <https://builds.apache.org/job/Axis2-trunk-java-1.6/ws/axis2/modules/webapp/target/axis2.war> to <https://builds.apache.org/job/Axis2-trunk-java-1.6/ws/.repository/org/apache/axis2/axis2-webapp/1.7.0-SNAPSHOT/axis2-webapp-1.7.0-SNAPSHOT.war>
mojoStarted org.apache.maven.plugins:maven-install-plugin:2.2(default-install)
[INFO]
[INFO] --- maven-install-plugin:2.2:install (default-install) @ axis2-webapp ---
[INFO] Installing <https://builds.apache.org/job/Axis2-trunk-java-1.6/ws/axis2/modules/webapp/pom.xml> to <https://builds.apache.org/job/Axis2-trunk-java-1.6/ws/.repository/org/apache/axis2/axis2-webapp/1.7.0-SNAPSHOT/axis2-webapp-1.7.0-SNAPSHOT.pom>
mojoSucceeded org.apache.maven.plugins:maven-install-plugin:2.2(default-install)
projectSucceeded org.apache.axis2:axis2-webapp:1.7.0-SNAPSHOT
projectStarted org.apache.axis2:axis2:1.7.0-SNAPSHOT
[INFO] Downloading: http://repo1.maven.org/maven2/org/apache/maven/plugins/maven-clean-plugin/2.4.1/maven-clean-plugin-2.4.1.pom
[INFO] ------------------------------------------------------------------------
[INFO] Building Apache Axis2 - Root 1.7.0-SNAPSHOT
[INFO] ------------------------------------------------------------------------
Downloaded: http://repo1.maven.org/maven2/org/apache/maven/plugins/maven-clean-plugin/2.4.1/maven-clean-plugin-2.4.1.pom (5 KB at 96.7 KB/sec)
Downloading: http://repo1.maven.org/maven2/org/apache/maven/plugins/maven-clean-plugin/2.4.1/maven-clean-plugin-2.4.1.jar
Downloaded: http://repo1.maven.org/maven2/org/apache/maven/plugins/maven-clean-plugin/2.4.1/maven-clean-plugin-2.4.1.jar (23 KB at 1916.4 KB/sec)
Downloading: http://repo1.maven.org/maven2/org/apache/maven/plugins/maven-assembly-plugin/2.2/maven-assembly-plugin-2.2.pom
Downloaded: http://repo1.maven.org/maven2/org/apache/maven/plugins/maven-assembly-plugin/2.2/maven-assembly-plugin-2.2.pom (17 KB at 2308.0 KB/sec)
Downloading: http://repo1.maven.org/maven2/org/apache/maven/plugins/maven-assembly-plugin/2.2/maven-assembly-plugin-2.2.jar
Downloaded: http://repo1.maven.org/maven2/org/apache/maven/plugins/maven-assembly-plugin/2.2/maven-assembly-plugin-2.2.jar (214 KB at 1270.7 KB/sec)
Downloading: http://repo1.maven.org/maven2/org/apache/maven/plugins/maven-install-plugin/2.3/maven-install-plugin-2.3.pom
Downloaded: http://repo1.maven.org/maven2/org/apache/maven/plugins/maven-install-plugin/2.3/maven-install-plugin-2.3.pom (5 KB at 288.2 KB/sec)
Downloading: http://repo1.maven.org/maven2/org/apache/maven/plugins/maven-install-plugin/2.3/maven-install-plugin-2.3.jar
Downloaded: http://repo1.maven.org/maven2/org/apache/maven/plugins/maven-install-plugin/2.3/maven-install-plugin-2.3.jar (23 KB at 3171.5 KB/sec)
mojoStarted org.apache.maven.plugins:maven-clean-plugin:2.4.1(default-clean)
[INFO]
[INFO] --- maven-clean-plugin:2.4.1:clean (default-clean) @ axis2 ---
mojoSucceeded org.apache.maven.plugins:maven-clean-plugin:2.4.1(default-clean)
mojoStarted org.apache.maven.plugins:maven-remote-resources-plugin:1.1(default)
[INFO]
[INFO] --- maven-remote-resources-plugin:1.1:process (default) @ axis2 ---
[INFO] Setting property: classpath.resource.loader.class => 'org.codehaus.plexus.velocity.ContextClassLoaderResourceLoader'.
[INFO] Setting property: velocimacro.messages.on => 'false'.
[INFO] Setting property: resource.loader => 'classpath'.
[INFO] Setting property: resource.manager.logwhenfound => 'false'.
mojoSucceeded org.apache.maven.plugins:maven-remote-resources-plugin:1.1(default)
mojoStarted org.apache.maven.plugins:maven-assembly-plugin:2.2(package-jar)Downloading: http://repo1.maven.org/maven2/org/apache/maven/maven-plugin-api/2.2.1/maven-plugin-api-2.2.1.pom
Downloaded: http://repo1.maven.org/maven2/org/apache/maven/maven-plugin-api/2.2.1/maven-plugin-api-2.2.1.pom (2 KB at 101.8 KB/sec)
Downloading: http://repo1.maven.org/maven2/org/apache/maven/maven/2.2.1/maven-2.2.1.pom
[INFO]
[INFO] --- maven-assembly-plugin:2.2:single (package-jar) @ axis2 ---
Downloaded: http://repo1.maven.org/maven2/org/apache/maven/maven/2.2.1/maven-2.2.1.pom (22 KB at 2188.4 KB/sec)
Downloading: http://repo1.maven.org/maven2/org/apache/maven/maven-core/2.2.1/maven-core-2.2.1.pom
Downloaded: http://repo1.maven.org/maven2/org/apache/maven/maven-core/2.2.1/maven-core-2.2.1.pom (12 KB at 1893.4 KB/sec)
Downloading: http://repo1.maven.org/maven2/org/apache/maven/maven-settings/2.2.1/maven-settings-2.2.1.pom
Downloaded: http://repo1.maven.org/maven2/org/apache/maven/maven-settings/2.2.1/maven-settings-2.2.1.pom (3 KB at 304.0 KB/sec)
Downloading: http://repo1.maven.org/maven2/org/apache/maven/maven-model/2.2.1/maven-model-2.2.1.pom
Downloaded: http://repo1.maven.org/maven2/org/apache/maven/maven-model/2.2.1/maven-model-2.2.1.pom (4 KB at 452.0 KB/sec)
Downloading: http://repo1.maven.org/maven2/org/codehaus/plexus/plexus-interpolation/1.11/plexus-interpolation-1.11.pom
Downloaded: http://repo1.maven.org/maven2/org/codehaus/plexus/plexus-interpolation/1.11/plexus-interpolation-1.11.pom (889 B at 144.7 KB/sec)
Downloading: http://repo1.maven.org/maven2/org/apache/maven/maven-plugin-parameter-documenter/2.2.1/maven-plugin-parameter-documenter-2.2.1.pom
Downloaded: http://repo1.maven.org/maven2/org/apache/maven/maven-plugin-parameter-documenter/2.2.1/maven-plugin-parameter-documenter-2.2.1.pom (2 KB at 318.5 KB/sec)
Downloading: http://repo1.maven.org/maven2/org/slf4j/slf4j-jdk14/1.5.6/slf4j-jdk14-1.5.6.pom
Downloaded: http://repo1.maven.org/maven2/org/slf4j/slf4j-jdk14/1.5.6/slf4j-jdk14-1.5.6.pom (2 KB at 84.3 KB/sec)
Downloading: http://repo1.maven.org/maven2/org/slf4j/slf4j-parent/1.5.6/slf4j-parent-1.5.6.pom
Downloaded: http://repo1.maven.org/maven2/org/slf4j/slf4j-parent/1.5.6/slf4j-parent-1.5.6.pom (8 KB at 1104.9 KB/sec)
Downloading: http://repo1.maven.org/maven2/org/slf4j/slf4j-api/1.5.6/slf4j-api-1.5.6.pom
Downloaded: http://repo1.maven.org/maven2/org/slf4j/slf4j-api/1.5.6/slf4j-api-1.5.6.pom (3 KB at 485.7 KB/sec)
Downloading: http://repo1.maven.org/maven2/org/slf4j/jcl-over-slf4j/1.5.6/jcl-over-slf4j-1.5.6.pom
Downloaded: http://repo1.maven.org/maven2/org/slf4j/jcl-over-slf4j/1.5.6/jcl-over-slf4j-1.5.6.pom (3 KB at 302.6 KB/sec)
Downloading: http://repo1.maven.org/maven2/org/apache/maven/reporting/maven-reporting-api/2.2.1/maven-reporting-api-2.2.1.pom
Downloaded: http://repo1.maven.org/maven2/org/apache/maven/reporting/maven-reporting-api/2.2.1/maven-reporting-api-2.2.1.pom (2 KB at 258.4 KB/sec)
Downloading: http://repo1.maven.org/maven2/org/apache/maven/reporting/maven-reporting/2.2.1/maven-reporting-2.2.1.pom
Downloaded: http://repo1.maven.org/maven2/org/apache/maven/reporting/maven-reporting/2.2.1/maven-reporting-2.2.1.pom (2 KB at 234.9 KB/sec)
Downloading: http://repo1.maven.org/maven2/org/apache/maven/doxia/doxia-sink-api/1.1/doxia-sink-api-1.1.pom
Downloaded: http://repo1.maven.org/maven2/org/apache/maven/doxia/doxia-sink-api/1.1/doxia-sink-api-1.1.pom (2 KB at 331.9 KB/sec)
Downloading: http://repo1.maven.org/maven2/org/apache/maven/doxia/doxia/1.1/doxia-1.1.pom
Downloaded: http://repo1.maven.org/maven2/org/apache/maven/doxia/doxia/1.1/doxia-1.1.pom (15 KB at 644.4 KB/sec)
Downloading: http://repo1.maven.org/maven2/org/apache/maven/doxia/doxia-logging-api/1.1/doxia-logging-api-1.1.pom
Downloaded: http://repo1.maven.org/maven2/org/apache/maven/doxia/doxia-logging-api/1.1/doxia-logging-api-1.1.pom (2 KB at 192.3 KB/sec)
Downloading: http://repo1.maven.org/maven2/org/codehaus/plexus/plexus-utils/1.4.5/plexus-utils-1.4.5.pom
Downloaded: http://repo1.maven.org/maven2/org/codehaus/plexus/plexus-utils/1.4.5/plexus-utils-1.4.5.pom (3 KB at 368.7 KB/sec)
Downloading: http://repo1.maven.org/maven2/org/apache/maven/maven-profile/2.2.1/maven-profile-2.2.1.pom
Downloaded: http://repo1.maven.org/maven2/org/apache/maven/maven-profile/2.2.1/maven-profile-2.2.1.pom (3 KB at 353.4 KB/sec)
Downloading: http://repo1.maven.org/maven2/org/apache/maven/maven-artifact/2.2.1/maven-artifact-2.2.1.pom
Downloaded: http://repo1.maven.org/maven2/org/apache/maven/maven-artifact/2.2.1/maven-artifact-2.2.1.pom (2 KB at 308.8 KB/sec)
Downloading: http://repo1.maven.org/maven2/org/apache/maven/maven-repository-metadata/2.2.1/maven-repository-metadata-2.2.1.pom
Downloaded: http://repo1.maven.org/maven2/org/apache/maven/maven-repository-metadata/2.2.1/maven-repository-metadata-2.2.1.pom (2 KB at 304.5 KB/sec)
Downloading: http://repo1.maven.org/maven2/org/apache/maven/maven-error-diagnostics/2.2.1/maven-error-diagnostics-2.2.1.pom
Downloaded: http://repo1.maven.org/maven2/org/apache/maven/maven-error-diagnostics/2.2.1/maven-error-diagnostics-2.2.1.pom (2 KB at 238.3 KB/sec)
Downloading: http://repo1.maven.org/maven2/org/apache/maven/maven-project/2.2.1/maven-project-2.2.1.pom
Downloaded: http://repo1.maven.org/maven2/org/apache/maven/maven-project/2.2.1/maven-project-2.2.1.pom (3 KB at 451.3 KB/sec)
Downloading: http://repo1.maven.org/maven2/org/apache/maven/maven-artifact-manager/2.2.1/maven-artifact-manager-2.2.1.pom
Downloaded: http://repo1.maven.org/maven2/org/apache/maven/maven-artifact-manager/2.2.1/maven-artifact-manager-2.2.1.pom (4 KB at 216.4 KB/sec)
Downloading: http://repo1.maven.org/maven2/backport-util-concurrent/backport-util-concurrent/3.1/backport-util-concurrent-3.1.pom
Downloaded: http://repo1.maven.org/maven2/backport-util-concurrent/backport-util-concurrent/3.1/backport-util-concurrent-3.1.pom (880 B at 143.2 KB/sec)
Downloading: http://repo1.maven.org/maven2/org/apache/maven/maven-plugin-registry/2.2.1/maven-plugin-registry-2.2.1.pom
Downloaded: http://repo1.maven.org/maven2/org/apache/maven/maven-plugin-registry/2.2.1/maven-plugin-registry-2.2.1.pom (2 KB at 269.1 KB/sec)
Downloading: http://repo1.maven.org/maven2/org/apache/maven/maven-plugin-descriptor/2.2.1/maven-plugin-descriptor-2.2.1.pom
Downloaded: http://repo1.maven.org/maven2/org/apache/maven/maven-plugin-descriptor/2.2.1/maven-plugin-descriptor-2.2.1.pom (3 KB at 335.9 KB/sec)
Downloading: http://repo1.maven.org/maven2/org/apache/maven/maven-monitor/2.2.1/maven-monitor-2.2.1.pom
Downloaded: http://repo1.maven.org/maven2/org/apache/maven/maven-monitor/2.2.1/maven-monitor-2.2.1.pom (2 KB at 204.6 KB/sec)
Downloading: http://repo1.maven.org/maven2/org/sonatype/plexus/plexus-sec-dispatcher/1.3/plexus-sec-dispatcher-1.3.pom
Downloaded: http://repo1.maven.org/maven2/org/sonatype/plexus/plexus-sec-dispatcher/1.3/plexus-sec-dispatcher-1.3.pom (3 KB at 481.9 KB/sec)
Downloading: http://repo1.maven.org/maven2/org/sonatype/spice/spice-parent/12/spice-parent-12.pom
Downloaded: http://repo1.maven.org/maven2/org/sonatype/spice/spice-parent/12/spice-parent-12.pom (7 KB at 1106.4 KB/sec)
Downloading: http://repo1.maven.org/maven2/org/sonatype/forge/forge-parent/4/forge-parent-4.pom
Downloaded: http://repo1.maven.org/maven2/org/sonatype/forge/forge-parent/4/forge-parent-4.pom (9 KB at 1366.7 KB/sec)
Downloading: http://repo1.maven.org/maven2/org/sonatype/plexus/plexus-cipher/1.4/plexus-cipher-1.4.pom
Downloaded: http://repo1.maven.org/maven2/org/sonatype/plexus/plexus-cipher/1.4/plexus-cipher-1.4.pom (3 KB at 336.1 KB/sec)
Downloading: http://repo1.maven.org/maven2/org/apache/maven/shared/maven-common-artifact-filters/1.3/maven-common-artifact-filters-1.3.pom
Downloaded: http://repo1.maven.org/maven2/org/apache/maven/shared/maven-common-artifact-filters/1.3/maven-common-artifact-filters-1.3.pom (4 KB at 172.2 KB/sec)
Downloading: http://repo1.maven.org/maven2/org/codehaus/plexus/plexus-archiver/1.1/plexus-archiver-1.1.pom
Downloaded: http://repo1.maven.org/maven2/org/codehaus/plexus/plexus-archiver/1.1/plexus-archiver-1.1.pom (2 KB at 30.2 KB/sec)
Downloading: http://repo1.maven.org/maven2/org/codehaus/plexus/plexus-components/1.1.18/plexus-components-1.1.18.pom
Downloaded: http://repo1.maven.org/maven2/org/codehaus/plexus/plexus-components/1.1.18/plexus-components-1.1.18.pom (6 KB at 145.3 KB/sec)
Downloading: http://repo1.maven.org/maven2/org/codehaus/plexus/plexus-io/1.0.1/plexus-io-1.0.1.pom
Downloaded: http://repo1.maven.org/maven2/org/codehaus/plexus/plexus-io/1.0.1/plexus-io-1.0.1.pom (2 KB at 44.7 KB/sec)
Downloading: http://repo1.maven.org/maven2/org/apache/maven/maven-archiver/2.4.1/maven-archiver-2.4.1.pom
Downloaded: http://repo1.maven.org/maven2/org/apache/maven/maven-archiver/2.4.1/maven-archiver-2.4.1.pom (4 KB at 551.5 KB/sec)
Downloading: http://repo1.maven.org/maven2/org/codehaus/plexus/plexus-archiver/1.0/plexus-archiver-1.0.pom
Downloaded: http://repo1.maven.org/maven2/org/codehaus/plexus/plexus-archiver/1.0/plexus-archiver-1.0.pom (2 KB at 5.4 KB/sec)
Downloading: http://repo1.maven.org/maven2/org/codehaus/plexus/plexus-io/1.0/plexus-io-1.0.pom
Downloaded: http://repo1.maven.org/maven2/org/codehaus/plexus/plexus-io/1.0/plexus-io-1.0.pom (2 KB at 199.9 KB/sec)
Downloading: http://repo1.maven.org/maven2/org/slf4j/slf4j-jdk14/1.5.6/slf4j-jdk14-1.5.6.jar
Downloading: http://repo1.maven.org/maven2/org/slf4j/slf4j-api/1.5.6/slf4j-api-1.5.6.jar
Downloading: http://repo1.maven.org/maven2/org/apache/maven/reporting/maven-reporting-api/2.2.1/maven-reporting-api-2.2.1.jar
Downloading: http://repo1.maven.org/maven2/org/slf4j/jcl-over-slf4j/1.5.6/jcl-over-slf4j-1.5.6.jar
Downloading: http://repo1.maven.org/maven2/org/apache/maven/doxia/doxia-sink-api/1.1/doxia-sink-api-1.1.jar
Downloaded: http://repo1.maven.org/maven2/org/slf4j/slf4j-jdk14/1.5.6/slf4j-jdk14-1.5.6.jar (9 KB at 1229.8 KB/sec)
Downloading: http://repo1.maven.org/maven2/org/apache/maven/doxia/doxia-logging-api/1.1/doxia-logging-api-1.1.jar
Downloaded: http://repo1.maven.org/maven2/org/apache/maven/reporting/maven-reporting-api/2.2.1/maven-reporting-api-2.2.1.jar (10 KB at 796.5 KB/sec)
Downloading: http://repo1.maven.org/maven2/backport-util-concurrent/backport-util-concurrent/3.1/backport-util-concurrent-3.1.jar
Downloaded: http://repo1.maven.org/maven2/org/apache/maven/doxia/doxia-sink-api/1.1/doxia-sink-api-1.1.jar (13 KB at 962.7 KB/sec)
Downloading: http://repo1.maven.org/maven2/org/sonatype/plexus/plexus-sec-dispatcher/1.3/plexus-sec-dispatcher-1.3.jar
Downloaded: http://repo1.maven.org/maven2/org/apache/maven/doxia/doxia-logging-api/1.1/doxia-logging-api-1.1.jar (12 KB at 1230.0 KB/sec)
Downloading: http://repo1.maven.org/maven2/org/sonatype/plexus/plexus-cipher/1.4/plexus-cipher-1.4.jar
Downloaded: http://repo1.maven.org/maven2/org/slf4j/jcl-over-slf4j/1.5.6/jcl-over-slf4j-1.5.6.jar (17 KB at 1020.6 KB/sec)
Downloading: http://repo1.maven.org/maven2/org/apache/maven/shared/maven-common-artifact-filters/1.3/maven-common-artifact-filters-1.3.jar
Downloaded: http://repo1.maven.org/maven2/org/sonatype/plexus/plexus-cipher/1.4/plexus-cipher-1.4.jar (14 KB at 2196.3 KB/sec)
Downloading: http://repo1.maven.org/maven2/org/codehaus/plexus/plexus-archiver/1.1/plexus-archiver-1.1.jar
Downloaded: http://repo1.maven.org/maven2/org/sonatype/plexus/plexus-sec-dispatcher/1.3/plexus-sec-dispatcher-1.3.jar (28 KB at 3098.4 KB/sec)
Downloading: http://repo1.maven.org/maven2/org/codehaus/plexus/plexus-io/1.0.1/plexus-io-1.0.1.jar
Downloaded: http://repo1.maven.org/maven2/org/apache/maven/shared/maven-common-artifact-filters/1.3/maven-common-artifact-filters-1.3.jar (31 KB at 3370.1 KB/sec)
Downloading: http://repo1.maven.org/maven2/org/apache/maven/maven-archiver/2.4.1/maven-archiver-2.4.1.jar
Downloaded: http://repo1.maven.org/maven2/org/apache/maven/maven-archiver/2.4.1/maven-archiver-2.4.1.jar (20 KB at 2180.7 KB/sec)
Downloaded: http://repo1.maven.org/maven2/org/codehaus/plexus/plexus-archiver/1.1/plexus-archiver-1.1.jar (178 KB at 11840.2 KB/sec)
Downloaded: http://repo1.maven.org/maven2/org/codehaus/plexus/plexus-io/1.0.1/plexus-io-1.0.1.jar (50 KB at 3548.1 KB/sec)
Downloaded: http://repo1.maven.org/maven2/org/slf4j/slf4j-api/1.5.6/slf4j-api-1.5.6.jar (22 KB at 519.4 KB/sec)
Downloaded: http://repo1.maven.org/maven2/backport-util-concurrent/backport-util-concurrent/3.1/backport-util-concurrent-3.1.jar (324 KB at 11170.4 KB/sec)
[INFO] Reading assembly descriptor: src/main/assembly/jar.xml
[WARNING] NOTE: Currently, inclusion of module dependencies may produce unpredictable results if a version conflict occurs.
[WARNING] NOTE: Currently, inclusion of module dependencies may produce unpredictable results if a version conflict occurs.
[INFO] org/ already added, skipping
[INFO] org/apache/ already added, skipping
[INFO] org/apache/axis2/ already added, skipping
[INFO] org/apache/axis2/transport/ already added, skipping
[INFO] org/ already added, skipping
[INFO] org/apache/ already added, skipping
[INFO] org/apache/axis2/ already added, skipping
[INFO] org/apache/axis2/wsdl/ already added, skipping
[INFO] org/apache/axis2/wsdl/util/ already added, skipping
[INFO] org/ already added, skipping
[INFO] org/apache/ already added, skipping
[INFO] org/apache/axis2/ already added, skipping
[INFO] org/ already added, skipping
[INFO] org/apache/ already added, skipping
[INFO] org/ already added, skipping
[INFO] org/apache/ already added, skipping
[INFO] org/apache/axis2/ already added, skipping
[INFO] org/apache/axis2/clustering/ already added, skipping
[INFO] org/apache/axis2/clustering/management/ already added, skipping
[INFO] org/apache/axis2/clustering/state/ already added, skipping
[INFO] org/ already added, skipping
[INFO] org/apache/ already added, skipping
[INFO] org/apache/axis2/ already added, skipping
[INFO] org/ already added, skipping
[INFO] org/apache/ already added, skipping
[INFO] org/apache/axis2/ already added, skipping
[INFO] org/apache/axis2/handlers/ already added, skipping
[INFO] Building jar: <https://builds.apache.org/job/Axis2-trunk-java-1.6/ws/axis2/target/axis2-1.7.0-SNAPSHOT.jar>
Jul 12, 2012 2:08:29 AM hudson.remoting.SynchronousCommandTransport$ReaderThread run
SEVERE: Unexpected error in channel channel
java.lang.OutOfMemoryError: PermGen space
channel stopped
Exception in thread "Channel reader thread: channel" java.lang.OutOfMemoryError: PermGen space
[locks-and-latches] Releasing all the locks
[locks-and-latches] All the locks released
ERROR: Maven JVM terminated unexpectedly with exit code 0
---------------------------------------------------------------------
To unsubscribe, e-mail: java-dev-unsubscribe@axis.apache.org
For additional commands, e-mail: java-dev-help@axis.apache.org
Build failed in Jenkins: Axis2-trunk-java-1.6 #1012
Posted by Apache Jenkins Server <je...@builds.apache.org>.
See <https://builds.apache.org/job/Axis2-trunk-java-1.6/1012/changes>
Changes:
[veithen] Fixed build failure.
------------------------------------------
[...truncated 6638 lines...]
mojoStarted org.apache.maven.plugins:maven-antrun-plugin:1.2(default)[INFO] Executing tasks
[delete] Deleting directory <https://builds.apache.org/job/Axis2-trunk-java-1.6/ws/axis2/modules/webapp/target/classes/jsp>
[INFO] Executed tasks
[INFO]
[INFO] --- maven-antrun-plugin:1.2:run (default) @ axis2-webapp ---
mojoSucceeded org.apache.maven.plugins:maven-antrun-plugin:1.2(default)
mojoStarted org.apache.maven.plugins:maven-resources-plugin:2.4.2(default-testResources)[INFO] Using 'UTF-8' encoding to copy filtered resources.
[INFO] skip non existing resourceDirectory <https://builds.apache.org/job/Axis2-trunk-java-1.6/ws/axis2/modules/webapp/src/test/resources>
[INFO] Copying 2 resources
[INFO]
[INFO] --- maven-resources-plugin:2.4.2:testResources (default-testResources) @ axis2-webapp ---
mojoSucceeded org.apache.maven.plugins:maven-resources-plugin:2.4.2(default-testResources)
mojoStarted org.apache.maven.plugins:maven-compiler-plugin:2.3.1(default-testCompile)[INFO] No sources to compile
[INFO]
[INFO] --- maven-compiler-plugin:2.3.1:testCompile (default-testCompile) @ axis2-webapp ---
mojoSucceeded org.apache.maven.plugins:maven-compiler-plugin:2.3.1(default-testCompile)
mojoStarted org.apache.maven.plugins:maven-surefire-plugin:2.4.3(default-test)[INFO] Surefire report directory: <https://builds.apache.org/job/Axis2-trunk-java-1.6/ws/axis2/modules/webapp/target/surefire-reports>
[INFO]
[INFO] --- maven-surefire-plugin:2.4.3:test (default-test) @ axis2-webapp ---
-------------------------------------------------------
T E S T S
-------------------------------------------------------
There are no tests to run.
Results :
Tests run: 0, Failures: 0, Errors: 0, Skipped: 0
mojoSucceeded org.apache.maven.plugins:maven-surefire-plugin:2.4.3(default-test)
[JENKINS] Recording test results
mojoStarted org.apache.maven.plugins:maven-war-plugin:2.1-beta-1(default-war)
[INFO] Downloading: http://repo1.maven.org/maven2/com/thoughtworks/xstream/xstream/1.3.1/xstream-1.3.1.pom
Downloaded: http://repo1.maven.org/maven2/com/thoughtworks/xstream/xstream/1.3.1/xstream-1.3.1.pom (12 KB at 1015.0 KB/sec)
Downloading: http://repo1.maven.org/maven2/com/thoughtworks/xstream/xstream-parent/1.3.1/xstream-parent-1.3.1.pom
Downloaded: http://repo1.maven.org/maven2/com/thoughtworks/xstream/xstream-parent/1.3.1/xstream-parent-1.3.1.pom (14 KB at 1241.9 KB/sec)
Downloading: http://repo1.maven.org/maven2/xpp3/xpp3_min/1.1.4c/xpp3_min-1.1.4c.pom
[INFO] --- maven-war-plugin:2.1-beta-1:war (default-war) @ axis2-webapp ---
Downloaded: http://repo1.maven.org/maven2/xpp3/xpp3_min/1.1.4c/xpp3_min-1.1.4c.pom (2 KB at 262.0 KB/sec)
Downloading: http://repo1.maven.org/maven2/org/codehaus/plexus/plexus-interpolation/1.6/plexus-interpolation-1.6.jar
Downloading: http://repo1.maven.org/maven2/com/thoughtworks/xstream/xstream/1.3.1/xstream-1.3.1.jar
Downloading: http://repo1.maven.org/maven2/xpp3/xpp3_min/1.1.4c/xpp3_min-1.1.4c.jar
Downloaded: http://repo1.maven.org/maven2/org/codehaus/plexus/plexus-interpolation/1.6/plexus-interpolation-1.6.jar (50 KB at 4528.4 KB/sec)
Downloaded: http://repo1.maven.org/maven2/xpp3/xpp3_min/1.1.4c/xpp3_min-1.1.4c.jar (25 KB at 2215.6 KB/sec)
Downloaded: http://repo1.maven.org/maven2/com/thoughtworks/xstream/xstream/1.3.1/xstream-1.3.1.jar (422 KB at 16851.8 KB/sec)
[INFO] Packaging webapp
[INFO] Assembling webapp[axis2-webapp] in [<https://builds.apache.org/job/Axis2-trunk-java-1.6/ws/axis2/modules/webapp/target/axis2-1.7.0-SNAPSHOT]>
[INFO] Processing war project
[INFO] Copying webapp webResources[<https://builds.apache.org/job/Axis2-trunk-java-1.6/ws/axis2/modules/webapp/target/webResources]> to[<https://builds.apache.org/job/Axis2-trunk-java-1.6/ws/axis2/modules/webapp/target/axis2-1.7.0-SNAPSHOT]>
[INFO] Copying webapp webResources[<https://builds.apache.org/job/Axis2-trunk-java-1.6/ws/axis2/modules/webapp/../../legal]> to[<https://builds.apache.org/job/Axis2-trunk-java-1.6/ws/axis2/modules/webapp/target/axis2-1.7.0-SNAPSHOT]>
[INFO] Copying webapp resources[<https://builds.apache.org/job/Axis2-trunk-java-1.6/ws/axis2/modules/webapp/src/main/webapp]>
[INFO] Webapp assembled in [368 msecs]
[INFO] Building war: <https://builds.apache.org/job/Axis2-trunk-java-1.6/ws/axis2/modules/webapp/target/axis2.war>
mojoSucceeded org.apache.maven.plugins:maven-war-plugin:2.1-beta-1(default-war)
mojoStarted org.apache.maven.plugins:maven-install-plugin:2.2(default-install)[INFO] Installing <https://builds.apache.org/job/Axis2-trunk-java-1.6/ws/axis2/modules/webapp/target/axis2.war> to <https://builds.apache.org/job/Axis2-trunk-java-1.6/ws/.repository/org/apache/axis2/axis2-webapp/1.7.0-SNAPSHOT/axis2-webapp-1.7.0-SNAPSHOT.war>
[INFO] Installing <https://builds.apache.org/job/Axis2-trunk-java-1.6/ws/axis2/modules/webapp/pom.xml> to <https://builds.apache.org/job/Axis2-trunk-java-1.6/ws/.repository/org/apache/axis2/axis2-webapp/1.7.0-SNAPSHOT/axis2-webapp-1.7.0-SNAPSHOT.pom>
[INFO]
[INFO] --- maven-install-plugin:2.2:install (default-install) @ axis2-webapp ---
mojoSucceeded org.apache.maven.plugins:maven-install-plugin:2.2(default-install)
projectSucceeded org.apache.axis2:axis2-webapp:1.7.0-SNAPSHOT
projectStarted org.apache.axis2:axis2:1.7.0-SNAPSHOT
[INFO] Downloading: http://repo1.maven.org/maven2/org/apache/maven/plugins/maven-clean-plugin/2.4.1/maven-clean-plugin-2.4.1.pom
Downloaded: http://repo1.maven.org/maven2/org/apache/maven/plugins/maven-clean-plugin/2.4.1/maven-clean-plugin-2.4.1.pom (5 KB at 203.0 KB/sec)
Downloading: http://repo1.maven.org/maven2/org/apache/maven/plugins/maven-clean-plugin/2.4.1/maven-clean-plugin-2.4.1.jar
Downloaded: http://repo1.maven.org/maven2/org/apache/maven/plugins/maven-clean-plugin/2.4.1/maven-clean-plugin-2.4.1.jar (23 KB at 2874.6 KB/sec)
Downloading: http://repo1.maven.org/maven2/org/apache/maven/plugins/maven-assembly-plugin/2.2/maven-assembly-plugin-2.2.pom
Downloaded: http://repo1.maven.org/maven2/org/apache/maven/plugins/maven-assembly-plugin/2.2/maven-assembly-plugin-2.2.pom (17 KB at 2692.7 KB/sec)
Downloading: http://repo1.maven.org/maven2/org/apache/maven/plugins/maven-assembly-plugin/2.2/maven-assembly-plugin-2.2.jar
[INFO] ------------------------------------------------------------------------
[INFO] Building Apache Axis2 - Root 1.7.0-SNAPSHOT
[INFO] ------------------------------------------------------------------------
Downloaded: http://repo1.maven.org/maven2/org/apache/maven/plugins/maven-assembly-plugin/2.2/maven-assembly-plugin-2.2.jar (214 KB at 3234.5 KB/sec)
Downloading: http://repo1.maven.org/maven2/org/apache/maven/plugins/maven-install-plugin/2.3/maven-install-plugin-2.3.pom
Downloaded: http://repo1.maven.org/maven2/org/apache/maven/plugins/maven-install-plugin/2.3/maven-install-plugin-2.3.pom (5 KB at 816.6 KB/sec)
Downloading: http://repo1.maven.org/maven2/org/apache/maven/plugins/maven-install-plugin/2.3/maven-install-plugin-2.3.jar
Downloaded: http://repo1.maven.org/maven2/org/apache/maven/plugins/maven-install-plugin/2.3/maven-install-plugin-2.3.jar (23 KB at 3700.0 KB/sec)
mojoStarted org.apache.maven.plugins:maven-clean-plugin:2.4.1(default-clean)
[INFO]
[INFO] --- maven-clean-plugin:2.4.1:clean (default-clean) @ axis2 ---
mojoSucceeded org.apache.maven.plugins:maven-clean-plugin:2.4.1(default-clean)
mojoStarted org.apache.maven.plugins:maven-remote-resources-plugin:1.1(default)
[INFO]
[INFO] --- maven-remote-resources-plugin:1.1:process (default) @ axis2 ---
[INFO] Setting property: classpath.resource.loader.class => 'org.codehaus.plexus.velocity.ContextClassLoaderResourceLoader'.
[INFO] Setting property: velocimacro.messages.on => 'false'.
[INFO] Setting property: resource.loader => 'classpath'.
[INFO] Setting property: resource.manager.logwhenfound => 'false'.
mojoSucceeded org.apache.maven.plugins:maven-remote-resources-plugin:1.1(default)
mojoStarted org.apache.maven.plugins:maven-assembly-plugin:2.2(package-jar)Downloading: http://repo1.maven.org/maven2/org/apache/maven/maven-plugin-api/2.2.1/maven-plugin-api-2.2.1.pom
Downloaded: http://repo1.maven.org/maven2/org/apache/maven/maven-plugin-api/2.2.1/maven-plugin-api-2.2.1.pom (2 KB at 237.5 KB/sec)
Downloading: http://repo1.maven.org/maven2/org/apache/maven/maven/2.2.1/maven-2.2.1.pom
Downloaded: http://repo1.maven.org/maven2/org/apache/maven/maven/2.2.1/maven-2.2.1.pom (22 KB at 683.9 KB/sec)
Downloading: http://repo1.maven.org/maven2/org/apache/maven/maven-core/2.2.1/maven-core-2.2.1.pom
Downloaded: http://repo1.maven.org/maven2/org/apache/maven/maven-core/2.2.1/maven-core-2.2.1.pom (12 KB at 1622.9 KB/sec)
Downloading: http://repo1.maven.org/maven2/org/apache/maven/maven-settings/2.2.1/maven-settings-2.2.1.pom
[INFO]
[INFO] --- maven-assembly-plugin:2.2:single (package-jar) @ axis2 ---
Downloaded: http://repo1.maven.org/maven2/org/apache/maven/maven-settings/2.2.1/maven-settings-2.2.1.pom (3 KB at 266.0 KB/sec)
Downloading: http://repo1.maven.org/maven2/org/apache/maven/maven-model/2.2.1/maven-model-2.2.1.pom
Downloaded: http://repo1.maven.org/maven2/org/apache/maven/maven-model/2.2.1/maven-model-2.2.1.pom (4 KB at 527.3 KB/sec)
Downloading: http://repo1.maven.org/maven2/org/codehaus/plexus/plexus-interpolation/1.11/plexus-interpolation-1.11.pom
Downloaded: http://repo1.maven.org/maven2/org/codehaus/plexus/plexus-interpolation/1.11/plexus-interpolation-1.11.pom (889 B at 144.7 KB/sec)
Downloading: http://repo1.maven.org/maven2/org/apache/maven/maven-plugin-parameter-documenter/2.2.1/maven-plugin-parameter-documenter-2.2.1.pom
Downloaded: http://repo1.maven.org/maven2/org/apache/maven/maven-plugin-parameter-documenter/2.2.1/maven-plugin-parameter-documenter-2.2.1.pom (2 KB at 318.5 KB/sec)
Downloading: http://repo1.maven.org/maven2/org/slf4j/slf4j-jdk14/1.5.6/slf4j-jdk14-1.5.6.pom
Downloaded: http://repo1.maven.org/maven2/org/slf4j/slf4j-jdk14/1.5.6/slf4j-jdk14-1.5.6.pom (2 KB at 308.9 KB/sec)
Downloading: http://repo1.maven.org/maven2/org/slf4j/slf4j-parent/1.5.6/slf4j-parent-1.5.6.pom
Downloaded: http://repo1.maven.org/maven2/org/slf4j/slf4j-parent/1.5.6/slf4j-parent-1.5.6.pom (8 KB at 1289.1 KB/sec)
Downloading: http://repo1.maven.org/maven2/org/slf4j/slf4j-api/1.5.6/slf4j-api-1.5.6.pom
Downloaded: http://repo1.maven.org/maven2/org/slf4j/slf4j-api/1.5.6/slf4j-api-1.5.6.pom (3 KB at 485.7 KB/sec)
Downloading: http://repo1.maven.org/maven2/org/slf4j/jcl-over-slf4j/1.5.6/jcl-over-slf4j-1.5.6.pom
Downloaded: http://repo1.maven.org/maven2/org/slf4j/jcl-over-slf4j/1.5.6/jcl-over-slf4j-1.5.6.pom (3 KB at 302.6 KB/sec)
Downloading: http://repo1.maven.org/maven2/org/apache/maven/reporting/maven-reporting-api/2.2.1/maven-reporting-api-2.2.1.pom
Downloaded: http://repo1.maven.org/maven2/org/apache/maven/reporting/maven-reporting-api/2.2.1/maven-reporting-api-2.2.1.pom (2 KB at 258.4 KB/sec)
Downloading: http://repo1.maven.org/maven2/org/apache/maven/reporting/maven-reporting/2.2.1/maven-reporting-2.2.1.pom
Downloaded: http://repo1.maven.org/maven2/org/apache/maven/reporting/maven-reporting/2.2.1/maven-reporting-2.2.1.pom (2 KB at 234.9 KB/sec)
Downloading: http://repo1.maven.org/maven2/org/apache/maven/doxia/doxia-sink-api/1.1/doxia-sink-api-1.1.pom
Downloaded: http://repo1.maven.org/maven2/org/apache/maven/doxia/doxia-sink-api/1.1/doxia-sink-api-1.1.pom (2 KB at 331.9 KB/sec)
Downloading: http://repo1.maven.org/maven2/org/apache/maven/doxia/doxia/1.1/doxia-1.1.pom
Downloaded: http://repo1.maven.org/maven2/org/apache/maven/doxia/doxia/1.1/doxia-1.1.pom (15 KB at 2117.5 KB/sec)
Downloading: http://repo1.maven.org/maven2/org/apache/maven/doxia/doxia-logging-api/1.1/doxia-logging-api-1.1.pom
Downloaded: http://repo1.maven.org/maven2/org/apache/maven/doxia/doxia-logging-api/1.1/doxia-logging-api-1.1.pom (2 KB at 256.3 KB/sec)
Downloading: http://repo1.maven.org/maven2/org/codehaus/plexus/plexus-utils/1.4.5/plexus-utils-1.4.5.pom
Downloaded: http://repo1.maven.org/maven2/org/codehaus/plexus/plexus-utils/1.4.5/plexus-utils-1.4.5.pom (3 KB at 368.7 KB/sec)
Downloading: http://repo1.maven.org/maven2/org/apache/maven/maven-profile/2.2.1/maven-profile-2.2.1.pom
Downloaded: http://repo1.maven.org/maven2/org/apache/maven/maven-profile/2.2.1/maven-profile-2.2.1.pom (3 KB at 353.4 KB/sec)
Downloading: http://repo1.maven.org/maven2/org/apache/maven/maven-artifact/2.2.1/maven-artifact-2.2.1.pom
Downloaded: http://repo1.maven.org/maven2/org/apache/maven/maven-artifact/2.2.1/maven-artifact-2.2.1.pom (2 KB at 257.3 KB/sec)
Downloading: http://repo1.maven.org/maven2/org/apache/maven/maven-repository-metadata/2.2.1/maven-repository-metadata-2.2.1.pom
Downloaded: http://repo1.maven.org/maven2/org/apache/maven/maven-repository-metadata/2.2.1/maven-repository-metadata-2.2.1.pom (2 KB at 261.0 KB/sec)
Downloading: http://repo1.maven.org/maven2/org/apache/maven/maven-error-diagnostics/2.2.1/maven-error-diagnostics-2.2.1.pom
Downloaded: http://repo1.maven.org/maven2/org/apache/maven/maven-error-diagnostics/2.2.1/maven-error-diagnostics-2.2.1.pom (2 KB at 278.0 KB/sec)
Downloading: http://repo1.maven.org/maven2/org/apache/maven/maven-project/2.2.1/maven-project-2.2.1.pom
Downloaded: http://repo1.maven.org/maven2/org/apache/maven/maven-project/2.2.1/maven-project-2.2.1.pom (3 KB at 451.3 KB/sec)
Downloading: http://repo1.maven.org/maven2/org/apache/maven/maven-artifact-manager/2.2.1/maven-artifact-manager-2.2.1.pom
Downloaded: http://repo1.maven.org/maven2/org/apache/maven/maven-artifact-manager/2.2.1/maven-artifact-manager-2.2.1.pom (4 KB at 432.9 KB/sec)
Downloading: http://repo1.maven.org/maven2/backport-util-concurrent/backport-util-concurrent/3.1/backport-util-concurrent-3.1.pom
Downloaded: http://repo1.maven.org/maven2/backport-util-concurrent/backport-util-concurrent/3.1/backport-util-concurrent-3.1.pom (880 B at 143.2 KB/sec)
Downloading: http://repo1.maven.org/maven2/org/apache/maven/maven-plugin-registry/2.2.1/maven-plugin-registry-2.2.1.pom
Downloaded: http://repo1.maven.org/maven2/org/apache/maven/maven-plugin-registry/2.2.1/maven-plugin-registry-2.2.1.pom (2 KB at 376.8 KB/sec)
Downloading: http://repo1.maven.org/maven2/org/apache/maven/maven-plugin-descriptor/2.2.1/maven-plugin-descriptor-2.2.1.pom
Downloaded: http://repo1.maven.org/maven2/org/apache/maven/maven-plugin-descriptor/2.2.1/maven-plugin-descriptor-2.2.1.pom (3 KB at 403.1 KB/sec)
Downloading: http://repo1.maven.org/maven2/org/apache/maven/maven-monitor/2.2.1/maven-monitor-2.2.1.pom
Downloaded: http://repo1.maven.org/maven2/org/apache/maven/maven-monitor/2.2.1/maven-monitor-2.2.1.pom (2 KB at 204.6 KB/sec)
Downloading: http://repo1.maven.org/maven2/org/sonatype/plexus/plexus-sec-dispatcher/1.3/plexus-sec-dispatcher-1.3.pom
Downloaded: http://repo1.maven.org/maven2/org/sonatype/plexus/plexus-sec-dispatcher/1.3/plexus-sec-dispatcher-1.3.pom (3 KB at 481.9 KB/sec)
Downloading: http://repo1.maven.org/maven2/org/sonatype/spice/spice-parent/12/spice-parent-12.pom
Downloaded: http://repo1.maven.org/maven2/org/sonatype/spice/spice-parent/12/spice-parent-12.pom (7 KB at 1106.4 KB/sec)
Downloading: http://repo1.maven.org/maven2/org/sonatype/forge/forge-parent/4/forge-parent-4.pom
Downloaded: http://repo1.maven.org/maven2/org/sonatype/forge/forge-parent/4/forge-parent-4.pom (9 KB at 455.6 KB/sec)
Downloading: http://repo1.maven.org/maven2/org/sonatype/plexus/plexus-cipher/1.4/plexus-cipher-1.4.pom
Downloaded: http://repo1.maven.org/maven2/org/sonatype/plexus/plexus-cipher/1.4/plexus-cipher-1.4.pom (3 KB at 168.1 KB/sec)
Downloading: http://repo1.maven.org/maven2/org/apache/maven/shared/maven-common-artifact-filters/1.3/maven-common-artifact-filters-1.3.pom
Downloaded: http://repo1.maven.org/maven2/org/apache/maven/shared/maven-common-artifact-filters/1.3/maven-common-artifact-filters-1.3.pom (4 KB at 328.7 KB/sec)
Downloading: http://repo1.maven.org/maven2/org/codehaus/plexus/plexus-archiver/1.1/plexus-archiver-1.1.pom
Downloaded: http://repo1.maven.org/maven2/org/codehaus/plexus/plexus-archiver/1.1/plexus-archiver-1.1.pom (2 KB at 332.5 KB/sec)
Downloading: http://repo1.maven.org/maven2/org/codehaus/plexus/plexus-components/1.1.18/plexus-components-1.1.18.pom
Downloaded: http://repo1.maven.org/maven2/org/codehaus/plexus/plexus-components/1.1.18/plexus-components-1.1.18.pom (6 KB at 186.8 KB/sec)
Downloading: http://repo1.maven.org/maven2/org/codehaus/plexus/plexus-io/1.0.1/plexus-io-1.0.1.pom
Downloaded: http://repo1.maven.org/maven2/org/codehaus/plexus/plexus-io/1.0.1/plexus-io-1.0.1.pom (2 KB at 172.4 KB/sec)
Downloading: http://repo1.maven.org/maven2/org/apache/maven/maven-archiver/2.4.1/maven-archiver-2.4.1.pom
Downloaded: http://repo1.maven.org/maven2/org/apache/maven/maven-archiver/2.4.1/maven-archiver-2.4.1.pom (4 KB at 643.4 KB/sec)
Downloading: http://repo1.maven.org/maven2/org/codehaus/plexus/plexus-archiver/1.0/plexus-archiver-1.0.pom
Downloaded: http://repo1.maven.org/maven2/org/codehaus/plexus/plexus-archiver/1.0/plexus-archiver-1.0.pom (2 KB at 262.0 KB/sec)
Downloading: http://repo1.maven.org/maven2/org/codehaus/plexus/plexus-io/1.0/plexus-io-1.0.pom
Downloaded: http://repo1.maven.org/maven2/org/codehaus/plexus/plexus-io/1.0/plexus-io-1.0.pom (2 KB at 199.9 KB/sec)
Downloading: http://repo1.maven.org/maven2/org/slf4j/slf4j-jdk14/1.5.6/slf4j-jdk14-1.5.6.jar
Downloading: http://repo1.maven.org/maven2/org/slf4j/slf4j-api/1.5.6/slf4j-api-1.5.6.jar
Downloading: http://repo1.maven.org/maven2/org/slf4j/jcl-over-slf4j/1.5.6/jcl-over-slf4j-1.5.6.jar
Downloading: http://repo1.maven.org/maven2/org/apache/maven/reporting/maven-reporting-api/2.2.1/maven-reporting-api-2.2.1.jar
Downloading: http://repo1.maven.org/maven2/org/apache/maven/doxia/doxia-sink-api/1.1/doxia-sink-api-1.1.jar
Downloaded: http://repo1.maven.org/maven2/org/slf4j/slf4j-jdk14/1.5.6/slf4j-jdk14-1.5.6.jar (9 KB at 782.6 KB/sec)
Downloading: http://repo1.maven.org/maven2/org/apache/maven/doxia/doxia-logging-api/1.1/doxia-logging-api-1.1.jar
Downloaded: http://repo1.maven.org/maven2/org/apache/maven/doxia/doxia-sink-api/1.1/doxia-sink-api-1.1.jar (13 KB at 1787.8 KB/sec)
Downloading: http://repo1.maven.org/maven2/backport-util-concurrent/backport-util-concurrent/3.1/backport-util-concurrent-3.1.jar
Downloaded: http://repo1.maven.org/maven2/org/slf4j/slf4j-api/1.5.6/slf4j-api-1.5.6.jar (22 KB at 1363.4 KB/sec)
Downloading: http://repo1.maven.org/maven2/org/sonatype/plexus/plexus-sec-dispatcher/1.3/plexus-sec-dispatcher-1.3.jar
Downloaded: http://repo1.maven.org/maven2/org/slf4j/jcl-over-slf4j/1.5.6/jcl-over-slf4j-1.5.6.jar (17 KB at 960.6 KB/sec)
Downloading: http://repo1.maven.org/maven2/org/sonatype/plexus/plexus-cipher/1.4/plexus-cipher-1.4.jar
Downloaded: http://repo1.maven.org/maven2/org/apache/maven/doxia/doxia-logging-api/1.1/doxia-logging-api-1.1.jar (12 KB at 1230.0 KB/sec)
Downloading: http://repo1.maven.org/maven2/org/apache/maven/shared/maven-common-artifact-filters/1.3/maven-common-artifact-filters-1.3.jar
Downloaded: http://repo1.maven.org/maven2/org/apache/maven/reporting/maven-reporting-api/2.2.1/maven-reporting-api-2.2.1.jar (10 KB at 477.9 KB/sec)
Downloading: http://repo1.maven.org/maven2/org/codehaus/plexus/plexus-archiver/1.1/plexus-archiver-1.1.jar
Downloaded: http://repo1.maven.org/maven2/org/sonatype/plexus/plexus-sec-dispatcher/1.3/plexus-sec-dispatcher-1.3.jar (28 KB at 3485.7 KB/sec)
Downloading: http://repo1.maven.org/maven2/org/codehaus/plexus/plexus-io/1.0.1/plexus-io-1.0.1.jar
Downloaded: http://repo1.maven.org/maven2/org/sonatype/plexus/plexus-cipher/1.4/plexus-cipher-1.4.jar (14 KB at 1464.2 KB/sec)
Downloading: http://repo1.maven.org/maven2/org/apache/maven/maven-archiver/2.4.1/maven-archiver-2.4.1.jar
Downloaded: http://repo1.maven.org/maven2/org/apache/maven/shared/maven-common-artifact-filters/1.3/maven-common-artifact-filters-1.3.jar (31 KB at 3370.1 KB/sec)
Downloaded: http://repo1.maven.org/maven2/org/apache/maven/maven-archiver/2.4.1/maven-archiver-2.4.1.jar (20 KB at 3271.0 KB/sec)
Downloaded: http://repo1.maven.org/maven2/org/codehaus/plexus/plexus-archiver/1.1/plexus-archiver-1.1.jar (178 KB at 10447.3 KB/sec)
Downloaded: http://repo1.maven.org/maven2/org/codehaus/plexus/plexus-io/1.0.1/plexus-io-1.0.1.jar (50 KB at 1774.1 KB/sec)
Downloaded: http://repo1.maven.org/maven2/backport-util-concurrent/backport-util-concurrent/3.1/backport-util-concurrent-3.1.jar (324 KB at 2571.0 KB/sec)
[INFO] Reading assembly descriptor: src/main/assembly/jar.xml
[WARNING] NOTE: Currently, inclusion of module dependencies may produce unpredictable results if a version conflict occurs.
[WARNING] NOTE: Currently, inclusion of module dependencies may produce unpredictable results if a version conflict occurs.
[INFO] org/ already added, skipping
[INFO] org/apache/ already added, skipping
[INFO] org/apache/axis2/ already added, skipping
[INFO] org/apache/axis2/transport/ already added, skipping
[INFO] org/ already added, skipping
[INFO] org/apache/ already added, skipping
[INFO] org/apache/axis2/ already added, skipping
[INFO] org/apache/axis2/wsdl/ already added, skipping
[INFO] org/apache/axis2/wsdl/util/ already added, skipping
[INFO] org/ already added, skipping
[INFO] org/apache/ already added, skipping
[INFO] org/apache/axis2/ already added, skipping
[INFO] org/ already added, skipping
[INFO] org/apache/ already added, skipping
[INFO] org/ already added, skipping
[INFO] org/apache/ already added, skipping
[INFO] org/apache/axis2/ already added, skipping
[INFO] org/apache/axis2/clustering/ already added, skipping
[INFO] org/apache/axis2/clustering/management/ already added, skipping
[INFO] org/apache/axis2/clustering/state/ already added, skipping
[INFO] org/ already added, skipping
[INFO] org/apache/ already added, skipping
[INFO] org/apache/axis2/ already added, skipping
[INFO] org/ already added, skipping
[INFO] org/apache/ already added, skipping
[INFO] org/apache/axis2/ already added, skipping
[INFO] org/apache/axis2/handlers/ already added, skipping
mavenExecutionResult exceptions not empty
message : PermGen space
Stack trace :
java.lang.OutOfMemoryError: PermGen space
at java.lang.ClassLoader.defineClass1(Native Method)
at java.lang.ClassLoader.defineClassCond(ClassLoader.java:631)
at java.lang.ClassLoader.defineClass(ClassLoader.java:615)
at java.security.SecureClassLoader.defineClass(SecureClassLoader.java:141)
at java.net.URLClassLoader.defineClass(URLClassLoader.java:283)Jul 12, 2012 12:05:20 AM hudson.remoting.SynchronousCommandTransport$ReaderThread run
SEVERE: Unexpected error in channel channel
java.lang.OutOfMemoryError: PermGen space
channel stopped
Exception in thread "Channel reader thread: channel" java.lang.OutOfMemoryError: PermGen space
Sending e-mails to: java-dev@axis.apache.org
Sending e-mails to: java-dev@axis.apache.org
[locks-and-latches] Releasing all the locks
[locks-and-latches] All the locks released
ERROR: Maven JVM terminated unexpectedly with exit code 0
---------------------------------------------------------------------
To unsubscribe, e-mail: java-dev-unsubscribe@axis.apache.org
For additional commands, e-mail: java-dev-help@axis.apache.org