You are viewing a plain text version of this content. The canonical link for it is here.
Posted to dev@lucene.apache.org by Apache Jenkins Server <je...@builds.apache.org> on 2011/07/22 18:51:15 UTC
[JENKINS] Lucene-Solr-tests-only-3.x - Build # 9695 - Failure
Build: https://builds.apache.org/job/Lucene-Solr-tests-only-3.x/9695/
15 tests failed.
FAILED: junit.framework.TestSuite.org.apache.solr.client.solrj.SolrExampleBinaryTest
Error Message:
null
Stack Trace:
java.lang.ExceptionInInitializerError
at org.apache.solr.client.solrj.SolrExampleBinaryTest.beforeTest(SolrExampleBinaryTest.java:36)
Caused by: java.lang.RuntimeException: Cannot find resource: solr/conf
at org.apache.solr.SolrTestCaseJ4.getFile(SolrTestCaseJ4.java:1101)
at org.apache.solr.util.ExternalPaths.determineSourceHome(ExternalPaths.java:40)
at org.apache.solr.util.ExternalPaths.<clinit>(ExternalPaths.java:30)
FAILED: junit.framework.TestSuite.org.apache.solr.client.solrj.TestBatchUpdate
Error Message:
null
Stack Trace:
java.lang.ExceptionInInitializerError
at org.apache.solr.client.solrj.TestBatchUpdate.beforeTest(TestBatchUpdate.java:43)
Caused by: java.lang.RuntimeException: Cannot find resource: solr/conf
at org.apache.solr.SolrTestCaseJ4.getFile(SolrTestCaseJ4.java:1101)
at org.apache.solr.util.ExternalPaths.determineSourceHome(ExternalPaths.java:40)
at org.apache.solr.util.ExternalPaths.<clinit>(ExternalPaths.java:30)
FAILED: org.apache.solr.client.solrj.embedded.JettyWebappTest.testJSP
Error Message:
Could not initialize class org.apache.solr.util.ExternalPaths
Stack Trace:
java.lang.NoClassDefFoundError: Could not initialize class org.apache.solr.util.ExternalPaths
at org.apache.solr.client.solrj.embedded.JettyWebappTest.setUp(JettyWebappTest.java:50)
at org.apache.lucene.util.LuceneTestCase$LuceneTestCaseRunner.runChild(LuceneTestCase.java:1299)
at org.apache.lucene.util.LuceneTestCase$LuceneTestCaseRunner.runChild(LuceneTestCase.java:1217)
FAILED: junit.framework.TestSuite.org.apache.solr.client.solrj.embedded.LargeVolumeBinaryJettyTest
Error Message:
null
Stack Trace:
java.lang.ExceptionInInitializerError
at org.apache.solr.client.solrj.embedded.LargeVolumeBinaryJettyTest.beforeTest(LargeVolumeBinaryJettyTest.java:30)
Caused by: java.lang.RuntimeException: Cannot find resource: solr/conf
at org.apache.solr.SolrTestCaseJ4.getFile(SolrTestCaseJ4.java:1101)
at org.apache.solr.util.ExternalPaths.determineSourceHome(ExternalPaths.java:40)
at org.apache.solr.util.ExternalPaths.<clinit>(ExternalPaths.java:30)
FAILED: junit.framework.TestSuite.org.apache.solr.client.solrj.embedded.LargeVolumeEmbeddedTest
Error Message:
Could not initialize class org.apache.solr.util.ExternalPaths
Stack Trace:
java.lang.NoClassDefFoundError: Could not initialize class org.apache.solr.util.ExternalPaths
at org.apache.solr.client.solrj.embedded.LargeVolumeEmbeddedTest.beforeTest(LargeVolumeEmbeddedTest.java:27)
FAILED: junit.framework.TestSuite.org.apache.solr.client.solrj.embedded.LargeVolumeJettyTest
Error Message:
null
Stack Trace:
java.lang.ExceptionInInitializerError
at org.apache.solr.client.solrj.embedded.LargeVolumeJettyTest.beforeTest(LargeVolumeJettyTest.java:27)
Caused by: java.lang.RuntimeException: Cannot find resource: solr/conf
at org.apache.solr.SolrTestCaseJ4.getFile(SolrTestCaseJ4.java:1101)
at org.apache.solr.util.ExternalPaths.determineSourceHome(ExternalPaths.java:40)
at org.apache.solr.util.ExternalPaths.<clinit>(ExternalPaths.java:30)
FAILED: org.apache.solr.client.solrj.embedded.MergeIndexesEmbeddedTest.testMergeIndexesByDirName
Error Message:
null
Stack Trace:
java.lang.ExceptionInInitializerError
at org.apache.solr.client.solrj.MergeIndexesExampleTestBase.getSolrHome(MergeIndexesExampleTestBase.java:44)
at org.apache.solr.client.solrj.MergeIndexesExampleTestBase.getSolrConfigFile(MergeIndexesExampleTestBase.java:54)
at org.apache.solr.util.AbstractSolrTestCase.setUp(AbstractSolrTestCase.java:137)
at org.apache.solr.client.solrj.SolrExampleTestBase.setUp(SolrExampleTestBase.java:43)
at org.apache.solr.client.solrj.MergeIndexesExampleTestBase.setUp(MergeIndexesExampleTestBase.java:59)
at org.apache.solr.client.solrj.embedded.MergeIndexesEmbeddedTest.setUp(MergeIndexesEmbeddedTest.java:38)
at org.apache.lucene.util.LuceneTestCase$LuceneTestCaseRunner.runChild(LuceneTestCase.java:1299)
at org.apache.lucene.util.LuceneTestCase$LuceneTestCaseRunner.runChild(LuceneTestCase.java:1217)
Caused by: java.lang.RuntimeException: Cannot find resource: solr/conf
at org.apache.solr.SolrTestCaseJ4.getFile(SolrTestCaseJ4.java:1101)
at org.apache.solr.util.ExternalPaths.determineSourceHome(ExternalPaths.java:40)
at org.apache.solr.util.ExternalPaths.<clinit>(ExternalPaths.java:30)
FAILED: org.apache.solr.client.solrj.embedded.MergeIndexesEmbeddedTest.testMergeIndexesByCoreName
Error Message:
Could not initialize class org.apache.solr.util.ExternalPaths
Stack Trace:
java.lang.NoClassDefFoundError: Could not initialize class org.apache.solr.util.ExternalPaths
at org.apache.solr.client.solrj.MergeIndexesExampleTestBase.getSolrHome(MergeIndexesExampleTestBase.java:44)
at org.apache.solr.client.solrj.MergeIndexesExampleTestBase.getSolrConfigFile(MergeIndexesExampleTestBase.java:54)
at org.apache.solr.util.AbstractSolrTestCase.setUp(AbstractSolrTestCase.java:137)
at org.apache.solr.client.solrj.SolrExampleTestBase.setUp(SolrExampleTestBase.java:43)
at org.apache.solr.client.solrj.MergeIndexesExampleTestBase.setUp(MergeIndexesExampleTestBase.java:59)
at org.apache.solr.client.solrj.embedded.MergeIndexesEmbeddedTest.setUp(MergeIndexesEmbeddedTest.java:38)
at org.apache.lucene.util.LuceneTestCase$LuceneTestCaseRunner.runChild(LuceneTestCase.java:1299)
at org.apache.lucene.util.LuceneTestCase$LuceneTestCaseRunner.runChild(LuceneTestCase.java:1217)
FAILED: org.apache.solr.client.solrj.embedded.MultiCoreEmbeddedTest.testMultiCore
Error Message:
Could not initialize class org.apache.solr.util.ExternalPaths
Stack Trace:
java.lang.NoClassDefFoundError: Could not initialize class org.apache.solr.util.ExternalPaths
at org.apache.solr.client.solrj.MultiCoreExampleTestBase.getSolrHome(MultiCoreExampleTestBase.java:43)
at org.apache.solr.client.solrj.MultiCoreExampleTestBase.getSolrConfigFile(MultiCoreExampleTestBase.java:46)
at org.apache.solr.util.AbstractSolrTestCase.setUp(AbstractSolrTestCase.java:137)
at org.apache.solr.client.solrj.SolrExampleTestBase.setUp(SolrExampleTestBase.java:43)
at org.apache.solr.client.solrj.MultiCoreExampleTestBase.setUp(MultiCoreExampleTestBase.java:49)
at org.apache.solr.client.solrj.embedded.MultiCoreEmbeddedTest.setUp(MultiCoreEmbeddedTest.java:37)
at org.apache.lucene.util.LuceneTestCase$LuceneTestCaseRunner.runChild(LuceneTestCase.java:1299)
at org.apache.lucene.util.LuceneTestCase$LuceneTestCaseRunner.runChild(LuceneTestCase.java:1217)
FAILED: org.apache.solr.client.solrj.embedded.MultiCoreExampleJettyTest.testMultiCore
Error Message:
null
Stack Trace:
java.lang.ExceptionInInitializerError
at org.apache.solr.client.solrj.MultiCoreExampleTestBase.getSolrHome(MultiCoreExampleTestBase.java:43)
at org.apache.solr.client.solrj.MultiCoreExampleTestBase.getSolrConfigFile(MultiCoreExampleTestBase.java:46)
at org.apache.solr.util.AbstractSolrTestCase.setUp(AbstractSolrTestCase.java:137)
at org.apache.solr.client.solrj.SolrExampleTestBase.setUp(SolrExampleTestBase.java:43)
at org.apache.solr.client.solrj.MultiCoreExampleTestBase.setUp(MultiCoreExampleTestBase.java:49)
at org.apache.solr.client.solrj.embedded.MultiCoreExampleJettyTest.setUp(MultiCoreExampleJettyTest.java:43)
at org.apache.lucene.util.LuceneTestCase$LuceneTestCaseRunner.runChild(LuceneTestCase.java:1299)
at org.apache.lucene.util.LuceneTestCase$LuceneTestCaseRunner.runChild(LuceneTestCase.java:1217)
Caused by: java.lang.RuntimeException: Cannot find resource: solr/conf
at org.apache.solr.SolrTestCaseJ4.getFile(SolrTestCaseJ4.java:1101)
at org.apache.solr.util.ExternalPaths.determineSourceHome(ExternalPaths.java:40)
at org.apache.solr.util.ExternalPaths.<clinit>(ExternalPaths.java:30)
FAILED: junit.framework.TestSuite.org.apache.solr.client.solrj.embedded.SolrExampleEmbeddedTest
Error Message:
Could not initialize class org.apache.solr.util.ExternalPaths
Stack Trace:
java.lang.NoClassDefFoundError: Could not initialize class org.apache.solr.util.ExternalPaths
at org.apache.solr.client.solrj.embedded.SolrExampleEmbeddedTest.beforeTest(SolrExampleEmbeddedTest.java:34)
FAILED: junit.framework.TestSuite.org.apache.solr.client.solrj.embedded.SolrExampleJettyTest
Error Message:
null
Stack Trace:
java.lang.ExceptionInInitializerError
at org.apache.solr.client.solrj.embedded.SolrExampleJettyTest.beforeTest(SolrExampleJettyTest.java:37)
Caused by: java.lang.RuntimeException: Cannot find resource: solr/conf
at org.apache.solr.SolrTestCaseJ4.getFile(SolrTestCaseJ4.java:1101)
at org.apache.solr.util.ExternalPaths.determineSourceHome(ExternalPaths.java:40)
at org.apache.solr.util.ExternalPaths.<clinit>(ExternalPaths.java:30)
FAILED: junit.framework.TestSuite.org.apache.solr.client.solrj.embedded.SolrExampleStreamingTest
Error Message:
Could not initialize class org.apache.solr.util.ExternalPaths
Stack Trace:
java.lang.NoClassDefFoundError: Could not initialize class org.apache.solr.util.ExternalPaths
at org.apache.solr.client.solrj.embedded.SolrExampleStreamingTest.beforeTest(SolrExampleStreamingTest.java:36)
FAILED: junit.framework.TestSuite.org.apache.solr.client.solrj.response.TermsResponseTest
Error Message:
Could not initialize class org.apache.solr.util.ExternalPaths
Stack Trace:
java.lang.NoClassDefFoundError: Could not initialize class org.apache.solr.util.ExternalPaths
at org.apache.solr.client.solrj.response.TermsResponseTest.beforeTest(TermsResponseTest.java:38)
FAILED: junit.framework.TestSuite.org.apache.solr.client.solrj.response.TestSpellCheckResponse
Error Message:
Could not initialize class org.apache.solr.util.ExternalPaths
Stack Trace:
java.lang.NoClassDefFoundError: Could not initialize class org.apache.solr.util.ExternalPaths
at org.apache.solr.client.solrj.response.TestSpellCheckResponse.beforeTest(TestSpellCheckResponse.java:44)
Build Log (for compile errors):
[...truncated 13804 lines...]
---------------------------------------------------------------------
To unsubscribe, e-mail: dev-unsubscribe@lucene.apache.org
For additional commands, e-mail: dev-help@lucene.apache.org
RE: [JENKINS] Lucene-Solr-tests-only-3.x - Build # 9695 - Failure
Posted by Steven A Rowe <sa...@syr.edu>.
Fails for me too on trunk, both from solr/ and from solr/solrj.
I think it succeeded for me pre-commit because of the way Subversion handles moves/deletes: - the directories hang around until you commit. So in my working copy, solr/solrj/src/test-files/solr/conf/ existed, and ExternalPaths.determineSourceHome() was able thereby to find the lay of the land.
> -----Original Message-----
> From: yseeley@gmail.com [mailto:yseeley@gmail.com] On Behalf Of Yonik
> Seeley
> Sent: Friday, July 22, 2011 1:03 PM
> To: dev@lucene.apache.org
> Subject: Re: [JENKINS] Lucene-Solr-tests-only-3.x - Build # 9695 -
> Failure
>
> On Fri, Jul 22, 2011 at 12:55 PM, Steven A Rowe <sa...@syr.edu> wrote:
> > Yeah, almost certainly.
> >
> > All Lucene/Solr tests succeeded for me locally before I committed,
> though, via 'ant clean test' at the top level.
>
> I just tried 3x, and "ant test" from the solr directory failed for me
> too.
>
> -Yonik
> http://www.lucidimagination.com
>
>
> >> -----Original Message-----
> >> From: Robert Muir [mailto:rcmuir@gmail.com]
> >> Sent: Friday, July 22, 2011 12:54 PM
> >> To: dev@lucene.apache.org
> >> Subject: Re: [JENKINS] Lucene-Solr-tests-only-3.x - Build # 9695 -
> >> Failure
> >>
> >> [junit] Caused by: java.lang.RuntimeException: Cannot find
> >> resource: solr/conf
> >>
> >> Maybe related to https://issues.apache.org/jira/browse/SOLR-2659 ?
> >>
> >> On Fri, Jul 22, 2011 at 12:51 PM, Apache Jenkins Server
> >> <je...@builds.apache.org> wrote:
> >> > Build: https://builds.apache.org/job/Lucene-Solr-tests-only-
> 3.x/9695/
> >> >
> >> > 15 tests failed.
> >> >
> >>
> FAILED: junit.framework.TestSuite.org.apache.solr.client.solrj.SolrExamp
> >> leBinaryTest
> >> >
> >> > Error Message:
> >> > null
> >> >
> >> > Stack Trace:
> >> > java.lang.ExceptionInInitializerError
> >> > at
> >>
> org.apache.solr.client.solrj.SolrExampleBinaryTest.beforeTest(SolrExample
> >> BinaryTest.java:36)
> >> > Caused by: java.lang.RuntimeException: Cannot find resource:
> solr/conf
> >> > at
> >> org.apache.solr.SolrTestCaseJ4.getFile(SolrTestCaseJ4.java:1101)
> >> > at
> >>
> org.apache.solr.util.ExternalPaths.determineSourceHome(ExternalPaths.java
> >> :40)
> >> > at
> >> org.apache.solr.util.ExternalPaths.<clinit>(ExternalPaths.java:30)
> >> >
> >> >
> >> >
> >>
> FAILED: junit.framework.TestSuite.org.apache.solr.client.solrj.TestBatch
> >> Update
> >> >
> >> > Error Message:
> >> > null
> >> >
> >> > Stack Trace:
> >> > java.lang.ExceptionInInitializerError
> >> > at
> >>
> org.apache.solr.client.solrj.TestBatchUpdate.beforeTest(TestBatchUpdate.j
> >> ava:43)
> >> > Caused by: java.lang.RuntimeException: Cannot find resource:
> solr/conf
> >> > at
> >> org.apache.solr.SolrTestCaseJ4.getFile(SolrTestCaseJ4.java:1101)
> >> > at
> >>
> org.apache.solr.util.ExternalPaths.determineSourceHome(ExternalPaths.java
> >> :40)
> >> > at
> >> org.apache.solr.util.ExternalPaths.<clinit>(ExternalPaths.java:30)
> >> >
> >> >
> >> >
> FAILED: org.apache.solr.client.solrj.embedded.JettyWebappTest.testJSP
> >> >
> >> > Error Message:
> >> > Could not initialize class org.apache.solr.util.ExternalPaths
> >> >
> >> > Stack Trace:
> >> > java.lang.NoClassDefFoundError: Could not initialize class
> >> org.apache.solr.util.ExternalPaths
> >> > at
> >>
> org.apache.solr.client.solrj.embedded.JettyWebappTest.setUp(JettyWebappTe
> >> st.java:50)
> >> > at
> >>
> org.apache.lucene.util.LuceneTestCase$LuceneTestCaseRunner.runChild(Lucen
> >> eTestCase.java:1299)
> >> > at
> >>
> org.apache.lucene.util.LuceneTestCase$LuceneTestCaseRunner.runChild(Lucen
> >> eTestCase.java:1217)
> >> >
> >> >
> >> >
> >>
> FAILED: junit.framework.TestSuite.org.apache.solr.client.solrj.embedded.
> >> LargeVolumeBinaryJettyTest
> >> >
> >> > Error Message:
> >> > null
> >> >
> >> > Stack Trace:
> >> > java.lang.ExceptionInInitializerError
> >> > at
> >>
> org.apache.solr.client.solrj.embedded.LargeVolumeBinaryJettyTest.beforeTe
> >> st(LargeVolumeBinaryJettyTest.java:30)
> >> > Caused by: java.lang.RuntimeException: Cannot find resource:
> solr/conf
> >> > at
> >> org.apache.solr.SolrTestCaseJ4.getFile(SolrTestCaseJ4.java:1101)
> >> > at
> >>
> org.apache.solr.util.ExternalPaths.determineSourceHome(ExternalPaths.java
> >> :40)
> >> > at
> >> org.apache.solr.util.ExternalPaths.<clinit>(ExternalPaths.java:30)
> >> >
> >> >
> >> >
> >>
> FAILED: junit.framework.TestSuite.org.apache.solr.client.solrj.embedded.
> >> LargeVolumeEmbeddedTest
> >> >
> >> > Error Message:
> >> > Could not initialize class org.apache.solr.util.ExternalPaths
> >> >
> >> > Stack Trace:
> >> > java.lang.NoClassDefFoundError: Could not initialize class
> >> org.apache.solr.util.ExternalPaths
> >> > at
> >>
> org.apache.solr.client.solrj.embedded.LargeVolumeEmbeddedTest.beforeTest(
> >> LargeVolumeEmbeddedTest.java:27)
> >> >
> >> >
> >> >
> >>
> FAILED: junit.framework.TestSuite.org.apache.solr.client.solrj.embedded.
> >> LargeVolumeJettyTest
> >> >
> >> > Error Message:
> >> > null
> >> >
> >> > Stack Trace:
> >> > java.lang.ExceptionInInitializerError
> >> > at
> >>
> org.apache.solr.client.solrj.embedded.LargeVolumeJettyTest.beforeTest(Lar
> >> geVolumeJettyTest.java:27)
> >> > Caused by: java.lang.RuntimeException: Cannot find resource:
> solr/conf
> >> > at
> >> org.apache.solr.SolrTestCaseJ4.getFile(SolrTestCaseJ4.java:1101)
> >> > at
> >>
> org.apache.solr.util.ExternalPaths.determineSourceHome(ExternalPaths.java
> >> :40)
> >> > at
> >> org.apache.solr.util.ExternalPaths.<clinit>(ExternalPaths.java:30)
> >> >
> >> >
> >> >
> >>
> FAILED: org.apache.solr.client.solrj.embedded.MergeIndexesEmbeddedTest.t
> >> estMergeIndexesByDirName
> >> >
> >> > Error Message:
> >> > null
> >> >
> >> > Stack Trace:
> >> > java.lang.ExceptionInInitializerError
> >> > at
> >>
> org.apache.solr.client.solrj.MergeIndexesExampleTestBase.getSolrHome(Merg
> >> eIndexesExampleTestBase.java:44)
> >> > at
> >>
> org.apache.solr.client.solrj.MergeIndexesExampleTestBase.getSolrConfigFil
> >> e(MergeIndexesExampleTestBase.java:54)
> >> > at
> >>
> org.apache.solr.util.AbstractSolrTestCase.setUp(AbstractSolrTestCase.java
> >> :137)
> >> > at
> >>
> org.apache.solr.client.solrj.SolrExampleTestBase.setUp(SolrExampleTestBas
> >> e.java:43)
> >> > at
> >>
> org.apache.solr.client.solrj.MergeIndexesExampleTestBase.setUp(MergeIndex
> >> esExampleTestBase.java:59)
> >> > at
> >>
> org.apache.solr.client.solrj.embedded.MergeIndexesEmbeddedTest.setUp(Merg
> >> eIndexesEmbeddedTest.java:38)
> >> > at
> >>
> org.apache.lucene.util.LuceneTestCase$LuceneTestCaseRunner.runChild(Lucen
> >> eTestCase.java:1299)
> >> > at
> >>
> org.apache.lucene.util.LuceneTestCase$LuceneTestCaseRunner.runChild(Lucen
> >> eTestCase.java:1217)
> >> > Caused by: java.lang.RuntimeException: Cannot find resource:
> solr/conf
> >> > at
> >> org.apache.solr.SolrTestCaseJ4.getFile(SolrTestCaseJ4.java:1101)
> >> > at
> >>
> org.apache.solr.util.ExternalPaths.determineSourceHome(ExternalPaths.java
> >> :40)
> >> > at
> >> org.apache.solr.util.ExternalPaths.<clinit>(ExternalPaths.java:30)
> >> >
> >> >
> >> >
> >>
> FAILED: org.apache.solr.client.solrj.embedded.MergeIndexesEmbeddedTest.t
> >> estMergeIndexesByCoreName
> >> >
> >> > Error Message:
> >> > Could not initialize class org.apache.solr.util.ExternalPaths
> >> >
> >> > Stack Trace:
> >> > java.lang.NoClassDefFoundError: Could not initialize class
> >> org.apache.solr.util.ExternalPaths
> >> > at
> >>
> org.apache.solr.client.solrj.MergeIndexesExampleTestBase.getSolrHome(Merg
> >> eIndexesExampleTestBase.java:44)
> >> > at
> >>
> org.apache.solr.client.solrj.MergeIndexesExampleTestBase.getSolrConfigFil
> >> e(MergeIndexesExampleTestBase.java:54)
> >> > at
> >>
> org.apache.solr.util.AbstractSolrTestCase.setUp(AbstractSolrTestCase.java
> >> :137)
> >> > at
> >>
> org.apache.solr.client.solrj.SolrExampleTestBase.setUp(SolrExampleTestBas
> >> e.java:43)
> >> > at
> >>
> org.apache.solr.client.solrj.MergeIndexesExampleTestBase.setUp(MergeIndex
> >> esExampleTestBase.java:59)
> >> > at
> >>
> org.apache.solr.client.solrj.embedded.MergeIndexesEmbeddedTest.setUp(Merg
> >> eIndexesEmbeddedTest.java:38)
> >> > at
> >>
> org.apache.lucene.util.LuceneTestCase$LuceneTestCaseRunner.runChild(Lucen
> >> eTestCase.java:1299)
> >> > at
> >>
> org.apache.lucene.util.LuceneTestCase$LuceneTestCaseRunner.runChild(Lucen
> >> eTestCase.java:1217)
> >> >
> >> >
> >> >
> >>
> FAILED: org.apache.solr.client.solrj.embedded.MultiCoreEmbeddedTest.test
> >> MultiCore
> >> >
> >> > Error Message:
> >> > Could not initialize class org.apache.solr.util.ExternalPaths
> >> >
> >> > Stack Trace:
> >> > java.lang.NoClassDefFoundError: Could not initialize class
> >> org.apache.solr.util.ExternalPaths
> >> > at
> >>
> org.apache.solr.client.solrj.MultiCoreExampleTestBase.getSolrHome(MultiCo
> >> reExampleTestBase.java:43)
> >> > at
> >>
> org.apache.solr.client.solrj.MultiCoreExampleTestBase.getSolrConfigFile(M
> >> ultiCoreExampleTestBase.java:46)
> >> > at
> >>
> org.apache.solr.util.AbstractSolrTestCase.setUp(AbstractSolrTestCase.java
> >> :137)
> >> > at
> >>
> org.apache.solr.client.solrj.SolrExampleTestBase.setUp(SolrExampleTestBas
> >> e.java:43)
> >> > at
> >>
> org.apache.solr.client.solrj.MultiCoreExampleTestBase.setUp(MultiCoreExam
> >> pleTestBase.java:49)
> >> > at
> >>
> org.apache.solr.client.solrj.embedded.MultiCoreEmbeddedTest.setUp(MultiCo
> >> reEmbeddedTest.java:37)
> >> > at
> >>
> org.apache.lucene.util.LuceneTestCase$LuceneTestCaseRunner.runChild(Lucen
> >> eTestCase.java:1299)
> >> > at
> >>
> org.apache.lucene.util.LuceneTestCase$LuceneTestCaseRunner.runChild(Lucen
> >> eTestCase.java:1217)
> >> >
> >> >
> >> >
> >>
> FAILED: org.apache.solr.client.solrj.embedded.MultiCoreExampleJettyTest.
> >> testMultiCore
> >> >
> >> > Error Message:
> >> > null
> >> >
> >> > Stack Trace:
> >> > java.lang.ExceptionInInitializerError
> >> > at
> >>
> org.apache.solr.client.solrj.MultiCoreExampleTestBase.getSolrHome(MultiCo
> >> reExampleTestBase.java:43)
> >> > at
> >>
> org.apache.solr.client.solrj.MultiCoreExampleTestBase.getSolrConfigFile(M
> >> ultiCoreExampleTestBase.java:46)
> >> > at
> >>
> org.apache.solr.util.AbstractSolrTestCase.setUp(AbstractSolrTestCase.java
> >> :137)
> >> > at
> >>
> org.apache.solr.client.solrj.SolrExampleTestBase.setUp(SolrExampleTestBas
> >> e.java:43)
> >> > at
> >>
> org.apache.solr.client.solrj.MultiCoreExampleTestBase.setUp(MultiCoreExam
> >> pleTestBase.java:49)
> >> > at
> >>
> org.apache.solr.client.solrj.embedded.MultiCoreExampleJettyTest.setUp(Mul
> >> tiCoreExampleJettyTest.java:43)
> >> > at
> >>
> org.apache.lucene.util.LuceneTestCase$LuceneTestCaseRunner.runChild(Lucen
> >> eTestCase.java:1299)
> >> > at
> >>
> org.apache.lucene.util.LuceneTestCase$LuceneTestCaseRunner.runChild(Lucen
> >> eTestCase.java:1217)
> >> > Caused by: java.lang.RuntimeException: Cannot find resource:
> solr/conf
> >> > at
> >> org.apache.solr.SolrTestCaseJ4.getFile(SolrTestCaseJ4.java:1101)
> >> > at
> >>
> org.apache.solr.util.ExternalPaths.determineSourceHome(ExternalPaths.java
> >> :40)
> >> > at
> >> org.apache.solr.util.ExternalPaths.<clinit>(ExternalPaths.java:30)
> >> >
> >> >
> >> >
> >>
> FAILED: junit.framework.TestSuite.org.apache.solr.client.solrj.embedded.
> >> SolrExampleEmbeddedTest
> >> >
> >> > Error Message:
> >> > Could not initialize class org.apache.solr.util.ExternalPaths
> >> >
> >> > Stack Trace:
> >> > java.lang.NoClassDefFoundError: Could not initialize class
> >> org.apache.solr.util.ExternalPaths
> >> > at
> >>
> org.apache.solr.client.solrj.embedded.SolrExampleEmbeddedTest.beforeTest(
> >> SolrExampleEmbeddedTest.java:34)
> >> >
> >> >
> >> >
> >>
> FAILED: junit.framework.TestSuite.org.apache.solr.client.solrj.embedded.
> >> SolrExampleJettyTest
> >> >
> >> > Error Message:
> >> > null
> >> >
> >> > Stack Trace:
> >> > java.lang.ExceptionInInitializerError
> >> > at
> >>
> org.apache.solr.client.solrj.embedded.SolrExampleJettyTest.beforeTest(Sol
> >> rExampleJettyTest.java:37)
> >> > Caused by: java.lang.RuntimeException: Cannot find resource:
> solr/conf
> >> > at
> >> org.apache.solr.SolrTestCaseJ4.getFile(SolrTestCaseJ4.java:1101)
> >> > at
> >>
> org.apache.solr.util.ExternalPaths.determineSourceHome(ExternalPaths.java
> >> :40)
> >> > at
> >> org.apache.solr.util.ExternalPaths.<clinit>(ExternalPaths.java:30)
> >> >
> >> >
> >> >
> >>
> FAILED: junit.framework.TestSuite.org.apache.solr.client.solrj.embedded.
> >> SolrExampleStreamingTest
> >> >
> >> > Error Message:
> >> > Could not initialize class org.apache.solr.util.ExternalPaths
> >> >
> >> > Stack Trace:
> >> > java.lang.NoClassDefFoundError: Could not initialize class
> >> org.apache.solr.util.ExternalPaths
> >> > at
> >>
> org.apache.solr.client.solrj.embedded.SolrExampleStreamingTest.beforeTest
> >> (SolrExampleStreamingTest.java:36)
> >> >
> >> >
> >> >
> >>
> FAILED: junit.framework.TestSuite.org.apache.solr.client.solrj.response.
> >> TermsResponseTest
> >> >
> >> > Error Message:
> >> > Could not initialize class org.apache.solr.util.ExternalPaths
> >> >
> >> > Stack Trace:
> >> > java.lang.NoClassDefFoundError: Could not initialize class
> >> org.apache.solr.util.ExternalPaths
> >> > at
> >>
> org.apache.solr.client.solrj.response.TermsResponseTest.beforeTest(TermsR
> >> esponseTest.java:38)
> >> >
> >> >
> >> >
> >>
> FAILED: junit.framework.TestSuite.org.apache.solr.client.solrj.response.
> >> TestSpellCheckResponse
> >> >
> >> > Error Message:
> >> > Could not initialize class org.apache.solr.util.ExternalPaths
> >> >
> >> > Stack Trace:
> >> > java.lang.NoClassDefFoundError: Could not initialize class
> >> org.apache.solr.util.ExternalPaths
> >> > at
> >>
> org.apache.solr.client.solrj.response.TestSpellCheckResponse.beforeTest(T
> >> estSpellCheckResponse.java:44)
> >> >
> >> >
> >> >
> >> >
> >> > Build Log (for compile errors):
> >> > [...truncated 13804 lines...]
> >> >
> >> >
> >> >
> >> > --------------------------------------------------------------------
> -
> >> > To unsubscribe, e-mail: dev-unsubscribe@lucene.apache.org
> >> > For additional commands, e-mail: dev-help@lucene.apache.org
> >> >
> >> >
> >>
> >>
> >>
> >> --
> >> lucidimagination.com
> >>
> >> ---------------------------------------------------------------------
> >> To unsubscribe, e-mail: dev-unsubscribe@lucene.apache.org
> >> For additional commands, e-mail: dev-help@lucene.apache.org
> >
> >
>
> ---------------------------------------------------------------------
> To unsubscribe, e-mail: dev-unsubscribe@lucene.apache.org
> For additional commands, e-mail: dev-help@lucene.apache.org
Re: [JENKINS] Lucene-Solr-tests-only-3.x - Build # 9695 - Failure
Posted by Yonik Seeley <yo...@lucidimagination.com>.
On Fri, Jul 22, 2011 at 12:55 PM, Steven A Rowe <sa...@syr.edu> wrote:
> Yeah, almost certainly.
>
> All Lucene/Solr tests succeeded for me locally before I committed, though, via 'ant clean test' at the top level.
I just tried 3x, and "ant test" from the solr directory failed for me too.
-Yonik
http://www.lucidimagination.com
>> -----Original Message-----
>> From: Robert Muir [mailto:rcmuir@gmail.com]
>> Sent: Friday, July 22, 2011 12:54 PM
>> To: dev@lucene.apache.org
>> Subject: Re: [JENKINS] Lucene-Solr-tests-only-3.x - Build # 9695 -
>> Failure
>>
>> [junit] Caused by: java.lang.RuntimeException: Cannot find
>> resource: solr/conf
>>
>> Maybe related to https://issues.apache.org/jira/browse/SOLR-2659 ?
>>
>> On Fri, Jul 22, 2011 at 12:51 PM, Apache Jenkins Server
>> <je...@builds.apache.org> wrote:
>> > Build: https://builds.apache.org/job/Lucene-Solr-tests-only-3.x/9695/
>> >
>> > 15 tests failed.
>> >
>> FAILED: junit.framework.TestSuite.org.apache.solr.client.solrj.SolrExamp
>> leBinaryTest
>> >
>> > Error Message:
>> > null
>> >
>> > Stack Trace:
>> > java.lang.ExceptionInInitializerError
>> > at
>> org.apache.solr.client.solrj.SolrExampleBinaryTest.beforeTest(SolrExample
>> BinaryTest.java:36)
>> > Caused by: java.lang.RuntimeException: Cannot find resource: solr/conf
>> > at
>> org.apache.solr.SolrTestCaseJ4.getFile(SolrTestCaseJ4.java:1101)
>> > at
>> org.apache.solr.util.ExternalPaths.determineSourceHome(ExternalPaths.java
>> :40)
>> > at
>> org.apache.solr.util.ExternalPaths.<clinit>(ExternalPaths.java:30)
>> >
>> >
>> >
>> FAILED: junit.framework.TestSuite.org.apache.solr.client.solrj.TestBatch
>> Update
>> >
>> > Error Message:
>> > null
>> >
>> > Stack Trace:
>> > java.lang.ExceptionInInitializerError
>> > at
>> org.apache.solr.client.solrj.TestBatchUpdate.beforeTest(TestBatchUpdate.j
>> ava:43)
>> > Caused by: java.lang.RuntimeException: Cannot find resource: solr/conf
>> > at
>> org.apache.solr.SolrTestCaseJ4.getFile(SolrTestCaseJ4.java:1101)
>> > at
>> org.apache.solr.util.ExternalPaths.determineSourceHome(ExternalPaths.java
>> :40)
>> > at
>> org.apache.solr.util.ExternalPaths.<clinit>(ExternalPaths.java:30)
>> >
>> >
>> > FAILED: org.apache.solr.client.solrj.embedded.JettyWebappTest.testJSP
>> >
>> > Error Message:
>> > Could not initialize class org.apache.solr.util.ExternalPaths
>> >
>> > Stack Trace:
>> > java.lang.NoClassDefFoundError: Could not initialize class
>> org.apache.solr.util.ExternalPaths
>> > at
>> org.apache.solr.client.solrj.embedded.JettyWebappTest.setUp(JettyWebappTe
>> st.java:50)
>> > at
>> org.apache.lucene.util.LuceneTestCase$LuceneTestCaseRunner.runChild(Lucen
>> eTestCase.java:1299)
>> > at
>> org.apache.lucene.util.LuceneTestCase$LuceneTestCaseRunner.runChild(Lucen
>> eTestCase.java:1217)
>> >
>> >
>> >
>> FAILED: junit.framework.TestSuite.org.apache.solr.client.solrj.embedded.
>> LargeVolumeBinaryJettyTest
>> >
>> > Error Message:
>> > null
>> >
>> > Stack Trace:
>> > java.lang.ExceptionInInitializerError
>> > at
>> org.apache.solr.client.solrj.embedded.LargeVolumeBinaryJettyTest.beforeTe
>> st(LargeVolumeBinaryJettyTest.java:30)
>> > Caused by: java.lang.RuntimeException: Cannot find resource: solr/conf
>> > at
>> org.apache.solr.SolrTestCaseJ4.getFile(SolrTestCaseJ4.java:1101)
>> > at
>> org.apache.solr.util.ExternalPaths.determineSourceHome(ExternalPaths.java
>> :40)
>> > at
>> org.apache.solr.util.ExternalPaths.<clinit>(ExternalPaths.java:30)
>> >
>> >
>> >
>> FAILED: junit.framework.TestSuite.org.apache.solr.client.solrj.embedded.
>> LargeVolumeEmbeddedTest
>> >
>> > Error Message:
>> > Could not initialize class org.apache.solr.util.ExternalPaths
>> >
>> > Stack Trace:
>> > java.lang.NoClassDefFoundError: Could not initialize class
>> org.apache.solr.util.ExternalPaths
>> > at
>> org.apache.solr.client.solrj.embedded.LargeVolumeEmbeddedTest.beforeTest(
>> LargeVolumeEmbeddedTest.java:27)
>> >
>> >
>> >
>> FAILED: junit.framework.TestSuite.org.apache.solr.client.solrj.embedded.
>> LargeVolumeJettyTest
>> >
>> > Error Message:
>> > null
>> >
>> > Stack Trace:
>> > java.lang.ExceptionInInitializerError
>> > at
>> org.apache.solr.client.solrj.embedded.LargeVolumeJettyTest.beforeTest(Lar
>> geVolumeJettyTest.java:27)
>> > Caused by: java.lang.RuntimeException: Cannot find resource: solr/conf
>> > at
>> org.apache.solr.SolrTestCaseJ4.getFile(SolrTestCaseJ4.java:1101)
>> > at
>> org.apache.solr.util.ExternalPaths.determineSourceHome(ExternalPaths.java
>> :40)
>> > at
>> org.apache.solr.util.ExternalPaths.<clinit>(ExternalPaths.java:30)
>> >
>> >
>> >
>> FAILED: org.apache.solr.client.solrj.embedded.MergeIndexesEmbeddedTest.t
>> estMergeIndexesByDirName
>> >
>> > Error Message:
>> > null
>> >
>> > Stack Trace:
>> > java.lang.ExceptionInInitializerError
>> > at
>> org.apache.solr.client.solrj.MergeIndexesExampleTestBase.getSolrHome(Merg
>> eIndexesExampleTestBase.java:44)
>> > at
>> org.apache.solr.client.solrj.MergeIndexesExampleTestBase.getSolrConfigFil
>> e(MergeIndexesExampleTestBase.java:54)
>> > at
>> org.apache.solr.util.AbstractSolrTestCase.setUp(AbstractSolrTestCase.java
>> :137)
>> > at
>> org.apache.solr.client.solrj.SolrExampleTestBase.setUp(SolrExampleTestBas
>> e.java:43)
>> > at
>> org.apache.solr.client.solrj.MergeIndexesExampleTestBase.setUp(MergeIndex
>> esExampleTestBase.java:59)
>> > at
>> org.apache.solr.client.solrj.embedded.MergeIndexesEmbeddedTest.setUp(Merg
>> eIndexesEmbeddedTest.java:38)
>> > at
>> org.apache.lucene.util.LuceneTestCase$LuceneTestCaseRunner.runChild(Lucen
>> eTestCase.java:1299)
>> > at
>> org.apache.lucene.util.LuceneTestCase$LuceneTestCaseRunner.runChild(Lucen
>> eTestCase.java:1217)
>> > Caused by: java.lang.RuntimeException: Cannot find resource: solr/conf
>> > at
>> org.apache.solr.SolrTestCaseJ4.getFile(SolrTestCaseJ4.java:1101)
>> > at
>> org.apache.solr.util.ExternalPaths.determineSourceHome(ExternalPaths.java
>> :40)
>> > at
>> org.apache.solr.util.ExternalPaths.<clinit>(ExternalPaths.java:30)
>> >
>> >
>> >
>> FAILED: org.apache.solr.client.solrj.embedded.MergeIndexesEmbeddedTest.t
>> estMergeIndexesByCoreName
>> >
>> > Error Message:
>> > Could not initialize class org.apache.solr.util.ExternalPaths
>> >
>> > Stack Trace:
>> > java.lang.NoClassDefFoundError: Could not initialize class
>> org.apache.solr.util.ExternalPaths
>> > at
>> org.apache.solr.client.solrj.MergeIndexesExampleTestBase.getSolrHome(Merg
>> eIndexesExampleTestBase.java:44)
>> > at
>> org.apache.solr.client.solrj.MergeIndexesExampleTestBase.getSolrConfigFil
>> e(MergeIndexesExampleTestBase.java:54)
>> > at
>> org.apache.solr.util.AbstractSolrTestCase.setUp(AbstractSolrTestCase.java
>> :137)
>> > at
>> org.apache.solr.client.solrj.SolrExampleTestBase.setUp(SolrExampleTestBas
>> e.java:43)
>> > at
>> org.apache.solr.client.solrj.MergeIndexesExampleTestBase.setUp(MergeIndex
>> esExampleTestBase.java:59)
>> > at
>> org.apache.solr.client.solrj.embedded.MergeIndexesEmbeddedTest.setUp(Merg
>> eIndexesEmbeddedTest.java:38)
>> > at
>> org.apache.lucene.util.LuceneTestCase$LuceneTestCaseRunner.runChild(Lucen
>> eTestCase.java:1299)
>> > at
>> org.apache.lucene.util.LuceneTestCase$LuceneTestCaseRunner.runChild(Lucen
>> eTestCase.java:1217)
>> >
>> >
>> >
>> FAILED: org.apache.solr.client.solrj.embedded.MultiCoreEmbeddedTest.test
>> MultiCore
>> >
>> > Error Message:
>> > Could not initialize class org.apache.solr.util.ExternalPaths
>> >
>> > Stack Trace:
>> > java.lang.NoClassDefFoundError: Could not initialize class
>> org.apache.solr.util.ExternalPaths
>> > at
>> org.apache.solr.client.solrj.MultiCoreExampleTestBase.getSolrHome(MultiCo
>> reExampleTestBase.java:43)
>> > at
>> org.apache.solr.client.solrj.MultiCoreExampleTestBase.getSolrConfigFile(M
>> ultiCoreExampleTestBase.java:46)
>> > at
>> org.apache.solr.util.AbstractSolrTestCase.setUp(AbstractSolrTestCase.java
>> :137)
>> > at
>> org.apache.solr.client.solrj.SolrExampleTestBase.setUp(SolrExampleTestBas
>> e.java:43)
>> > at
>> org.apache.solr.client.solrj.MultiCoreExampleTestBase.setUp(MultiCoreExam
>> pleTestBase.java:49)
>> > at
>> org.apache.solr.client.solrj.embedded.MultiCoreEmbeddedTest.setUp(MultiCo
>> reEmbeddedTest.java:37)
>> > at
>> org.apache.lucene.util.LuceneTestCase$LuceneTestCaseRunner.runChild(Lucen
>> eTestCase.java:1299)
>> > at
>> org.apache.lucene.util.LuceneTestCase$LuceneTestCaseRunner.runChild(Lucen
>> eTestCase.java:1217)
>> >
>> >
>> >
>> FAILED: org.apache.solr.client.solrj.embedded.MultiCoreExampleJettyTest.
>> testMultiCore
>> >
>> > Error Message:
>> > null
>> >
>> > Stack Trace:
>> > java.lang.ExceptionInInitializerError
>> > at
>> org.apache.solr.client.solrj.MultiCoreExampleTestBase.getSolrHome(MultiCo
>> reExampleTestBase.java:43)
>> > at
>> org.apache.solr.client.solrj.MultiCoreExampleTestBase.getSolrConfigFile(M
>> ultiCoreExampleTestBase.java:46)
>> > at
>> org.apache.solr.util.AbstractSolrTestCase.setUp(AbstractSolrTestCase.java
>> :137)
>> > at
>> org.apache.solr.client.solrj.SolrExampleTestBase.setUp(SolrExampleTestBas
>> e.java:43)
>> > at
>> org.apache.solr.client.solrj.MultiCoreExampleTestBase.setUp(MultiCoreExam
>> pleTestBase.java:49)
>> > at
>> org.apache.solr.client.solrj.embedded.MultiCoreExampleJettyTest.setUp(Mul
>> tiCoreExampleJettyTest.java:43)
>> > at
>> org.apache.lucene.util.LuceneTestCase$LuceneTestCaseRunner.runChild(Lucen
>> eTestCase.java:1299)
>> > at
>> org.apache.lucene.util.LuceneTestCase$LuceneTestCaseRunner.runChild(Lucen
>> eTestCase.java:1217)
>> > Caused by: java.lang.RuntimeException: Cannot find resource: solr/conf
>> > at
>> org.apache.solr.SolrTestCaseJ4.getFile(SolrTestCaseJ4.java:1101)
>> > at
>> org.apache.solr.util.ExternalPaths.determineSourceHome(ExternalPaths.java
>> :40)
>> > at
>> org.apache.solr.util.ExternalPaths.<clinit>(ExternalPaths.java:30)
>> >
>> >
>> >
>> FAILED: junit.framework.TestSuite.org.apache.solr.client.solrj.embedded.
>> SolrExampleEmbeddedTest
>> >
>> > Error Message:
>> > Could not initialize class org.apache.solr.util.ExternalPaths
>> >
>> > Stack Trace:
>> > java.lang.NoClassDefFoundError: Could not initialize class
>> org.apache.solr.util.ExternalPaths
>> > at
>> org.apache.solr.client.solrj.embedded.SolrExampleEmbeddedTest.beforeTest(
>> SolrExampleEmbeddedTest.java:34)
>> >
>> >
>> >
>> FAILED: junit.framework.TestSuite.org.apache.solr.client.solrj.embedded.
>> SolrExampleJettyTest
>> >
>> > Error Message:
>> > null
>> >
>> > Stack Trace:
>> > java.lang.ExceptionInInitializerError
>> > at
>> org.apache.solr.client.solrj.embedded.SolrExampleJettyTest.beforeTest(Sol
>> rExampleJettyTest.java:37)
>> > Caused by: java.lang.RuntimeException: Cannot find resource: solr/conf
>> > at
>> org.apache.solr.SolrTestCaseJ4.getFile(SolrTestCaseJ4.java:1101)
>> > at
>> org.apache.solr.util.ExternalPaths.determineSourceHome(ExternalPaths.java
>> :40)
>> > at
>> org.apache.solr.util.ExternalPaths.<clinit>(ExternalPaths.java:30)
>> >
>> >
>> >
>> FAILED: junit.framework.TestSuite.org.apache.solr.client.solrj.embedded.
>> SolrExampleStreamingTest
>> >
>> > Error Message:
>> > Could not initialize class org.apache.solr.util.ExternalPaths
>> >
>> > Stack Trace:
>> > java.lang.NoClassDefFoundError: Could not initialize class
>> org.apache.solr.util.ExternalPaths
>> > at
>> org.apache.solr.client.solrj.embedded.SolrExampleStreamingTest.beforeTest
>> (SolrExampleStreamingTest.java:36)
>> >
>> >
>> >
>> FAILED: junit.framework.TestSuite.org.apache.solr.client.solrj.response.
>> TermsResponseTest
>> >
>> > Error Message:
>> > Could not initialize class org.apache.solr.util.ExternalPaths
>> >
>> > Stack Trace:
>> > java.lang.NoClassDefFoundError: Could not initialize class
>> org.apache.solr.util.ExternalPaths
>> > at
>> org.apache.solr.client.solrj.response.TermsResponseTest.beforeTest(TermsR
>> esponseTest.java:38)
>> >
>> >
>> >
>> FAILED: junit.framework.TestSuite.org.apache.solr.client.solrj.response.
>> TestSpellCheckResponse
>> >
>> > Error Message:
>> > Could not initialize class org.apache.solr.util.ExternalPaths
>> >
>> > Stack Trace:
>> > java.lang.NoClassDefFoundError: Could not initialize class
>> org.apache.solr.util.ExternalPaths
>> > at
>> org.apache.solr.client.solrj.response.TestSpellCheckResponse.beforeTest(T
>> estSpellCheckResponse.java:44)
>> >
>> >
>> >
>> >
>> > Build Log (for compile errors):
>> > [...truncated 13804 lines...]
>> >
>> >
>> >
>> > ---------------------------------------------------------------------
>> > To unsubscribe, e-mail: dev-unsubscribe@lucene.apache.org
>> > For additional commands, e-mail: dev-help@lucene.apache.org
>> >
>> >
>>
>>
>>
>> --
>> lucidimagination.com
>>
>> ---------------------------------------------------------------------
>> To unsubscribe, e-mail: dev-unsubscribe@lucene.apache.org
>> For additional commands, e-mail: dev-help@lucene.apache.org
>
>
---------------------------------------------------------------------
To unsubscribe, e-mail: dev-unsubscribe@lucene.apache.org
For additional commands, e-mail: dev-help@lucene.apache.org
RE: [JENKINS] Lucene-Solr-tests-only-3.x - Build # 9695 - Failure
Posted by Uwe Schindler <uw...@thetaphi.de>.
OK,
This was just a response to your mail, because for me it looked like you were not able to reproduce this locally and wanted to go to Hudson server.
Uwe
-----
Uwe Schindler
H.-H.-Meier-Allee 63, D-28213 Bremen
http://www.thetaphi.de
eMail: uwe@thetaphi.de
> -----Original Message-----
> From: Steven A Rowe [mailto:sarowe@syr.edu]
> Sent: Friday, July 22, 2011 7:23 PM
> To: dev@lucene.apache.org
> Subject: RE: [JENKINS] Lucene-Solr-tests-only-3.x - Build # 9695 - Failure
>
> Uwe, the problem is replicable locally, both by Yonik and by me, so I don't
> think that will help.
>
> > -----Original Message-----
> > From: Uwe Schindler [mailto:uwe@thetaphi.de]
> > Sent: Friday, July 22, 2011 1:22 PM
> > To: dev@lucene.apache.org
> > Subject: RE: [JENKINS] Lucene-Solr-tests-only-3.x - Build # 9695 -
> > Failure
> >
> > Just drop the workspace from the GUI!
> >
> > -----
> > Uwe Schindler
> > H.-H.-Meier-Allee 63, D-28213 Bremen
> > http://www.thetaphi.de
> > eMail: uwe@thetaphi.de
> >
> >
> > > -----Original Message-----
> > > From: Steven A Rowe [mailto:sarowe@syr.edu]
> > > Sent: Friday, July 22, 2011 7:01 PM
> > > To: dev@lucene.apache.org
> > > Subject: RE: [JENKINS] Lucene-Solr-tests-only-3.x - Build # 9695 -
> > Failure
> > >
> > > I'll take a look at the checkout dir on lucene.zones.apache.org
> > >
> > > > -----Original Message-----
> > > > From: Robert Muir [mailto:rcmuir@gmail.com]
> > > > Sent: Friday, July 22, 2011 12:59 PM
> > > > To: dev@lucene.apache.org
> > > > Subject: Re: [JENKINS] Lucene-Solr-tests-only-3.x - Build # 9695 -
> > > > Failure
> > > >
> > > > maybe hudson didnt 'clean' itself properly or something?
> > > >
> > > >
> > > > On Fri, Jul 22, 2011 at 12:55 PM, Steven A Rowe <sa...@syr.edu>
> > wrote:
> > > > > Yeah, almost certainly.
> > > > >
> > > > > All Lucene/Solr tests succeeded for me locally before I
> > > > > committed,
> > > > though, via 'ant clean test' at the top level.
> > > > >
> > > > >> -----Original Message-----
> > > > >> From: Robert Muir [mailto:rcmuir@gmail.com]
> > > > >> Sent: Friday, July 22, 2011 12:54 PM
> > > > >> To: dev@lucene.apache.org
> > > > >> Subject: Re: [JENKINS] Lucene-Solr-tests-only-3.x - Build #
> > > > >> 9695 - Failure
> > > > >>
> > > > >> [junit] Caused by: java.lang.RuntimeException: Cannot find
> > > > >> resource: solr/conf
> > > > >>
> > > > >> Maybe related to https://issues.apache.org/jira/browse/SOLR-2659
> ?
> > > > >>
> > > > >> On Fri, Jul 22, 2011 at 12:51 PM, Apache Jenkins Server
> > > > >> <je...@builds.apache.org> wrote:
> > > > >> > Build: https://builds.apache.org/job/Lucene-Solr-tests-only-
> > > > 3.x/9695/
> > > > >> >
> > > > >> > 15 tests failed.
> > > > >> >
> > > > >>
> > > > FAILED:
> > > > junit.framework.TestSuite.org.apache.solr.client.solrj.SolrExamp
> > > > >> leBinaryTest
> > > > >> >
> > > > >> > Error Message:
> > > > >> > null
> > > > >> >
> > > > >> > Stack Trace:
> > > > >> > java.lang.ExceptionInInitializerError
> > > > >> > at
> > > > >>
> > > >
> > org.apache.solr.client.solrj.SolrExampleBinaryTest.beforeTest(SolrExam
> > > > ple
> > > > >> BinaryTest.java:36)
> > > > >> > Caused by: java.lang.RuntimeException: Cannot find resource:
> > > > solr/conf
> > > > >> > at
> > > > >> org.apache.solr.SolrTestCaseJ4.getFile(SolrTestCaseJ4.java:1101
> > > > >> )
> > > > >> > at
> > > > >>
> > > >
> > org.apache.solr.util.ExternalPaths.determineSourceHome(ExternalPaths.j
> > > > ava
> > > > >> :40)
> > > > >> > at
> > > > >> org.apache.solr.util.ExternalPaths.<clinit>(ExternalPaths.java:
> > > > >> 30)
> > > > >> >
> > > > >> >
> > > > >> >
> > > > >>
> > > > FAILED:
> > > > junit.framework.TestSuite.org.apache.solr.client.solrj.TestBatch
> > > > >> Update
> > > > >> >
> > > > >> > Error Message:
> > > > >> > null
> > > > >> >
> > > > >> > Stack Trace:
> > > > >> > java.lang.ExceptionInInitializerError
> > > > >> > at
> > > > >>
> > > >
> > org.apache.solr.client.solrj.TestBatchUpdate.beforeTest(TestBatchUpdat
> > > > e.j
> > > > >> ava:43)
> > > > >> > Caused by: java.lang.RuntimeException: Cannot find resource:
> > > > solr/conf
> > > > >> > at
> > > > >> org.apache.solr.SolrTestCaseJ4.getFile(SolrTestCaseJ4.java:1101
> > > > >> )
> > > > >> > at
> > > > >>
> > > >
> > org.apache.solr.util.ExternalPaths.determineSourceHome(ExternalPaths.j
> > > > ava
> > > > >> :40)
> > > > >> > at
> > > > >> org.apache.solr.util.ExternalPaths.<clinit>(ExternalPaths.java:
> > > > >> 30)
> > > > >> >
> > > > >> >
> > > > >> >
> > > > FAILED:
> > org.apache.solr.client.solrj.embedded.JettyWebappTest.testJSP
> > > > >> >
> > > > >> > Error Message:
> > > > >> > Could not initialize class org.apache.solr.util.ExternalPaths
> > > > >> >
> > > > >> > Stack Trace:
> > > > >> > java.lang.NoClassDefFoundError: Could not initialize class
> > > > >> org.apache.solr.util.ExternalPaths
> > > > >> > at
> > > > >>
> > > >
> > >
> org.apache.solr.client.solrj.embedded.JettyWebappTest.setUp(JettyWeb
> > > ap
> > > > pTe
> > > > >> st.java:50)
> > > > >> > at
> > > > >>
> > > >
> > >
> org.apache.lucene.util.LuceneTestCase$LuceneTestCaseRunner.runChild(
> > > Lu
> > > > cen
> > > > >> eTestCase.java:1299)
> > > > >> > at
> > > > >>
> > > >
> > >
> org.apache.lucene.util.LuceneTestCase$LuceneTestCaseRunner.runChild(
> > > Lu
> > > > cen
> > > > >> eTestCase.java:1217)
> > > > >> >
> > > > >> >
> > > > >> >
> > > > >>
> > > > FAILED:
> > junit.framework.TestSuite.org.apache.solr.client.solrj.embedded.
> > > > >> LargeVolumeBinaryJettyTest
> > > > >> >
> > > > >> > Error Message:
> > > > >> > null
> > > > >> >
> > > > >> > Stack Trace:
> > > > >> > java.lang.ExceptionInInitializerError
> > > > >> > at
> > > > >>
> > > >
> > org.apache.solr.client.solrj.embedded.LargeVolumeBinaryJettyTest.befor
> > > > eTe
> > > > >> st(LargeVolumeBinaryJettyTest.java:30)
> > > > >> > Caused by: java.lang.RuntimeException: Cannot find resource:
> > > > solr/conf
> > > > >> > at
> > > > >> org.apache.solr.SolrTestCaseJ4.getFile(SolrTestCaseJ4.java:1101
> > > > >> )
> > > > >> > at
> > > > >>
> > > >
> > org.apache.solr.util.ExternalPaths.determineSourceHome(ExternalPaths.j
> > > > ava
> > > > >> :40)
> > > > >> > at
> > > > >> org.apache.solr.util.ExternalPaths.<clinit>(ExternalPaths.java:
> > > > >> 30)
> > > > >> >
> > > > >> >
> > > > >> >
> > > > >>
> > > > FAILED:
> > junit.framework.TestSuite.org.apache.solr.client.solrj.embedded.
> > > > >> LargeVolumeEmbeddedTest
> > > > >> >
> > > > >> > Error Message:
> > > > >> > Could not initialize class org.apache.solr.util.ExternalPaths
> > > > >> >
> > > > >> > Stack Trace:
> > > > >> > java.lang.NoClassDefFoundError: Could not initialize class
> > > > >> org.apache.solr.util.ExternalPaths
> > > > >> > at
> > > > >>
> > > >
> > >
> org.apache.solr.client.solrj.embedded.LargeVolumeEmbeddedTest.before
> > > T
> > > e
> > > > st(
> > > > >> LargeVolumeEmbeddedTest.java:27)
> > > > >> >
> > > > >> >
> > > > >> >
> > > > >>
> > > > FAILED:
> > junit.framework.TestSuite.org.apache.solr.client.solrj.embedded.
> > > > >> LargeVolumeJettyTest
> > > > >> >
> > > > >> > Error Message:
> > > > >> > null
> > > > >> >
> > > > >> > Stack Trace:
> > > > >> > java.lang.ExceptionInInitializerError
> > > > >> > at
> > > > >>
> > > >
> > org.apache.solr.client.solrj.embedded.LargeVolumeJettyTest.beforeTest(
> > > > Lar
> > > > >> geVolumeJettyTest.java:27)
> > > > >> > Caused by: java.lang.RuntimeException: Cannot find resource:
> > > > solr/conf
> > > > >> > at
> > > > >> org.apache.solr.SolrTestCaseJ4.getFile(SolrTestCaseJ4.java:1101
> > > > >> )
> > > > >> > at
> > > > >>
> > > >
> > org.apache.solr.util.ExternalPaths.determineSourceHome(ExternalPaths.j
> > > > ava
> > > > >> :40)
> > > > >> > at
> > > > >> org.apache.solr.util.ExternalPaths.<clinit>(ExternalPaths.java:
> > > > >> 30)
> > > > >> >
> > > > >> >
> > > > >> >
> > > > >>
> > > > FAILED:
> > > > org.apache.solr.client.solrj.embedded.MergeIndexesEmbeddedTest.t
> > > > >> estMergeIndexesByDirName
> > > > >> >
> > > > >> > Error Message:
> > > > >> > null
> > > > >> >
> > > > >> > Stack Trace:
> > > > >> > java.lang.ExceptionInInitializerError
> > > > >> > at
> > > > >>
> > > >
> > > org.apache.solr.client.solrj.MergeIndexesExampleTestBase.getSolrHome
> > > (M
> > > > erg
> > > > >> eIndexesExampleTestBase.java:44)
> > > > >> > at
> > > > >>
> > > >
> > org.apache.solr.client.solrj.MergeIndexesExampleTestBase.getSolrConfig
> > > > Fil
> > > > >> e(MergeIndexesExampleTestBase.java:54)
> > > > >> > at
> > > > >>
> > > >
> > org.apache.solr.util.AbstractSolrTestCase.setUp(AbstractSolrTestCase.j
> > > > ava
> > > > >> :137)
> > > > >> > at
> > > > >>
> > > >
> > org.apache.solr.client.solrj.SolrExampleTestBase.setUp(SolrExampleTest
> > > > Bas
> > > > >> e.java:43)
> > > > >> > at
> > > > >>
> > > >
> > >
> org.apache.solr.client.solrj.MergeIndexesExampleTestBase.setUp(Merge
> > > In
> > > > dex
> > > > >> esExampleTestBase.java:59)
> > > > >> > at
> > > > >>
> > > >
> > >
> org.apache.solr.client.solrj.embedded.MergeIndexesEmbeddedTest.setUp
> > > (
> > > M
> > > > erg
> > > > >> eIndexesEmbeddedTest.java:38)
> > > > >> > at
> > > > >>
> > > >
> > >
> org.apache.lucene.util.LuceneTestCase$LuceneTestCaseRunner.runChild(
> > > Lu
> > > > cen
> > > > >> eTestCase.java:1299)
> > > > >> > at
> > > > >>
> > > >
> > >
> org.apache.lucene.util.LuceneTestCase$LuceneTestCaseRunner.runChild(
> > > Lu
> > > > cen
> > > > >> eTestCase.java:1217)
> > > > >> > Caused by: java.lang.RuntimeException: Cannot find resource:
> > > > solr/conf
> > > > >> > at
> > > > >> org.apache.solr.SolrTestCaseJ4.getFile(SolrTestCaseJ4.java:1101
> > > > >> )
> > > > >> > at
> > > > >>
> > > >
> > org.apache.solr.util.ExternalPaths.determineSourceHome(ExternalPaths.j
> > > > ava
> > > > >> :40)
> > > > >> > at
> > > > >> org.apache.solr.util.ExternalPaths.<clinit>(ExternalPaths.java:
> > > > >> 30)
> > > > >> >
> > > > >> >
> > > > >> >
> > > > >>
> > > > FAILED:
> > > > org.apache.solr.client.solrj.embedded.MergeIndexesEmbeddedTest.t
> > > > >> estMergeIndexesByCoreName
> > > > >> >
> > > > >> > Error Message:
> > > > >> > Could not initialize class org.apache.solr.util.ExternalPaths
> > > > >> >
> > > > >> > Stack Trace:
> > > > >> > java.lang.NoClassDefFoundError: Could not initialize class
> > > > >> org.apache.solr.util.ExternalPaths
> > > > >> > at
> > > > >>
> > > >
> > > org.apache.solr.client.solrj.MergeIndexesExampleTestBase.getSolrHome
> > > (M
> > > > erg
> > > > >> eIndexesExampleTestBase.java:44)
> > > > >> > at
> > > > >>
> > > >
> > org.apache.solr.client.solrj.MergeIndexesExampleTestBase.getSolrConfig
> > > > Fil
> > > > >> e(MergeIndexesExampleTestBase.java:54)
> > > > >> > at
> > > > >>
> > > >
> > org.apache.solr.util.AbstractSolrTestCase.setUp(AbstractSolrTestCase.j
> > > > ava
> > > > >> :137)
> > > > >> > at
> > > > >>
> > > >
> > org.apache.solr.client.solrj.SolrExampleTestBase.setUp(SolrExampleTest
> > > > Bas
> > > > >> e.java:43)
> > > > >> > at
> > > > >>
> > > >
> > >
> org.apache.solr.client.solrj.MergeIndexesExampleTestBase.setUp(Merge
> > > In
> > > > dex
> > > > >> esExampleTestBase.java:59)
> > > > >> > at
> > > > >>
> > > >
> > >
> org.apache.solr.client.solrj.embedded.MergeIndexesEmbeddedTest.setUp
> > > (
> > > M
> > > > erg
> > > > >> eIndexesEmbeddedTest.java:38)
> > > > >> > at
> > > > >>
> > > >
> > >
> org.apache.lucene.util.LuceneTestCase$LuceneTestCaseRunner.runChild(
> > > Lu
> > > > cen
> > > > >> eTestCase.java:1299)
> > > > >> > at
> > > > >>
> > > >
> > >
> org.apache.lucene.util.LuceneTestCase$LuceneTestCaseRunner.runChild(
> > > Lu
> > > > cen
> > > > >> eTestCase.java:1217)
> > > > >> >
> > > > >> >
> > > > >> >
> > > > >>
> > > > FAILED:
> > > > org.apache.solr.client.solrj.embedded.MultiCoreEmbeddedTest.test
> > > > >> MultiCore
> > > > >> >
> > > > >> > Error Message:
> > > > >> > Could not initialize class org.apache.solr.util.ExternalPaths
> > > > >> >
> > > > >> > Stack Trace:
> > > > >> > java.lang.NoClassDefFoundError: Could not initialize class
> > > > >> org.apache.solr.util.ExternalPaths
> > > > >> > at
> > > > >>
> > > >
> > org.apache.solr.client.solrj.MultiCoreExampleTestBase.getSolrHome(Mult
> > > > iCo
> > > > >> reExampleTestBase.java:43)
> > > > >> > at
> > > > >>
> > > >
> > org.apache.solr.client.solrj.MultiCoreExampleTestBase.getSolrConfigFil
> > > > e(M
> > > > >> ultiCoreExampleTestBase.java:46)
> > > > >> > at
> > > > >>
> > > >
> > org.apache.solr.util.AbstractSolrTestCase.setUp(AbstractSolrTestCase.j
> > > > ava
> > > > >> :137)
> > > > >> > at
> > > > >>
> > > >
> > org.apache.solr.client.solrj.SolrExampleTestBase.setUp(SolrExampleTest
> > > > Bas
> > > > >> e.java:43)
> > > > >> > at
> > > > >>
> > > >
> > org.apache.solr.client.solrj.MultiCoreExampleTestBase.setUp(MultiCoreE
> > > > xam
> > > > >> pleTestBase.java:49)
> > > > >> > at
> > > > >>
> > > >
> > >
> org.apache.solr.client.solrj.embedded.MultiCoreEmbeddedTest.setUp(Mu
> > > lt
> > > > iCo
> > > > >> reEmbeddedTest.java:37)
> > > > >> > at
> > > > >>
> > > >
> > >
> org.apache.lucene.util.LuceneTestCase$LuceneTestCaseRunner.runChild(
> > > Lu
> > > > cen
> > > > >> eTestCase.java:1299)
> > > > >> > at
> > > > >>
> > > >
> > >
> org.apache.lucene.util.LuceneTestCase$LuceneTestCaseRunner.runChild(
> > > Lu
> > > > cen
> > > > >> eTestCase.java:1217)
> > > > >> >
> > > > >> >
> > > > >> >
> > > > >>
> > > > FAILED:
> > > org.apache.solr.client.solrj.embedded.MultiCoreExampleJettyTest.
> > > > >> testMultiCore
> > > > >> >
> > > > >> > Error Message:
> > > > >> > null
> > > > >> >
> > > > >> > Stack Trace:
> > > > >> > java.lang.ExceptionInInitializerError
> > > > >> > at
> > > > >>
> > > >
> > org.apache.solr.client.solrj.MultiCoreExampleTestBase.getSolrHome(Mult
> > > > iCo
> > > > >> reExampleTestBase.java:43)
> > > > >> > at
> > > > >>
> > > >
> > org.apache.solr.client.solrj.MultiCoreExampleTestBase.getSolrConfigFil
> > > > e(M
> > > > >> ultiCoreExampleTestBase.java:46)
> > > > >> > at
> > > > >>
> > > >
> > org.apache.solr.util.AbstractSolrTestCase.setUp(AbstractSolrTestCase.j
> > > > ava
> > > > >> :137)
> > > > >> > at
> > > > >>
> > > >
> > org.apache.solr.client.solrj.SolrExampleTestBase.setUp(SolrExampleTest
> > > > Bas
> > > > >> e.java:43)
> > > > >> > at
> > > > >>
> > > >
> > org.apache.solr.client.solrj.MultiCoreExampleTestBase.setUp(MultiCoreE
> > > > xam
> > > > >> pleTestBase.java:49)
> > > > >> > at
> > > > >>
> > > >
> > org.apache.solr.client.solrj.embedded.MultiCoreExampleJettyTest.setUp(
> > > > Mul
> > > > >> tiCoreExampleJettyTest.java:43)
> > > > >> > at
> > > > >>
> > > >
> > >
> org.apache.lucene.util.LuceneTestCase$LuceneTestCaseRunner.runChild(
> > > Lu
> > > > cen
> > > > >> eTestCase.java:1299)
> > > > >> > at
> > > > >>
> > > >
> > >
> org.apache.lucene.util.LuceneTestCase$LuceneTestCaseRunner.runChild(
> > > Lu
> > > > cen
> > > > >> eTestCase.java:1217)
> > > > >> > Caused by: java.lang.RuntimeException: Cannot find resource:
> > > > solr/conf
> > > > >> > at
> > > > >> org.apache.solr.SolrTestCaseJ4.getFile(SolrTestCaseJ4.java:1101
> > > > >> )
> > > > >> > at
> > > > >>
> > > >
> > org.apache.solr.util.ExternalPaths.determineSourceHome(ExternalPaths.j
> > > > ava
> > > > >> :40)
> > > > >> > at
> > > > >> org.apache.solr.util.ExternalPaths.<clinit>(ExternalPaths.java:
> > > > >> 30)
> > > > >> >
> > > > >> >
> > > > >> >
> > > > >>
> > > > FAILED:
> > junit.framework.TestSuite.org.apache.solr.client.solrj.embedded.
> > > > >> SolrExampleEmbeddedTest
> > > > >> >
> > > > >> > Error Message:
> > > > >> > Could not initialize class org.apache.solr.util.ExternalPaths
> > > > >> >
> > > > >> > Stack Trace:
> > > > >> > java.lang.NoClassDefFoundError: Could not initialize class
> > > > >> org.apache.solr.util.ExternalPaths
> > > > >> > at
> > > > >>
> > > >
> > >
> org.apache.solr.client.solrj.embedded.SolrExampleEmbeddedTest.before
> > > Te
> > > > st(
> > > > >> SolrExampleEmbeddedTest.java:34)
> > > > >> >
> > > > >> >
> > > > >> >
> > > > >>
> > > > FAILED:
> > junit.framework.TestSuite.org.apache.solr.client.solrj.embedded.
> > > > >> SolrExampleJettyTest
> > > > >> >
> > > > >> > Error Message:
> > > > >> > null
> > > > >> >
> > > > >> > Stack Trace:
> > > > >> > java.lang.ExceptionInInitializerError
> > > > >> > at
> > > > >>
> > > >
> > org.apache.solr.client.solrj.embedded.SolrExampleJettyTest.beforeTest(
> > > > Sol
> > > > >> rExampleJettyTest.java:37)
> > > > >> > Caused by: java.lang.RuntimeException: Cannot find resource:
> > > > solr/conf
> > > > >> > at
> > > > >> org.apache.solr.SolrTestCaseJ4.getFile(SolrTestCaseJ4.java:1101
> > > > >> )
> > > > >> > at
> > > > >>
> > > >
> > org.apache.solr.util.ExternalPaths.determineSourceHome(ExternalPaths.j
> > > > ava
> > > > >> :40)
> > > > >> > at
> > > > >> org.apache.solr.util.ExternalPaths.<clinit>(ExternalPaths.java:
> > > > >> 30)
> > > > >> >
> > > > >> >
> > > > >> >
> > > > >>
> > > > FAILED:
> > junit.framework.TestSuite.org.apache.solr.client.solrj.embedded.
> > > > >> SolrExampleStreamingTest
> > > > >> >
> > > > >> > Error Message:
> > > > >> > Could not initialize class org.apache.solr.util.ExternalPaths
> > > > >> >
> > > > >> > Stack Trace:
> > > > >> > java.lang.NoClassDefFoundError: Could not initialize class
> > > > >> org.apache.solr.util.ExternalPaths
> > > > >> > at
> > > > >>
> > > >
> > org.apache.solr.client.solrj.embedded.SolrExampleStreamingTest.beforeT
> > > > est
> > > > >> (SolrExampleStreamingTest.java:36)
> > > > >> >
> > > > >> >
> > > > >> >
> > > > >>
> > > > FAILED:
> > junit.framework.TestSuite.org.apache.solr.client.solrj.response.
> > > > >> TermsResponseTest
> > > > >> >
> > > > >> > Error Message:
> > > > >> > Could not initialize class org.apache.solr.util.ExternalPaths
> > > > >> >
> > > > >> > Stack Trace:
> > > > >> > java.lang.NoClassDefFoundError: Could not initialize class
> > > > >> org.apache.solr.util.ExternalPaths
> > > > >> > at
> > > > >>
> > > >
> > org.apache.solr.client.solrj.response.TermsResponseTest.beforeTest(Ter
> > > > msR
> > > > >> esponseTest.java:38)
> > > > >> >
> > > > >> >
> > > > >> >
> > > > >>
> > > > FAILED:
> > junit.framework.TestSuite.org.apache.solr.client.solrj.response.
> > > > >> TestSpellCheckResponse
> > > > >> >
> > > > >> > Error Message:
> > > > >> > Could not initialize class org.apache.solr.util.ExternalPaths
> > > > >> >
> > > > >> > Stack Trace:
> > > > >> > java.lang.NoClassDefFoundError: Could not initialize class
> > > > >> org.apache.solr.util.ExternalPaths
> > > > >> > at
> > > > >>
> > > >
> > org.apache.solr.client.solrj.response.TestSpellCheckResponse.beforeTes
> > > > t(T
> > > > >> estSpellCheckResponse.java:44)
> > > > >> >
> > > > >> >
> > > > >> >
> > > > >> >
> > > > >> > Build Log (for compile errors):
> > > > >> > [...truncated 13804 lines...]
> > > > >> >
> > > > >> >
> > > > >> >
> > > > >> > -------------------------------------------------------------
> > > > >> > ---
> > -
> > > > >> > ---
> > > > -
> > > > >> > To unsubscribe, e-mail: dev-unsubscribe@lucene.apache.org For
> > > > >> > additional commands, e-mail: dev-help@lucene.apache.org
> > > > >> >
> > > > >> >
> > > > >>
> > > > >>
> > > > >>
> > > > >> --
> > > > >> lucidimagination.com
> > > > >>
> > > > >> ---------------------------------------------------------------
> > > > >> ---
> > -
> > > > >> -- To unsubscribe, e-mail: dev-unsubscribe@lucene.apache.org
> > > > >> For additional commands, e-mail: dev-help@lucene.apache.org
> > > > >
> > > > >
> > > >
> > > >
> > > >
> > > > --
> > > > lucidimagination.com
> > > >
> > > > ------------------------------------------------------------------
> > > > --- To unsubscribe, e-mail: dev-unsubscribe@lucene.apache.org For
> > > > additional commands, e-mail: dev-help@lucene.apache.org
> >
> >
> >
> > ---------------------------------------------------------------------
> > To unsubscribe, e-mail: dev-unsubscribe@lucene.apache.org For
> > additional commands, e-mail: dev-help@lucene.apache.org
---------------------------------------------------------------------
To unsubscribe, e-mail: dev-unsubscribe@lucene.apache.org
For additional commands, e-mail: dev-help@lucene.apache.org
RE: [JENKINS] Lucene-Solr-tests-only-3.x - Build # 9695 - Failure
Posted by Steven A Rowe <sa...@syr.edu>.
Uwe, the problem is replicable locally, both by Yonik and by me, so I don't think that will help.
> -----Original Message-----
> From: Uwe Schindler [mailto:uwe@thetaphi.de]
> Sent: Friday, July 22, 2011 1:22 PM
> To: dev@lucene.apache.org
> Subject: RE: [JENKINS] Lucene-Solr-tests-only-3.x - Build # 9695 -
> Failure
>
> Just drop the workspace from the GUI!
>
> -----
> Uwe Schindler
> H.-H.-Meier-Allee 63, D-28213 Bremen
> http://www.thetaphi.de
> eMail: uwe@thetaphi.de
>
>
> > -----Original Message-----
> > From: Steven A Rowe [mailto:sarowe@syr.edu]
> > Sent: Friday, July 22, 2011 7:01 PM
> > To: dev@lucene.apache.org
> > Subject: RE: [JENKINS] Lucene-Solr-tests-only-3.x - Build # 9695 -
> Failure
> >
> > I'll take a look at the checkout dir on lucene.zones.apache.org
> >
> > > -----Original Message-----
> > > From: Robert Muir [mailto:rcmuir@gmail.com]
> > > Sent: Friday, July 22, 2011 12:59 PM
> > > To: dev@lucene.apache.org
> > > Subject: Re: [JENKINS] Lucene-Solr-tests-only-3.x - Build # 9695 -
> > > Failure
> > >
> > > maybe hudson didnt 'clean' itself properly or something?
> > >
> > >
> > > On Fri, Jul 22, 2011 at 12:55 PM, Steven A Rowe <sa...@syr.edu>
> wrote:
> > > > Yeah, almost certainly.
> > > >
> > > > All Lucene/Solr tests succeeded for me locally before I committed,
> > > though, via 'ant clean test' at the top level.
> > > >
> > > >> -----Original Message-----
> > > >> From: Robert Muir [mailto:rcmuir@gmail.com]
> > > >> Sent: Friday, July 22, 2011 12:54 PM
> > > >> To: dev@lucene.apache.org
> > > >> Subject: Re: [JENKINS] Lucene-Solr-tests-only-3.x - Build # 9695 -
> > > >> Failure
> > > >>
> > > >> [junit] Caused by: java.lang.RuntimeException: Cannot find
> > > >> resource: solr/conf
> > > >>
> > > >> Maybe related to https://issues.apache.org/jira/browse/SOLR-2659 ?
> > > >>
> > > >> On Fri, Jul 22, 2011 at 12:51 PM, Apache Jenkins Server
> > > >> <je...@builds.apache.org> wrote:
> > > >> > Build: https://builds.apache.org/job/Lucene-Solr-tests-only-
> > > 3.x/9695/
> > > >> >
> > > >> > 15 tests failed.
> > > >> >
> > > >>
> > > FAILED:
> > > junit.framework.TestSuite.org.apache.solr.client.solrj.SolrExamp
> > > >> leBinaryTest
> > > >> >
> > > >> > Error Message:
> > > >> > null
> > > >> >
> > > >> > Stack Trace:
> > > >> > java.lang.ExceptionInInitializerError
> > > >> > at
> > > >>
> > >
> org.apache.solr.client.solrj.SolrExampleBinaryTest.beforeTest(SolrExam
> > > ple
> > > >> BinaryTest.java:36)
> > > >> > Caused by: java.lang.RuntimeException: Cannot find resource:
> > > solr/conf
> > > >> > at
> > > >> org.apache.solr.SolrTestCaseJ4.getFile(SolrTestCaseJ4.java:1101)
> > > >> > at
> > > >>
> > >
> org.apache.solr.util.ExternalPaths.determineSourceHome(ExternalPaths.j
> > > ava
> > > >> :40)
> > > >> > at
> > > >> org.apache.solr.util.ExternalPaths.<clinit>(ExternalPaths.java:30)
> > > >> >
> > > >> >
> > > >> >
> > > >>
> > > FAILED:
> > > junit.framework.TestSuite.org.apache.solr.client.solrj.TestBatch
> > > >> Update
> > > >> >
> > > >> > Error Message:
> > > >> > null
> > > >> >
> > > >> > Stack Trace:
> > > >> > java.lang.ExceptionInInitializerError
> > > >> > at
> > > >>
> > >
> org.apache.solr.client.solrj.TestBatchUpdate.beforeTest(TestBatchUpdat
> > > e.j
> > > >> ava:43)
> > > >> > Caused by: java.lang.RuntimeException: Cannot find resource:
> > > solr/conf
> > > >> > at
> > > >> org.apache.solr.SolrTestCaseJ4.getFile(SolrTestCaseJ4.java:1101)
> > > >> > at
> > > >>
> > >
> org.apache.solr.util.ExternalPaths.determineSourceHome(ExternalPaths.j
> > > ava
> > > >> :40)
> > > >> > at
> > > >> org.apache.solr.util.ExternalPaths.<clinit>(ExternalPaths.java:30)
> > > >> >
> > > >> >
> > > >> >
> > > FAILED:
> org.apache.solr.client.solrj.embedded.JettyWebappTest.testJSP
> > > >> >
> > > >> > Error Message:
> > > >> > Could not initialize class org.apache.solr.util.ExternalPaths
> > > >> >
> > > >> > Stack Trace:
> > > >> > java.lang.NoClassDefFoundError: Could not initialize class
> > > >> org.apache.solr.util.ExternalPaths
> > > >> > at
> > > >>
> > >
> > org.apache.solr.client.solrj.embedded.JettyWebappTest.setUp(JettyWebap
> > > pTe
> > > >> st.java:50)
> > > >> > at
> > > >>
> > >
> > org.apache.lucene.util.LuceneTestCase$LuceneTestCaseRunner.runChild(Lu
> > > cen
> > > >> eTestCase.java:1299)
> > > >> > at
> > > >>
> > >
> > org.apache.lucene.util.LuceneTestCase$LuceneTestCaseRunner.runChild(Lu
> > > cen
> > > >> eTestCase.java:1217)
> > > >> >
> > > >> >
> > > >> >
> > > >>
> > > FAILED:
> junit.framework.TestSuite.org.apache.solr.client.solrj.embedded.
> > > >> LargeVolumeBinaryJettyTest
> > > >> >
> > > >> > Error Message:
> > > >> > null
> > > >> >
> > > >> > Stack Trace:
> > > >> > java.lang.ExceptionInInitializerError
> > > >> > at
> > > >>
> > >
> org.apache.solr.client.solrj.embedded.LargeVolumeBinaryJettyTest.befor
> > > eTe
> > > >> st(LargeVolumeBinaryJettyTest.java:30)
> > > >> > Caused by: java.lang.RuntimeException: Cannot find resource:
> > > solr/conf
> > > >> > at
> > > >> org.apache.solr.SolrTestCaseJ4.getFile(SolrTestCaseJ4.java:1101)
> > > >> > at
> > > >>
> > >
> org.apache.solr.util.ExternalPaths.determineSourceHome(ExternalPaths.j
> > > ava
> > > >> :40)
> > > >> > at
> > > >> org.apache.solr.util.ExternalPaths.<clinit>(ExternalPaths.java:30)
> > > >> >
> > > >> >
> > > >> >
> > > >>
> > > FAILED:
> junit.framework.TestSuite.org.apache.solr.client.solrj.embedded.
> > > >> LargeVolumeEmbeddedTest
> > > >> >
> > > >> > Error Message:
> > > >> > Could not initialize class org.apache.solr.util.ExternalPaths
> > > >> >
> > > >> > Stack Trace:
> > > >> > java.lang.NoClassDefFoundError: Could not initialize class
> > > >> org.apache.solr.util.ExternalPaths
> > > >> > at
> > > >>
> > >
> > org.apache.solr.client.solrj.embedded.LargeVolumeEmbeddedTest.beforeT
> > e
> > > st(
> > > >> LargeVolumeEmbeddedTest.java:27)
> > > >> >
> > > >> >
> > > >> >
> > > >>
> > > FAILED:
> junit.framework.TestSuite.org.apache.solr.client.solrj.embedded.
> > > >> LargeVolumeJettyTest
> > > >> >
> > > >> > Error Message:
> > > >> > null
> > > >> >
> > > >> > Stack Trace:
> > > >> > java.lang.ExceptionInInitializerError
> > > >> > at
> > > >>
> > >
> org.apache.solr.client.solrj.embedded.LargeVolumeJettyTest.beforeTest(
> > > Lar
> > > >> geVolumeJettyTest.java:27)
> > > >> > Caused by: java.lang.RuntimeException: Cannot find resource:
> > > solr/conf
> > > >> > at
> > > >> org.apache.solr.SolrTestCaseJ4.getFile(SolrTestCaseJ4.java:1101)
> > > >> > at
> > > >>
> > >
> org.apache.solr.util.ExternalPaths.determineSourceHome(ExternalPaths.j
> > > ava
> > > >> :40)
> > > >> > at
> > > >> org.apache.solr.util.ExternalPaths.<clinit>(ExternalPaths.java:30)
> > > >> >
> > > >> >
> > > >> >
> > > >>
> > > FAILED:
> > > org.apache.solr.client.solrj.embedded.MergeIndexesEmbeddedTest.t
> > > >> estMergeIndexesByDirName
> > > >> >
> > > >> > Error Message:
> > > >> > null
> > > >> >
> > > >> > Stack Trace:
> > > >> > java.lang.ExceptionInInitializerError
> > > >> > at
> > > >>
> > >
> > org.apache.solr.client.solrj.MergeIndexesExampleTestBase.getSolrHome(M
> > > erg
> > > >> eIndexesExampleTestBase.java:44)
> > > >> > at
> > > >>
> > >
> org.apache.solr.client.solrj.MergeIndexesExampleTestBase.getSolrConfig
> > > Fil
> > > >> e(MergeIndexesExampleTestBase.java:54)
> > > >> > at
> > > >>
> > >
> org.apache.solr.util.AbstractSolrTestCase.setUp(AbstractSolrTestCase.j
> > > ava
> > > >> :137)
> > > >> > at
> > > >>
> > >
> org.apache.solr.client.solrj.SolrExampleTestBase.setUp(SolrExampleTest
> > > Bas
> > > >> e.java:43)
> > > >> > at
> > > >>
> > >
> > org.apache.solr.client.solrj.MergeIndexesExampleTestBase.setUp(MergeIn
> > > dex
> > > >> esExampleTestBase.java:59)
> > > >> > at
> > > >>
> > >
> > org.apache.solr.client.solrj.embedded.MergeIndexesEmbeddedTest.setUp(
> > M
> > > erg
> > > >> eIndexesEmbeddedTest.java:38)
> > > >> > at
> > > >>
> > >
> > org.apache.lucene.util.LuceneTestCase$LuceneTestCaseRunner.runChild(Lu
> > > cen
> > > >> eTestCase.java:1299)
> > > >> > at
> > > >>
> > >
> > org.apache.lucene.util.LuceneTestCase$LuceneTestCaseRunner.runChild(Lu
> > > cen
> > > >> eTestCase.java:1217)
> > > >> > Caused by: java.lang.RuntimeException: Cannot find resource:
> > > solr/conf
> > > >> > at
> > > >> org.apache.solr.SolrTestCaseJ4.getFile(SolrTestCaseJ4.java:1101)
> > > >> > at
> > > >>
> > >
> org.apache.solr.util.ExternalPaths.determineSourceHome(ExternalPaths.j
> > > ava
> > > >> :40)
> > > >> > at
> > > >> org.apache.solr.util.ExternalPaths.<clinit>(ExternalPaths.java:30)
> > > >> >
> > > >> >
> > > >> >
> > > >>
> > > FAILED:
> > > org.apache.solr.client.solrj.embedded.MergeIndexesEmbeddedTest.t
> > > >> estMergeIndexesByCoreName
> > > >> >
> > > >> > Error Message:
> > > >> > Could not initialize class org.apache.solr.util.ExternalPaths
> > > >> >
> > > >> > Stack Trace:
> > > >> > java.lang.NoClassDefFoundError: Could not initialize class
> > > >> org.apache.solr.util.ExternalPaths
> > > >> > at
> > > >>
> > >
> > org.apache.solr.client.solrj.MergeIndexesExampleTestBase.getSolrHome(M
> > > erg
> > > >> eIndexesExampleTestBase.java:44)
> > > >> > at
> > > >>
> > >
> org.apache.solr.client.solrj.MergeIndexesExampleTestBase.getSolrConfig
> > > Fil
> > > >> e(MergeIndexesExampleTestBase.java:54)
> > > >> > at
> > > >>
> > >
> org.apache.solr.util.AbstractSolrTestCase.setUp(AbstractSolrTestCase.j
> > > ava
> > > >> :137)
> > > >> > at
> > > >>
> > >
> org.apache.solr.client.solrj.SolrExampleTestBase.setUp(SolrExampleTest
> > > Bas
> > > >> e.java:43)
> > > >> > at
> > > >>
> > >
> > org.apache.solr.client.solrj.MergeIndexesExampleTestBase.setUp(MergeIn
> > > dex
> > > >> esExampleTestBase.java:59)
> > > >> > at
> > > >>
> > >
> > org.apache.solr.client.solrj.embedded.MergeIndexesEmbeddedTest.setUp(
> > M
> > > erg
> > > >> eIndexesEmbeddedTest.java:38)
> > > >> > at
> > > >>
> > >
> > org.apache.lucene.util.LuceneTestCase$LuceneTestCaseRunner.runChild(Lu
> > > cen
> > > >> eTestCase.java:1299)
> > > >> > at
> > > >>
> > >
> > org.apache.lucene.util.LuceneTestCase$LuceneTestCaseRunner.runChild(Lu
> > > cen
> > > >> eTestCase.java:1217)
> > > >> >
> > > >> >
> > > >> >
> > > >>
> > > FAILED:
> > > org.apache.solr.client.solrj.embedded.MultiCoreEmbeddedTest.test
> > > >> MultiCore
> > > >> >
> > > >> > Error Message:
> > > >> > Could not initialize class org.apache.solr.util.ExternalPaths
> > > >> >
> > > >> > Stack Trace:
> > > >> > java.lang.NoClassDefFoundError: Could not initialize class
> > > >> org.apache.solr.util.ExternalPaths
> > > >> > at
> > > >>
> > >
> org.apache.solr.client.solrj.MultiCoreExampleTestBase.getSolrHome(Mult
> > > iCo
> > > >> reExampleTestBase.java:43)
> > > >> > at
> > > >>
> > >
> org.apache.solr.client.solrj.MultiCoreExampleTestBase.getSolrConfigFil
> > > e(M
> > > >> ultiCoreExampleTestBase.java:46)
> > > >> > at
> > > >>
> > >
> org.apache.solr.util.AbstractSolrTestCase.setUp(AbstractSolrTestCase.j
> > > ava
> > > >> :137)
> > > >> > at
> > > >>
> > >
> org.apache.solr.client.solrj.SolrExampleTestBase.setUp(SolrExampleTest
> > > Bas
> > > >> e.java:43)
> > > >> > at
> > > >>
> > >
> org.apache.solr.client.solrj.MultiCoreExampleTestBase.setUp(MultiCoreE
> > > xam
> > > >> pleTestBase.java:49)
> > > >> > at
> > > >>
> > >
> > org.apache.solr.client.solrj.embedded.MultiCoreEmbeddedTest.setUp(Mult
> > > iCo
> > > >> reEmbeddedTest.java:37)
> > > >> > at
> > > >>
> > >
> > org.apache.lucene.util.LuceneTestCase$LuceneTestCaseRunner.runChild(Lu
> > > cen
> > > >> eTestCase.java:1299)
> > > >> > at
> > > >>
> > >
> > org.apache.lucene.util.LuceneTestCase$LuceneTestCaseRunner.runChild(Lu
> > > cen
> > > >> eTestCase.java:1217)
> > > >> >
> > > >> >
> > > >> >
> > > >>
> > > FAILED:
> > org.apache.solr.client.solrj.embedded.MultiCoreExampleJettyTest.
> > > >> testMultiCore
> > > >> >
> > > >> > Error Message:
> > > >> > null
> > > >> >
> > > >> > Stack Trace:
> > > >> > java.lang.ExceptionInInitializerError
> > > >> > at
> > > >>
> > >
> org.apache.solr.client.solrj.MultiCoreExampleTestBase.getSolrHome(Mult
> > > iCo
> > > >> reExampleTestBase.java:43)
> > > >> > at
> > > >>
> > >
> org.apache.solr.client.solrj.MultiCoreExampleTestBase.getSolrConfigFil
> > > e(M
> > > >> ultiCoreExampleTestBase.java:46)
> > > >> > at
> > > >>
> > >
> org.apache.solr.util.AbstractSolrTestCase.setUp(AbstractSolrTestCase.j
> > > ava
> > > >> :137)
> > > >> > at
> > > >>
> > >
> org.apache.solr.client.solrj.SolrExampleTestBase.setUp(SolrExampleTest
> > > Bas
> > > >> e.java:43)
> > > >> > at
> > > >>
> > >
> org.apache.solr.client.solrj.MultiCoreExampleTestBase.setUp(MultiCoreE
> > > xam
> > > >> pleTestBase.java:49)
> > > >> > at
> > > >>
> > >
> org.apache.solr.client.solrj.embedded.MultiCoreExampleJettyTest.setUp(
> > > Mul
> > > >> tiCoreExampleJettyTest.java:43)
> > > >> > at
> > > >>
> > >
> > org.apache.lucene.util.LuceneTestCase$LuceneTestCaseRunner.runChild(Lu
> > > cen
> > > >> eTestCase.java:1299)
> > > >> > at
> > > >>
> > >
> > org.apache.lucene.util.LuceneTestCase$LuceneTestCaseRunner.runChild(Lu
> > > cen
> > > >> eTestCase.java:1217)
> > > >> > Caused by: java.lang.RuntimeException: Cannot find resource:
> > > solr/conf
> > > >> > at
> > > >> org.apache.solr.SolrTestCaseJ4.getFile(SolrTestCaseJ4.java:1101)
> > > >> > at
> > > >>
> > >
> org.apache.solr.util.ExternalPaths.determineSourceHome(ExternalPaths.j
> > > ava
> > > >> :40)
> > > >> > at
> > > >> org.apache.solr.util.ExternalPaths.<clinit>(ExternalPaths.java:30)
> > > >> >
> > > >> >
> > > >> >
> > > >>
> > > FAILED:
> junit.framework.TestSuite.org.apache.solr.client.solrj.embedded.
> > > >> SolrExampleEmbeddedTest
> > > >> >
> > > >> > Error Message:
> > > >> > Could not initialize class org.apache.solr.util.ExternalPaths
> > > >> >
> > > >> > Stack Trace:
> > > >> > java.lang.NoClassDefFoundError: Could not initialize class
> > > >> org.apache.solr.util.ExternalPaths
> > > >> > at
> > > >>
> > >
> > org.apache.solr.client.solrj.embedded.SolrExampleEmbeddedTest.beforeTe
> > > st(
> > > >> SolrExampleEmbeddedTest.java:34)
> > > >> >
> > > >> >
> > > >> >
> > > >>
> > > FAILED:
> junit.framework.TestSuite.org.apache.solr.client.solrj.embedded.
> > > >> SolrExampleJettyTest
> > > >> >
> > > >> > Error Message:
> > > >> > null
> > > >> >
> > > >> > Stack Trace:
> > > >> > java.lang.ExceptionInInitializerError
> > > >> > at
> > > >>
> > >
> org.apache.solr.client.solrj.embedded.SolrExampleJettyTest.beforeTest(
> > > Sol
> > > >> rExampleJettyTest.java:37)
> > > >> > Caused by: java.lang.RuntimeException: Cannot find resource:
> > > solr/conf
> > > >> > at
> > > >> org.apache.solr.SolrTestCaseJ4.getFile(SolrTestCaseJ4.java:1101)
> > > >> > at
> > > >>
> > >
> org.apache.solr.util.ExternalPaths.determineSourceHome(ExternalPaths.j
> > > ava
> > > >> :40)
> > > >> > at
> > > >> org.apache.solr.util.ExternalPaths.<clinit>(ExternalPaths.java:30)
> > > >> >
> > > >> >
> > > >> >
> > > >>
> > > FAILED:
> junit.framework.TestSuite.org.apache.solr.client.solrj.embedded.
> > > >> SolrExampleStreamingTest
> > > >> >
> > > >> > Error Message:
> > > >> > Could not initialize class org.apache.solr.util.ExternalPaths
> > > >> >
> > > >> > Stack Trace:
> > > >> > java.lang.NoClassDefFoundError: Could not initialize class
> > > >> org.apache.solr.util.ExternalPaths
> > > >> > at
> > > >>
> > >
> org.apache.solr.client.solrj.embedded.SolrExampleStreamingTest.beforeT
> > > est
> > > >> (SolrExampleStreamingTest.java:36)
> > > >> >
> > > >> >
> > > >> >
> > > >>
> > > FAILED:
> junit.framework.TestSuite.org.apache.solr.client.solrj.response.
> > > >> TermsResponseTest
> > > >> >
> > > >> > Error Message:
> > > >> > Could not initialize class org.apache.solr.util.ExternalPaths
> > > >> >
> > > >> > Stack Trace:
> > > >> > java.lang.NoClassDefFoundError: Could not initialize class
> > > >> org.apache.solr.util.ExternalPaths
> > > >> > at
> > > >>
> > >
> org.apache.solr.client.solrj.response.TermsResponseTest.beforeTest(Ter
> > > msR
> > > >> esponseTest.java:38)
> > > >> >
> > > >> >
> > > >> >
> > > >>
> > > FAILED:
> junit.framework.TestSuite.org.apache.solr.client.solrj.response.
> > > >> TestSpellCheckResponse
> > > >> >
> > > >> > Error Message:
> > > >> > Could not initialize class org.apache.solr.util.ExternalPaths
> > > >> >
> > > >> > Stack Trace:
> > > >> > java.lang.NoClassDefFoundError: Could not initialize class
> > > >> org.apache.solr.util.ExternalPaths
> > > >> > at
> > > >>
> > >
> org.apache.solr.client.solrj.response.TestSpellCheckResponse.beforeTes
> > > t(T
> > > >> estSpellCheckResponse.java:44)
> > > >> >
> > > >> >
> > > >> >
> > > >> >
> > > >> > Build Log (for compile errors):
> > > >> > [...truncated 13804 lines...]
> > > >> >
> > > >> >
> > > >> >
> > > >> > ----------------------------------------------------------------
> -
> > > >> > ---
> > > -
> > > >> > To unsubscribe, e-mail: dev-unsubscribe@lucene.apache.org For
> > > >> > additional commands, e-mail: dev-help@lucene.apache.org
> > > >> >
> > > >> >
> > > >>
> > > >>
> > > >>
> > > >> --
> > > >> lucidimagination.com
> > > >>
> > > >> ------------------------------------------------------------------
> -
> > > >> -- To unsubscribe, e-mail: dev-unsubscribe@lucene.apache.org For
> > > >> additional commands, e-mail: dev-help@lucene.apache.org
> > > >
> > > >
> > >
> > >
> > >
> > > --
> > > lucidimagination.com
> > >
> > > ---------------------------------------------------------------------
> > > To unsubscribe, e-mail: dev-unsubscribe@lucene.apache.org For
> > > additional commands, e-mail: dev-help@lucene.apache.org
>
>
>
> ---------------------------------------------------------------------
> To unsubscribe, e-mail: dev-unsubscribe@lucene.apache.org
> For additional commands, e-mail: dev-help@lucene.apache.org
RE: [JENKINS] Lucene-Solr-tests-only-3.x - Build # 9695 - Failure
Posted by Uwe Schindler <uw...@thetaphi.de>.
Just drop the workspace from the GUI!
-----
Uwe Schindler
H.-H.-Meier-Allee 63, D-28213 Bremen
http://www.thetaphi.de
eMail: uwe@thetaphi.de
> -----Original Message-----
> From: Steven A Rowe [mailto:sarowe@syr.edu]
> Sent: Friday, July 22, 2011 7:01 PM
> To: dev@lucene.apache.org
> Subject: RE: [JENKINS] Lucene-Solr-tests-only-3.x - Build # 9695 - Failure
>
> I'll take a look at the checkout dir on lucene.zones.apache.org
>
> > -----Original Message-----
> > From: Robert Muir [mailto:rcmuir@gmail.com]
> > Sent: Friday, July 22, 2011 12:59 PM
> > To: dev@lucene.apache.org
> > Subject: Re: [JENKINS] Lucene-Solr-tests-only-3.x - Build # 9695 -
> > Failure
> >
> > maybe hudson didnt 'clean' itself properly or something?
> >
> >
> > On Fri, Jul 22, 2011 at 12:55 PM, Steven A Rowe <sa...@syr.edu> wrote:
> > > Yeah, almost certainly.
> > >
> > > All Lucene/Solr tests succeeded for me locally before I committed,
> > though, via 'ant clean test' at the top level.
> > >
> > >> -----Original Message-----
> > >> From: Robert Muir [mailto:rcmuir@gmail.com]
> > >> Sent: Friday, July 22, 2011 12:54 PM
> > >> To: dev@lucene.apache.org
> > >> Subject: Re: [JENKINS] Lucene-Solr-tests-only-3.x - Build # 9695 -
> > >> Failure
> > >>
> > >> [junit] Caused by: java.lang.RuntimeException: Cannot find
> > >> resource: solr/conf
> > >>
> > >> Maybe related to https://issues.apache.org/jira/browse/SOLR-2659 ?
> > >>
> > >> On Fri, Jul 22, 2011 at 12:51 PM, Apache Jenkins Server
> > >> <je...@builds.apache.org> wrote:
> > >> > Build: https://builds.apache.org/job/Lucene-Solr-tests-only-
> > 3.x/9695/
> > >> >
> > >> > 15 tests failed.
> > >> >
> > >>
> > FAILED:
> > junit.framework.TestSuite.org.apache.solr.client.solrj.SolrExamp
> > >> leBinaryTest
> > >> >
> > >> > Error Message:
> > >> > null
> > >> >
> > >> > Stack Trace:
> > >> > java.lang.ExceptionInInitializerError
> > >> > at
> > >>
> > org.apache.solr.client.solrj.SolrExampleBinaryTest.beforeTest(SolrExam
> > ple
> > >> BinaryTest.java:36)
> > >> > Caused by: java.lang.RuntimeException: Cannot find resource:
> > solr/conf
> > >> > at
> > >> org.apache.solr.SolrTestCaseJ4.getFile(SolrTestCaseJ4.java:1101)
> > >> > at
> > >>
> > org.apache.solr.util.ExternalPaths.determineSourceHome(ExternalPaths.j
> > ava
> > >> :40)
> > >> > at
> > >> org.apache.solr.util.ExternalPaths.<clinit>(ExternalPaths.java:30)
> > >> >
> > >> >
> > >> >
> > >>
> > FAILED:
> > junit.framework.TestSuite.org.apache.solr.client.solrj.TestBatch
> > >> Update
> > >> >
> > >> > Error Message:
> > >> > null
> > >> >
> > >> > Stack Trace:
> > >> > java.lang.ExceptionInInitializerError
> > >> > at
> > >>
> > org.apache.solr.client.solrj.TestBatchUpdate.beforeTest(TestBatchUpdat
> > e.j
> > >> ava:43)
> > >> > Caused by: java.lang.RuntimeException: Cannot find resource:
> > solr/conf
> > >> > at
> > >> org.apache.solr.SolrTestCaseJ4.getFile(SolrTestCaseJ4.java:1101)
> > >> > at
> > >>
> > org.apache.solr.util.ExternalPaths.determineSourceHome(ExternalPaths.j
> > ava
> > >> :40)
> > >> > at
> > >> org.apache.solr.util.ExternalPaths.<clinit>(ExternalPaths.java:30)
> > >> >
> > >> >
> > >> >
> > FAILED: org.apache.solr.client.solrj.embedded.JettyWebappTest.testJSP
> > >> >
> > >> > Error Message:
> > >> > Could not initialize class org.apache.solr.util.ExternalPaths
> > >> >
> > >> > Stack Trace:
> > >> > java.lang.NoClassDefFoundError: Could not initialize class
> > >> org.apache.solr.util.ExternalPaths
> > >> > at
> > >>
> >
> org.apache.solr.client.solrj.embedded.JettyWebappTest.setUp(JettyWebap
> > pTe
> > >> st.java:50)
> > >> > at
> > >>
> >
> org.apache.lucene.util.LuceneTestCase$LuceneTestCaseRunner.runChild(Lu
> > cen
> > >> eTestCase.java:1299)
> > >> > at
> > >>
> >
> org.apache.lucene.util.LuceneTestCase$LuceneTestCaseRunner.runChild(Lu
> > cen
> > >> eTestCase.java:1217)
> > >> >
> > >> >
> > >> >
> > >>
> > FAILED: junit.framework.TestSuite.org.apache.solr.client.solrj.embedded.
> > >> LargeVolumeBinaryJettyTest
> > >> >
> > >> > Error Message:
> > >> > null
> > >> >
> > >> > Stack Trace:
> > >> > java.lang.ExceptionInInitializerError
> > >> > at
> > >>
> > org.apache.solr.client.solrj.embedded.LargeVolumeBinaryJettyTest.befor
> > eTe
> > >> st(LargeVolumeBinaryJettyTest.java:30)
> > >> > Caused by: java.lang.RuntimeException: Cannot find resource:
> > solr/conf
> > >> > at
> > >> org.apache.solr.SolrTestCaseJ4.getFile(SolrTestCaseJ4.java:1101)
> > >> > at
> > >>
> > org.apache.solr.util.ExternalPaths.determineSourceHome(ExternalPaths.j
> > ava
> > >> :40)
> > >> > at
> > >> org.apache.solr.util.ExternalPaths.<clinit>(ExternalPaths.java:30)
> > >> >
> > >> >
> > >> >
> > >>
> > FAILED: junit.framework.TestSuite.org.apache.solr.client.solrj.embedded.
> > >> LargeVolumeEmbeddedTest
> > >> >
> > >> > Error Message:
> > >> > Could not initialize class org.apache.solr.util.ExternalPaths
> > >> >
> > >> > Stack Trace:
> > >> > java.lang.NoClassDefFoundError: Could not initialize class
> > >> org.apache.solr.util.ExternalPaths
> > >> > at
> > >>
> >
> org.apache.solr.client.solrj.embedded.LargeVolumeEmbeddedTest.beforeT
> e
> > st(
> > >> LargeVolumeEmbeddedTest.java:27)
> > >> >
> > >> >
> > >> >
> > >>
> > FAILED: junit.framework.TestSuite.org.apache.solr.client.solrj.embedded.
> > >> LargeVolumeJettyTest
> > >> >
> > >> > Error Message:
> > >> > null
> > >> >
> > >> > Stack Trace:
> > >> > java.lang.ExceptionInInitializerError
> > >> > at
> > >>
> > org.apache.solr.client.solrj.embedded.LargeVolumeJettyTest.beforeTest(
> > Lar
> > >> geVolumeJettyTest.java:27)
> > >> > Caused by: java.lang.RuntimeException: Cannot find resource:
> > solr/conf
> > >> > at
> > >> org.apache.solr.SolrTestCaseJ4.getFile(SolrTestCaseJ4.java:1101)
> > >> > at
> > >>
> > org.apache.solr.util.ExternalPaths.determineSourceHome(ExternalPaths.j
> > ava
> > >> :40)
> > >> > at
> > >> org.apache.solr.util.ExternalPaths.<clinit>(ExternalPaths.java:30)
> > >> >
> > >> >
> > >> >
> > >>
> > FAILED:
> > org.apache.solr.client.solrj.embedded.MergeIndexesEmbeddedTest.t
> > >> estMergeIndexesByDirName
> > >> >
> > >> > Error Message:
> > >> > null
> > >> >
> > >> > Stack Trace:
> > >> > java.lang.ExceptionInInitializerError
> > >> > at
> > >>
> >
> org.apache.solr.client.solrj.MergeIndexesExampleTestBase.getSolrHome(M
> > erg
> > >> eIndexesExampleTestBase.java:44)
> > >> > at
> > >>
> > org.apache.solr.client.solrj.MergeIndexesExampleTestBase.getSolrConfig
> > Fil
> > >> e(MergeIndexesExampleTestBase.java:54)
> > >> > at
> > >>
> > org.apache.solr.util.AbstractSolrTestCase.setUp(AbstractSolrTestCase.j
> > ava
> > >> :137)
> > >> > at
> > >>
> > org.apache.solr.client.solrj.SolrExampleTestBase.setUp(SolrExampleTest
> > Bas
> > >> e.java:43)
> > >> > at
> > >>
> >
> org.apache.solr.client.solrj.MergeIndexesExampleTestBase.setUp(MergeIn
> > dex
> > >> esExampleTestBase.java:59)
> > >> > at
> > >>
> >
> org.apache.solr.client.solrj.embedded.MergeIndexesEmbeddedTest.setUp(
> M
> > erg
> > >> eIndexesEmbeddedTest.java:38)
> > >> > at
> > >>
> >
> org.apache.lucene.util.LuceneTestCase$LuceneTestCaseRunner.runChild(Lu
> > cen
> > >> eTestCase.java:1299)
> > >> > at
> > >>
> >
> org.apache.lucene.util.LuceneTestCase$LuceneTestCaseRunner.runChild(Lu
> > cen
> > >> eTestCase.java:1217)
> > >> > Caused by: java.lang.RuntimeException: Cannot find resource:
> > solr/conf
> > >> > at
> > >> org.apache.solr.SolrTestCaseJ4.getFile(SolrTestCaseJ4.java:1101)
> > >> > at
> > >>
> > org.apache.solr.util.ExternalPaths.determineSourceHome(ExternalPaths.j
> > ava
> > >> :40)
> > >> > at
> > >> org.apache.solr.util.ExternalPaths.<clinit>(ExternalPaths.java:30)
> > >> >
> > >> >
> > >> >
> > >>
> > FAILED:
> > org.apache.solr.client.solrj.embedded.MergeIndexesEmbeddedTest.t
> > >> estMergeIndexesByCoreName
> > >> >
> > >> > Error Message:
> > >> > Could not initialize class org.apache.solr.util.ExternalPaths
> > >> >
> > >> > Stack Trace:
> > >> > java.lang.NoClassDefFoundError: Could not initialize class
> > >> org.apache.solr.util.ExternalPaths
> > >> > at
> > >>
> >
> org.apache.solr.client.solrj.MergeIndexesExampleTestBase.getSolrHome(M
> > erg
> > >> eIndexesExampleTestBase.java:44)
> > >> > at
> > >>
> > org.apache.solr.client.solrj.MergeIndexesExampleTestBase.getSolrConfig
> > Fil
> > >> e(MergeIndexesExampleTestBase.java:54)
> > >> > at
> > >>
> > org.apache.solr.util.AbstractSolrTestCase.setUp(AbstractSolrTestCase.j
> > ava
> > >> :137)
> > >> > at
> > >>
> > org.apache.solr.client.solrj.SolrExampleTestBase.setUp(SolrExampleTest
> > Bas
> > >> e.java:43)
> > >> > at
> > >>
> >
> org.apache.solr.client.solrj.MergeIndexesExampleTestBase.setUp(MergeIn
> > dex
> > >> esExampleTestBase.java:59)
> > >> > at
> > >>
> >
> org.apache.solr.client.solrj.embedded.MergeIndexesEmbeddedTest.setUp(
> M
> > erg
> > >> eIndexesEmbeddedTest.java:38)
> > >> > at
> > >>
> >
> org.apache.lucene.util.LuceneTestCase$LuceneTestCaseRunner.runChild(Lu
> > cen
> > >> eTestCase.java:1299)
> > >> > at
> > >>
> >
> org.apache.lucene.util.LuceneTestCase$LuceneTestCaseRunner.runChild(Lu
> > cen
> > >> eTestCase.java:1217)
> > >> >
> > >> >
> > >> >
> > >>
> > FAILED:
> > org.apache.solr.client.solrj.embedded.MultiCoreEmbeddedTest.test
> > >> MultiCore
> > >> >
> > >> > Error Message:
> > >> > Could not initialize class org.apache.solr.util.ExternalPaths
> > >> >
> > >> > Stack Trace:
> > >> > java.lang.NoClassDefFoundError: Could not initialize class
> > >> org.apache.solr.util.ExternalPaths
> > >> > at
> > >>
> > org.apache.solr.client.solrj.MultiCoreExampleTestBase.getSolrHome(Mult
> > iCo
> > >> reExampleTestBase.java:43)
> > >> > at
> > >>
> > org.apache.solr.client.solrj.MultiCoreExampleTestBase.getSolrConfigFil
> > e(M
> > >> ultiCoreExampleTestBase.java:46)
> > >> > at
> > >>
> > org.apache.solr.util.AbstractSolrTestCase.setUp(AbstractSolrTestCase.j
> > ava
> > >> :137)
> > >> > at
> > >>
> > org.apache.solr.client.solrj.SolrExampleTestBase.setUp(SolrExampleTest
> > Bas
> > >> e.java:43)
> > >> > at
> > >>
> > org.apache.solr.client.solrj.MultiCoreExampleTestBase.setUp(MultiCoreE
> > xam
> > >> pleTestBase.java:49)
> > >> > at
> > >>
> >
> org.apache.solr.client.solrj.embedded.MultiCoreEmbeddedTest.setUp(Mult
> > iCo
> > >> reEmbeddedTest.java:37)
> > >> > at
> > >>
> >
> org.apache.lucene.util.LuceneTestCase$LuceneTestCaseRunner.runChild(Lu
> > cen
> > >> eTestCase.java:1299)
> > >> > at
> > >>
> >
> org.apache.lucene.util.LuceneTestCase$LuceneTestCaseRunner.runChild(Lu
> > cen
> > >> eTestCase.java:1217)
> > >> >
> > >> >
> > >> >
> > >>
> > FAILED:
> org.apache.solr.client.solrj.embedded.MultiCoreExampleJettyTest.
> > >> testMultiCore
> > >> >
> > >> > Error Message:
> > >> > null
> > >> >
> > >> > Stack Trace:
> > >> > java.lang.ExceptionInInitializerError
> > >> > at
> > >>
> > org.apache.solr.client.solrj.MultiCoreExampleTestBase.getSolrHome(Mult
> > iCo
> > >> reExampleTestBase.java:43)
> > >> > at
> > >>
> > org.apache.solr.client.solrj.MultiCoreExampleTestBase.getSolrConfigFil
> > e(M
> > >> ultiCoreExampleTestBase.java:46)
> > >> > at
> > >>
> > org.apache.solr.util.AbstractSolrTestCase.setUp(AbstractSolrTestCase.j
> > ava
> > >> :137)
> > >> > at
> > >>
> > org.apache.solr.client.solrj.SolrExampleTestBase.setUp(SolrExampleTest
> > Bas
> > >> e.java:43)
> > >> > at
> > >>
> > org.apache.solr.client.solrj.MultiCoreExampleTestBase.setUp(MultiCoreE
> > xam
> > >> pleTestBase.java:49)
> > >> > at
> > >>
> > org.apache.solr.client.solrj.embedded.MultiCoreExampleJettyTest.setUp(
> > Mul
> > >> tiCoreExampleJettyTest.java:43)
> > >> > at
> > >>
> >
> org.apache.lucene.util.LuceneTestCase$LuceneTestCaseRunner.runChild(Lu
> > cen
> > >> eTestCase.java:1299)
> > >> > at
> > >>
> >
> org.apache.lucene.util.LuceneTestCase$LuceneTestCaseRunner.runChild(Lu
> > cen
> > >> eTestCase.java:1217)
> > >> > Caused by: java.lang.RuntimeException: Cannot find resource:
> > solr/conf
> > >> > at
> > >> org.apache.solr.SolrTestCaseJ4.getFile(SolrTestCaseJ4.java:1101)
> > >> > at
> > >>
> > org.apache.solr.util.ExternalPaths.determineSourceHome(ExternalPaths.j
> > ava
> > >> :40)
> > >> > at
> > >> org.apache.solr.util.ExternalPaths.<clinit>(ExternalPaths.java:30)
> > >> >
> > >> >
> > >> >
> > >>
> > FAILED: junit.framework.TestSuite.org.apache.solr.client.solrj.embedded.
> > >> SolrExampleEmbeddedTest
> > >> >
> > >> > Error Message:
> > >> > Could not initialize class org.apache.solr.util.ExternalPaths
> > >> >
> > >> > Stack Trace:
> > >> > java.lang.NoClassDefFoundError: Could not initialize class
> > >> org.apache.solr.util.ExternalPaths
> > >> > at
> > >>
> >
> org.apache.solr.client.solrj.embedded.SolrExampleEmbeddedTest.beforeTe
> > st(
> > >> SolrExampleEmbeddedTest.java:34)
> > >> >
> > >> >
> > >> >
> > >>
> > FAILED: junit.framework.TestSuite.org.apache.solr.client.solrj.embedded.
> > >> SolrExampleJettyTest
> > >> >
> > >> > Error Message:
> > >> > null
> > >> >
> > >> > Stack Trace:
> > >> > java.lang.ExceptionInInitializerError
> > >> > at
> > >>
> > org.apache.solr.client.solrj.embedded.SolrExampleJettyTest.beforeTest(
> > Sol
> > >> rExampleJettyTest.java:37)
> > >> > Caused by: java.lang.RuntimeException: Cannot find resource:
> > solr/conf
> > >> > at
> > >> org.apache.solr.SolrTestCaseJ4.getFile(SolrTestCaseJ4.java:1101)
> > >> > at
> > >>
> > org.apache.solr.util.ExternalPaths.determineSourceHome(ExternalPaths.j
> > ava
> > >> :40)
> > >> > at
> > >> org.apache.solr.util.ExternalPaths.<clinit>(ExternalPaths.java:30)
> > >> >
> > >> >
> > >> >
> > >>
> > FAILED: junit.framework.TestSuite.org.apache.solr.client.solrj.embedded.
> > >> SolrExampleStreamingTest
> > >> >
> > >> > Error Message:
> > >> > Could not initialize class org.apache.solr.util.ExternalPaths
> > >> >
> > >> > Stack Trace:
> > >> > java.lang.NoClassDefFoundError: Could not initialize class
> > >> org.apache.solr.util.ExternalPaths
> > >> > at
> > >>
> > org.apache.solr.client.solrj.embedded.SolrExampleStreamingTest.beforeT
> > est
> > >> (SolrExampleStreamingTest.java:36)
> > >> >
> > >> >
> > >> >
> > >>
> > FAILED: junit.framework.TestSuite.org.apache.solr.client.solrj.response.
> > >> TermsResponseTest
> > >> >
> > >> > Error Message:
> > >> > Could not initialize class org.apache.solr.util.ExternalPaths
> > >> >
> > >> > Stack Trace:
> > >> > java.lang.NoClassDefFoundError: Could not initialize class
> > >> org.apache.solr.util.ExternalPaths
> > >> > at
> > >>
> > org.apache.solr.client.solrj.response.TermsResponseTest.beforeTest(Ter
> > msR
> > >> esponseTest.java:38)
> > >> >
> > >> >
> > >> >
> > >>
> > FAILED: junit.framework.TestSuite.org.apache.solr.client.solrj.response.
> > >> TestSpellCheckResponse
> > >> >
> > >> > Error Message:
> > >> > Could not initialize class org.apache.solr.util.ExternalPaths
> > >> >
> > >> > Stack Trace:
> > >> > java.lang.NoClassDefFoundError: Could not initialize class
> > >> org.apache.solr.util.ExternalPaths
> > >> > at
> > >>
> > org.apache.solr.client.solrj.response.TestSpellCheckResponse.beforeTes
> > t(T
> > >> estSpellCheckResponse.java:44)
> > >> >
> > >> >
> > >> >
> > >> >
> > >> > Build Log (for compile errors):
> > >> > [...truncated 13804 lines...]
> > >> >
> > >> >
> > >> >
> > >> > -----------------------------------------------------------------
> > >> > ---
> > -
> > >> > To unsubscribe, e-mail: dev-unsubscribe@lucene.apache.org For
> > >> > additional commands, e-mail: dev-help@lucene.apache.org
> > >> >
> > >> >
> > >>
> > >>
> > >>
> > >> --
> > >> lucidimagination.com
> > >>
> > >> -------------------------------------------------------------------
> > >> -- To unsubscribe, e-mail: dev-unsubscribe@lucene.apache.org For
> > >> additional commands, e-mail: dev-help@lucene.apache.org
> > >
> > >
> >
> >
> >
> > --
> > lucidimagination.com
> >
> > ---------------------------------------------------------------------
> > To unsubscribe, e-mail: dev-unsubscribe@lucene.apache.org For
> > additional commands, e-mail: dev-help@lucene.apache.org
---------------------------------------------------------------------
To unsubscribe, e-mail: dev-unsubscribe@lucene.apache.org
For additional commands, e-mail: dev-help@lucene.apache.org
RE: [JENKINS] Lucene-Solr-tests-only-3.x - Build # 9695 - Failure
Posted by Steven A Rowe <sa...@syr.edu>.
I'll take a look at the checkout dir on lucene.zones.apache.org
> -----Original Message-----
> From: Robert Muir [mailto:rcmuir@gmail.com]
> Sent: Friday, July 22, 2011 12:59 PM
> To: dev@lucene.apache.org
> Subject: Re: [JENKINS] Lucene-Solr-tests-only-3.x - Build # 9695 -
> Failure
>
> maybe hudson didnt 'clean' itself properly or something?
>
>
> On Fri, Jul 22, 2011 at 12:55 PM, Steven A Rowe <sa...@syr.edu> wrote:
> > Yeah, almost certainly.
> >
> > All Lucene/Solr tests succeeded for me locally before I committed,
> though, via 'ant clean test' at the top level.
> >
> >> -----Original Message-----
> >> From: Robert Muir [mailto:rcmuir@gmail.com]
> >> Sent: Friday, July 22, 2011 12:54 PM
> >> To: dev@lucene.apache.org
> >> Subject: Re: [JENKINS] Lucene-Solr-tests-only-3.x - Build # 9695 -
> >> Failure
> >>
> >> [junit] Caused by: java.lang.RuntimeException: Cannot find
> >> resource: solr/conf
> >>
> >> Maybe related to https://issues.apache.org/jira/browse/SOLR-2659 ?
> >>
> >> On Fri, Jul 22, 2011 at 12:51 PM, Apache Jenkins Server
> >> <je...@builds.apache.org> wrote:
> >> > Build: https://builds.apache.org/job/Lucene-Solr-tests-only-
> 3.x/9695/
> >> >
> >> > 15 tests failed.
> >> >
> >>
> FAILED: junit.framework.TestSuite.org.apache.solr.client.solrj.SolrExamp
> >> leBinaryTest
> >> >
> >> > Error Message:
> >> > null
> >> >
> >> > Stack Trace:
> >> > java.lang.ExceptionInInitializerError
> >> > at
> >>
> org.apache.solr.client.solrj.SolrExampleBinaryTest.beforeTest(SolrExample
> >> BinaryTest.java:36)
> >> > Caused by: java.lang.RuntimeException: Cannot find resource:
> solr/conf
> >> > at
> >> org.apache.solr.SolrTestCaseJ4.getFile(SolrTestCaseJ4.java:1101)
> >> > at
> >>
> org.apache.solr.util.ExternalPaths.determineSourceHome(ExternalPaths.java
> >> :40)
> >> > at
> >> org.apache.solr.util.ExternalPaths.<clinit>(ExternalPaths.java:30)
> >> >
> >> >
> >> >
> >>
> FAILED: junit.framework.TestSuite.org.apache.solr.client.solrj.TestBatch
> >> Update
> >> >
> >> > Error Message:
> >> > null
> >> >
> >> > Stack Trace:
> >> > java.lang.ExceptionInInitializerError
> >> > at
> >>
> org.apache.solr.client.solrj.TestBatchUpdate.beforeTest(TestBatchUpdate.j
> >> ava:43)
> >> > Caused by: java.lang.RuntimeException: Cannot find resource:
> solr/conf
> >> > at
> >> org.apache.solr.SolrTestCaseJ4.getFile(SolrTestCaseJ4.java:1101)
> >> > at
> >>
> org.apache.solr.util.ExternalPaths.determineSourceHome(ExternalPaths.java
> >> :40)
> >> > at
> >> org.apache.solr.util.ExternalPaths.<clinit>(ExternalPaths.java:30)
> >> >
> >> >
> >> >
> FAILED: org.apache.solr.client.solrj.embedded.JettyWebappTest.testJSP
> >> >
> >> > Error Message:
> >> > Could not initialize class org.apache.solr.util.ExternalPaths
> >> >
> >> > Stack Trace:
> >> > java.lang.NoClassDefFoundError: Could not initialize class
> >> org.apache.solr.util.ExternalPaths
> >> > at
> >>
> org.apache.solr.client.solrj.embedded.JettyWebappTest.setUp(JettyWebappTe
> >> st.java:50)
> >> > at
> >>
> org.apache.lucene.util.LuceneTestCase$LuceneTestCaseRunner.runChild(Lucen
> >> eTestCase.java:1299)
> >> > at
> >>
> org.apache.lucene.util.LuceneTestCase$LuceneTestCaseRunner.runChild(Lucen
> >> eTestCase.java:1217)
> >> >
> >> >
> >> >
> >>
> FAILED: junit.framework.TestSuite.org.apache.solr.client.solrj.embedded.
> >> LargeVolumeBinaryJettyTest
> >> >
> >> > Error Message:
> >> > null
> >> >
> >> > Stack Trace:
> >> > java.lang.ExceptionInInitializerError
> >> > at
> >>
> org.apache.solr.client.solrj.embedded.LargeVolumeBinaryJettyTest.beforeTe
> >> st(LargeVolumeBinaryJettyTest.java:30)
> >> > Caused by: java.lang.RuntimeException: Cannot find resource:
> solr/conf
> >> > at
> >> org.apache.solr.SolrTestCaseJ4.getFile(SolrTestCaseJ4.java:1101)
> >> > at
> >>
> org.apache.solr.util.ExternalPaths.determineSourceHome(ExternalPaths.java
> >> :40)
> >> > at
> >> org.apache.solr.util.ExternalPaths.<clinit>(ExternalPaths.java:30)
> >> >
> >> >
> >> >
> >>
> FAILED: junit.framework.TestSuite.org.apache.solr.client.solrj.embedded.
> >> LargeVolumeEmbeddedTest
> >> >
> >> > Error Message:
> >> > Could not initialize class org.apache.solr.util.ExternalPaths
> >> >
> >> > Stack Trace:
> >> > java.lang.NoClassDefFoundError: Could not initialize class
> >> org.apache.solr.util.ExternalPaths
> >> > at
> >>
> org.apache.solr.client.solrj.embedded.LargeVolumeEmbeddedTest.beforeTest(
> >> LargeVolumeEmbeddedTest.java:27)
> >> >
> >> >
> >> >
> >>
> FAILED: junit.framework.TestSuite.org.apache.solr.client.solrj.embedded.
> >> LargeVolumeJettyTest
> >> >
> >> > Error Message:
> >> > null
> >> >
> >> > Stack Trace:
> >> > java.lang.ExceptionInInitializerError
> >> > at
> >>
> org.apache.solr.client.solrj.embedded.LargeVolumeJettyTest.beforeTest(Lar
> >> geVolumeJettyTest.java:27)
> >> > Caused by: java.lang.RuntimeException: Cannot find resource:
> solr/conf
> >> > at
> >> org.apache.solr.SolrTestCaseJ4.getFile(SolrTestCaseJ4.java:1101)
> >> > at
> >>
> org.apache.solr.util.ExternalPaths.determineSourceHome(ExternalPaths.java
> >> :40)
> >> > at
> >> org.apache.solr.util.ExternalPaths.<clinit>(ExternalPaths.java:30)
> >> >
> >> >
> >> >
> >>
> FAILED: org.apache.solr.client.solrj.embedded.MergeIndexesEmbeddedTest.t
> >> estMergeIndexesByDirName
> >> >
> >> > Error Message:
> >> > null
> >> >
> >> > Stack Trace:
> >> > java.lang.ExceptionInInitializerError
> >> > at
> >>
> org.apache.solr.client.solrj.MergeIndexesExampleTestBase.getSolrHome(Merg
> >> eIndexesExampleTestBase.java:44)
> >> > at
> >>
> org.apache.solr.client.solrj.MergeIndexesExampleTestBase.getSolrConfigFil
> >> e(MergeIndexesExampleTestBase.java:54)
> >> > at
> >>
> org.apache.solr.util.AbstractSolrTestCase.setUp(AbstractSolrTestCase.java
> >> :137)
> >> > at
> >>
> org.apache.solr.client.solrj.SolrExampleTestBase.setUp(SolrExampleTestBas
> >> e.java:43)
> >> > at
> >>
> org.apache.solr.client.solrj.MergeIndexesExampleTestBase.setUp(MergeIndex
> >> esExampleTestBase.java:59)
> >> > at
> >>
> org.apache.solr.client.solrj.embedded.MergeIndexesEmbeddedTest.setUp(Merg
> >> eIndexesEmbeddedTest.java:38)
> >> > at
> >>
> org.apache.lucene.util.LuceneTestCase$LuceneTestCaseRunner.runChild(Lucen
> >> eTestCase.java:1299)
> >> > at
> >>
> org.apache.lucene.util.LuceneTestCase$LuceneTestCaseRunner.runChild(Lucen
> >> eTestCase.java:1217)
> >> > Caused by: java.lang.RuntimeException: Cannot find resource:
> solr/conf
> >> > at
> >> org.apache.solr.SolrTestCaseJ4.getFile(SolrTestCaseJ4.java:1101)
> >> > at
> >>
> org.apache.solr.util.ExternalPaths.determineSourceHome(ExternalPaths.java
> >> :40)
> >> > at
> >> org.apache.solr.util.ExternalPaths.<clinit>(ExternalPaths.java:30)
> >> >
> >> >
> >> >
> >>
> FAILED: org.apache.solr.client.solrj.embedded.MergeIndexesEmbeddedTest.t
> >> estMergeIndexesByCoreName
> >> >
> >> > Error Message:
> >> > Could not initialize class org.apache.solr.util.ExternalPaths
> >> >
> >> > Stack Trace:
> >> > java.lang.NoClassDefFoundError: Could not initialize class
> >> org.apache.solr.util.ExternalPaths
> >> > at
> >>
> org.apache.solr.client.solrj.MergeIndexesExampleTestBase.getSolrHome(Merg
> >> eIndexesExampleTestBase.java:44)
> >> > at
> >>
> org.apache.solr.client.solrj.MergeIndexesExampleTestBase.getSolrConfigFil
> >> e(MergeIndexesExampleTestBase.java:54)
> >> > at
> >>
> org.apache.solr.util.AbstractSolrTestCase.setUp(AbstractSolrTestCase.java
> >> :137)
> >> > at
> >>
> org.apache.solr.client.solrj.SolrExampleTestBase.setUp(SolrExampleTestBas
> >> e.java:43)
> >> > at
> >>
> org.apache.solr.client.solrj.MergeIndexesExampleTestBase.setUp(MergeIndex
> >> esExampleTestBase.java:59)
> >> > at
> >>
> org.apache.solr.client.solrj.embedded.MergeIndexesEmbeddedTest.setUp(Merg
> >> eIndexesEmbeddedTest.java:38)
> >> > at
> >>
> org.apache.lucene.util.LuceneTestCase$LuceneTestCaseRunner.runChild(Lucen
> >> eTestCase.java:1299)
> >> > at
> >>
> org.apache.lucene.util.LuceneTestCase$LuceneTestCaseRunner.runChild(Lucen
> >> eTestCase.java:1217)
> >> >
> >> >
> >> >
> >>
> FAILED: org.apache.solr.client.solrj.embedded.MultiCoreEmbeddedTest.test
> >> MultiCore
> >> >
> >> > Error Message:
> >> > Could not initialize class org.apache.solr.util.ExternalPaths
> >> >
> >> > Stack Trace:
> >> > java.lang.NoClassDefFoundError: Could not initialize class
> >> org.apache.solr.util.ExternalPaths
> >> > at
> >>
> org.apache.solr.client.solrj.MultiCoreExampleTestBase.getSolrHome(MultiCo
> >> reExampleTestBase.java:43)
> >> > at
> >>
> org.apache.solr.client.solrj.MultiCoreExampleTestBase.getSolrConfigFile(M
> >> ultiCoreExampleTestBase.java:46)
> >> > at
> >>
> org.apache.solr.util.AbstractSolrTestCase.setUp(AbstractSolrTestCase.java
> >> :137)
> >> > at
> >>
> org.apache.solr.client.solrj.SolrExampleTestBase.setUp(SolrExampleTestBas
> >> e.java:43)
> >> > at
> >>
> org.apache.solr.client.solrj.MultiCoreExampleTestBase.setUp(MultiCoreExam
> >> pleTestBase.java:49)
> >> > at
> >>
> org.apache.solr.client.solrj.embedded.MultiCoreEmbeddedTest.setUp(MultiCo
> >> reEmbeddedTest.java:37)
> >> > at
> >>
> org.apache.lucene.util.LuceneTestCase$LuceneTestCaseRunner.runChild(Lucen
> >> eTestCase.java:1299)
> >> > at
> >>
> org.apache.lucene.util.LuceneTestCase$LuceneTestCaseRunner.runChild(Lucen
> >> eTestCase.java:1217)
> >> >
> >> >
> >> >
> >>
> FAILED: org.apache.solr.client.solrj.embedded.MultiCoreExampleJettyTest.
> >> testMultiCore
> >> >
> >> > Error Message:
> >> > null
> >> >
> >> > Stack Trace:
> >> > java.lang.ExceptionInInitializerError
> >> > at
> >>
> org.apache.solr.client.solrj.MultiCoreExampleTestBase.getSolrHome(MultiCo
> >> reExampleTestBase.java:43)
> >> > at
> >>
> org.apache.solr.client.solrj.MultiCoreExampleTestBase.getSolrConfigFile(M
> >> ultiCoreExampleTestBase.java:46)
> >> > at
> >>
> org.apache.solr.util.AbstractSolrTestCase.setUp(AbstractSolrTestCase.java
> >> :137)
> >> > at
> >>
> org.apache.solr.client.solrj.SolrExampleTestBase.setUp(SolrExampleTestBas
> >> e.java:43)
> >> > at
> >>
> org.apache.solr.client.solrj.MultiCoreExampleTestBase.setUp(MultiCoreExam
> >> pleTestBase.java:49)
> >> > at
> >>
> org.apache.solr.client.solrj.embedded.MultiCoreExampleJettyTest.setUp(Mul
> >> tiCoreExampleJettyTest.java:43)
> >> > at
> >>
> org.apache.lucene.util.LuceneTestCase$LuceneTestCaseRunner.runChild(Lucen
> >> eTestCase.java:1299)
> >> > at
> >>
> org.apache.lucene.util.LuceneTestCase$LuceneTestCaseRunner.runChild(Lucen
> >> eTestCase.java:1217)
> >> > Caused by: java.lang.RuntimeException: Cannot find resource:
> solr/conf
> >> > at
> >> org.apache.solr.SolrTestCaseJ4.getFile(SolrTestCaseJ4.java:1101)
> >> > at
> >>
> org.apache.solr.util.ExternalPaths.determineSourceHome(ExternalPaths.java
> >> :40)
> >> > at
> >> org.apache.solr.util.ExternalPaths.<clinit>(ExternalPaths.java:30)
> >> >
> >> >
> >> >
> >>
> FAILED: junit.framework.TestSuite.org.apache.solr.client.solrj.embedded.
> >> SolrExampleEmbeddedTest
> >> >
> >> > Error Message:
> >> > Could not initialize class org.apache.solr.util.ExternalPaths
> >> >
> >> > Stack Trace:
> >> > java.lang.NoClassDefFoundError: Could not initialize class
> >> org.apache.solr.util.ExternalPaths
> >> > at
> >>
> org.apache.solr.client.solrj.embedded.SolrExampleEmbeddedTest.beforeTest(
> >> SolrExampleEmbeddedTest.java:34)
> >> >
> >> >
> >> >
> >>
> FAILED: junit.framework.TestSuite.org.apache.solr.client.solrj.embedded.
> >> SolrExampleJettyTest
> >> >
> >> > Error Message:
> >> > null
> >> >
> >> > Stack Trace:
> >> > java.lang.ExceptionInInitializerError
> >> > at
> >>
> org.apache.solr.client.solrj.embedded.SolrExampleJettyTest.beforeTest(Sol
> >> rExampleJettyTest.java:37)
> >> > Caused by: java.lang.RuntimeException: Cannot find resource:
> solr/conf
> >> > at
> >> org.apache.solr.SolrTestCaseJ4.getFile(SolrTestCaseJ4.java:1101)
> >> > at
> >>
> org.apache.solr.util.ExternalPaths.determineSourceHome(ExternalPaths.java
> >> :40)
> >> > at
> >> org.apache.solr.util.ExternalPaths.<clinit>(ExternalPaths.java:30)
> >> >
> >> >
> >> >
> >>
> FAILED: junit.framework.TestSuite.org.apache.solr.client.solrj.embedded.
> >> SolrExampleStreamingTest
> >> >
> >> > Error Message:
> >> > Could not initialize class org.apache.solr.util.ExternalPaths
> >> >
> >> > Stack Trace:
> >> > java.lang.NoClassDefFoundError: Could not initialize class
> >> org.apache.solr.util.ExternalPaths
> >> > at
> >>
> org.apache.solr.client.solrj.embedded.SolrExampleStreamingTest.beforeTest
> >> (SolrExampleStreamingTest.java:36)
> >> >
> >> >
> >> >
> >>
> FAILED: junit.framework.TestSuite.org.apache.solr.client.solrj.response.
> >> TermsResponseTest
> >> >
> >> > Error Message:
> >> > Could not initialize class org.apache.solr.util.ExternalPaths
> >> >
> >> > Stack Trace:
> >> > java.lang.NoClassDefFoundError: Could not initialize class
> >> org.apache.solr.util.ExternalPaths
> >> > at
> >>
> org.apache.solr.client.solrj.response.TermsResponseTest.beforeTest(TermsR
> >> esponseTest.java:38)
> >> >
> >> >
> >> >
> >>
> FAILED: junit.framework.TestSuite.org.apache.solr.client.solrj.response.
> >> TestSpellCheckResponse
> >> >
> >> > Error Message:
> >> > Could not initialize class org.apache.solr.util.ExternalPaths
> >> >
> >> > Stack Trace:
> >> > java.lang.NoClassDefFoundError: Could not initialize class
> >> org.apache.solr.util.ExternalPaths
> >> > at
> >>
> org.apache.solr.client.solrj.response.TestSpellCheckResponse.beforeTest(T
> >> estSpellCheckResponse.java:44)
> >> >
> >> >
> >> >
> >> >
> >> > Build Log (for compile errors):
> >> > [...truncated 13804 lines...]
> >> >
> >> >
> >> >
> >> > --------------------------------------------------------------------
> -
> >> > To unsubscribe, e-mail: dev-unsubscribe@lucene.apache.org
> >> > For additional commands, e-mail: dev-help@lucene.apache.org
> >> >
> >> >
> >>
> >>
> >>
> >> --
> >> lucidimagination.com
> >>
> >> ---------------------------------------------------------------------
> >> To unsubscribe, e-mail: dev-unsubscribe@lucene.apache.org
> >> For additional commands, e-mail: dev-help@lucene.apache.org
> >
> >
>
>
>
> --
> lucidimagination.com
>
> ---------------------------------------------------------------------
> To unsubscribe, e-mail: dev-unsubscribe@lucene.apache.org
> For additional commands, e-mail: dev-help@lucene.apache.org
Re: [JENKINS] Lucene-Solr-tests-only-3.x - Build # 9695 - Failure
Posted by Robert Muir <rc...@gmail.com>.
maybe hudson didnt 'clean' itself properly or something?
On Fri, Jul 22, 2011 at 12:55 PM, Steven A Rowe <sa...@syr.edu> wrote:
> Yeah, almost certainly.
>
> All Lucene/Solr tests succeeded for me locally before I committed, though, via 'ant clean test' at the top level.
>
>> -----Original Message-----
>> From: Robert Muir [mailto:rcmuir@gmail.com]
>> Sent: Friday, July 22, 2011 12:54 PM
>> To: dev@lucene.apache.org
>> Subject: Re: [JENKINS] Lucene-Solr-tests-only-3.x - Build # 9695 -
>> Failure
>>
>> [junit] Caused by: java.lang.RuntimeException: Cannot find
>> resource: solr/conf
>>
>> Maybe related to https://issues.apache.org/jira/browse/SOLR-2659 ?
>>
>> On Fri, Jul 22, 2011 at 12:51 PM, Apache Jenkins Server
>> <je...@builds.apache.org> wrote:
>> > Build: https://builds.apache.org/job/Lucene-Solr-tests-only-3.x/9695/
>> >
>> > 15 tests failed.
>> >
>> FAILED: junit.framework.TestSuite.org.apache.solr.client.solrj.SolrExamp
>> leBinaryTest
>> >
>> > Error Message:
>> > null
>> >
>> > Stack Trace:
>> > java.lang.ExceptionInInitializerError
>> > at
>> org.apache.solr.client.solrj.SolrExampleBinaryTest.beforeTest(SolrExample
>> BinaryTest.java:36)
>> > Caused by: java.lang.RuntimeException: Cannot find resource: solr/conf
>> > at
>> org.apache.solr.SolrTestCaseJ4.getFile(SolrTestCaseJ4.java:1101)
>> > at
>> org.apache.solr.util.ExternalPaths.determineSourceHome(ExternalPaths.java
>> :40)
>> > at
>> org.apache.solr.util.ExternalPaths.<clinit>(ExternalPaths.java:30)
>> >
>> >
>> >
>> FAILED: junit.framework.TestSuite.org.apache.solr.client.solrj.TestBatch
>> Update
>> >
>> > Error Message:
>> > null
>> >
>> > Stack Trace:
>> > java.lang.ExceptionInInitializerError
>> > at
>> org.apache.solr.client.solrj.TestBatchUpdate.beforeTest(TestBatchUpdate.j
>> ava:43)
>> > Caused by: java.lang.RuntimeException: Cannot find resource: solr/conf
>> > at
>> org.apache.solr.SolrTestCaseJ4.getFile(SolrTestCaseJ4.java:1101)
>> > at
>> org.apache.solr.util.ExternalPaths.determineSourceHome(ExternalPaths.java
>> :40)
>> > at
>> org.apache.solr.util.ExternalPaths.<clinit>(ExternalPaths.java:30)
>> >
>> >
>> > FAILED: org.apache.solr.client.solrj.embedded.JettyWebappTest.testJSP
>> >
>> > Error Message:
>> > Could not initialize class org.apache.solr.util.ExternalPaths
>> >
>> > Stack Trace:
>> > java.lang.NoClassDefFoundError: Could not initialize class
>> org.apache.solr.util.ExternalPaths
>> > at
>> org.apache.solr.client.solrj.embedded.JettyWebappTest.setUp(JettyWebappTe
>> st.java:50)
>> > at
>> org.apache.lucene.util.LuceneTestCase$LuceneTestCaseRunner.runChild(Lucen
>> eTestCase.java:1299)
>> > at
>> org.apache.lucene.util.LuceneTestCase$LuceneTestCaseRunner.runChild(Lucen
>> eTestCase.java:1217)
>> >
>> >
>> >
>> FAILED: junit.framework.TestSuite.org.apache.solr.client.solrj.embedded.
>> LargeVolumeBinaryJettyTest
>> >
>> > Error Message:
>> > null
>> >
>> > Stack Trace:
>> > java.lang.ExceptionInInitializerError
>> > at
>> org.apache.solr.client.solrj.embedded.LargeVolumeBinaryJettyTest.beforeTe
>> st(LargeVolumeBinaryJettyTest.java:30)
>> > Caused by: java.lang.RuntimeException: Cannot find resource: solr/conf
>> > at
>> org.apache.solr.SolrTestCaseJ4.getFile(SolrTestCaseJ4.java:1101)
>> > at
>> org.apache.solr.util.ExternalPaths.determineSourceHome(ExternalPaths.java
>> :40)
>> > at
>> org.apache.solr.util.ExternalPaths.<clinit>(ExternalPaths.java:30)
>> >
>> >
>> >
>> FAILED: junit.framework.TestSuite.org.apache.solr.client.solrj.embedded.
>> LargeVolumeEmbeddedTest
>> >
>> > Error Message:
>> > Could not initialize class org.apache.solr.util.ExternalPaths
>> >
>> > Stack Trace:
>> > java.lang.NoClassDefFoundError: Could not initialize class
>> org.apache.solr.util.ExternalPaths
>> > at
>> org.apache.solr.client.solrj.embedded.LargeVolumeEmbeddedTest.beforeTest(
>> LargeVolumeEmbeddedTest.java:27)
>> >
>> >
>> >
>> FAILED: junit.framework.TestSuite.org.apache.solr.client.solrj.embedded.
>> LargeVolumeJettyTest
>> >
>> > Error Message:
>> > null
>> >
>> > Stack Trace:
>> > java.lang.ExceptionInInitializerError
>> > at
>> org.apache.solr.client.solrj.embedded.LargeVolumeJettyTest.beforeTest(Lar
>> geVolumeJettyTest.java:27)
>> > Caused by: java.lang.RuntimeException: Cannot find resource: solr/conf
>> > at
>> org.apache.solr.SolrTestCaseJ4.getFile(SolrTestCaseJ4.java:1101)
>> > at
>> org.apache.solr.util.ExternalPaths.determineSourceHome(ExternalPaths.java
>> :40)
>> > at
>> org.apache.solr.util.ExternalPaths.<clinit>(ExternalPaths.java:30)
>> >
>> >
>> >
>> FAILED: org.apache.solr.client.solrj.embedded.MergeIndexesEmbeddedTest.t
>> estMergeIndexesByDirName
>> >
>> > Error Message:
>> > null
>> >
>> > Stack Trace:
>> > java.lang.ExceptionInInitializerError
>> > at
>> org.apache.solr.client.solrj.MergeIndexesExampleTestBase.getSolrHome(Merg
>> eIndexesExampleTestBase.java:44)
>> > at
>> org.apache.solr.client.solrj.MergeIndexesExampleTestBase.getSolrConfigFil
>> e(MergeIndexesExampleTestBase.java:54)
>> > at
>> org.apache.solr.util.AbstractSolrTestCase.setUp(AbstractSolrTestCase.java
>> :137)
>> > at
>> org.apache.solr.client.solrj.SolrExampleTestBase.setUp(SolrExampleTestBas
>> e.java:43)
>> > at
>> org.apache.solr.client.solrj.MergeIndexesExampleTestBase.setUp(MergeIndex
>> esExampleTestBase.java:59)
>> > at
>> org.apache.solr.client.solrj.embedded.MergeIndexesEmbeddedTest.setUp(Merg
>> eIndexesEmbeddedTest.java:38)
>> > at
>> org.apache.lucene.util.LuceneTestCase$LuceneTestCaseRunner.runChild(Lucen
>> eTestCase.java:1299)
>> > at
>> org.apache.lucene.util.LuceneTestCase$LuceneTestCaseRunner.runChild(Lucen
>> eTestCase.java:1217)
>> > Caused by: java.lang.RuntimeException: Cannot find resource: solr/conf
>> > at
>> org.apache.solr.SolrTestCaseJ4.getFile(SolrTestCaseJ4.java:1101)
>> > at
>> org.apache.solr.util.ExternalPaths.determineSourceHome(ExternalPaths.java
>> :40)
>> > at
>> org.apache.solr.util.ExternalPaths.<clinit>(ExternalPaths.java:30)
>> >
>> >
>> >
>> FAILED: org.apache.solr.client.solrj.embedded.MergeIndexesEmbeddedTest.t
>> estMergeIndexesByCoreName
>> >
>> > Error Message:
>> > Could not initialize class org.apache.solr.util.ExternalPaths
>> >
>> > Stack Trace:
>> > java.lang.NoClassDefFoundError: Could not initialize class
>> org.apache.solr.util.ExternalPaths
>> > at
>> org.apache.solr.client.solrj.MergeIndexesExampleTestBase.getSolrHome(Merg
>> eIndexesExampleTestBase.java:44)
>> > at
>> org.apache.solr.client.solrj.MergeIndexesExampleTestBase.getSolrConfigFil
>> e(MergeIndexesExampleTestBase.java:54)
>> > at
>> org.apache.solr.util.AbstractSolrTestCase.setUp(AbstractSolrTestCase.java
>> :137)
>> > at
>> org.apache.solr.client.solrj.SolrExampleTestBase.setUp(SolrExampleTestBas
>> e.java:43)
>> > at
>> org.apache.solr.client.solrj.MergeIndexesExampleTestBase.setUp(MergeIndex
>> esExampleTestBase.java:59)
>> > at
>> org.apache.solr.client.solrj.embedded.MergeIndexesEmbeddedTest.setUp(Merg
>> eIndexesEmbeddedTest.java:38)
>> > at
>> org.apache.lucene.util.LuceneTestCase$LuceneTestCaseRunner.runChild(Lucen
>> eTestCase.java:1299)
>> > at
>> org.apache.lucene.util.LuceneTestCase$LuceneTestCaseRunner.runChild(Lucen
>> eTestCase.java:1217)
>> >
>> >
>> >
>> FAILED: org.apache.solr.client.solrj.embedded.MultiCoreEmbeddedTest.test
>> MultiCore
>> >
>> > Error Message:
>> > Could not initialize class org.apache.solr.util.ExternalPaths
>> >
>> > Stack Trace:
>> > java.lang.NoClassDefFoundError: Could not initialize class
>> org.apache.solr.util.ExternalPaths
>> > at
>> org.apache.solr.client.solrj.MultiCoreExampleTestBase.getSolrHome(MultiCo
>> reExampleTestBase.java:43)
>> > at
>> org.apache.solr.client.solrj.MultiCoreExampleTestBase.getSolrConfigFile(M
>> ultiCoreExampleTestBase.java:46)
>> > at
>> org.apache.solr.util.AbstractSolrTestCase.setUp(AbstractSolrTestCase.java
>> :137)
>> > at
>> org.apache.solr.client.solrj.SolrExampleTestBase.setUp(SolrExampleTestBas
>> e.java:43)
>> > at
>> org.apache.solr.client.solrj.MultiCoreExampleTestBase.setUp(MultiCoreExam
>> pleTestBase.java:49)
>> > at
>> org.apache.solr.client.solrj.embedded.MultiCoreEmbeddedTest.setUp(MultiCo
>> reEmbeddedTest.java:37)
>> > at
>> org.apache.lucene.util.LuceneTestCase$LuceneTestCaseRunner.runChild(Lucen
>> eTestCase.java:1299)
>> > at
>> org.apache.lucene.util.LuceneTestCase$LuceneTestCaseRunner.runChild(Lucen
>> eTestCase.java:1217)
>> >
>> >
>> >
>> FAILED: org.apache.solr.client.solrj.embedded.MultiCoreExampleJettyTest.
>> testMultiCore
>> >
>> > Error Message:
>> > null
>> >
>> > Stack Trace:
>> > java.lang.ExceptionInInitializerError
>> > at
>> org.apache.solr.client.solrj.MultiCoreExampleTestBase.getSolrHome(MultiCo
>> reExampleTestBase.java:43)
>> > at
>> org.apache.solr.client.solrj.MultiCoreExampleTestBase.getSolrConfigFile(M
>> ultiCoreExampleTestBase.java:46)
>> > at
>> org.apache.solr.util.AbstractSolrTestCase.setUp(AbstractSolrTestCase.java
>> :137)
>> > at
>> org.apache.solr.client.solrj.SolrExampleTestBase.setUp(SolrExampleTestBas
>> e.java:43)
>> > at
>> org.apache.solr.client.solrj.MultiCoreExampleTestBase.setUp(MultiCoreExam
>> pleTestBase.java:49)
>> > at
>> org.apache.solr.client.solrj.embedded.MultiCoreExampleJettyTest.setUp(Mul
>> tiCoreExampleJettyTest.java:43)
>> > at
>> org.apache.lucene.util.LuceneTestCase$LuceneTestCaseRunner.runChild(Lucen
>> eTestCase.java:1299)
>> > at
>> org.apache.lucene.util.LuceneTestCase$LuceneTestCaseRunner.runChild(Lucen
>> eTestCase.java:1217)
>> > Caused by: java.lang.RuntimeException: Cannot find resource: solr/conf
>> > at
>> org.apache.solr.SolrTestCaseJ4.getFile(SolrTestCaseJ4.java:1101)
>> > at
>> org.apache.solr.util.ExternalPaths.determineSourceHome(ExternalPaths.java
>> :40)
>> > at
>> org.apache.solr.util.ExternalPaths.<clinit>(ExternalPaths.java:30)
>> >
>> >
>> >
>> FAILED: junit.framework.TestSuite.org.apache.solr.client.solrj.embedded.
>> SolrExampleEmbeddedTest
>> >
>> > Error Message:
>> > Could not initialize class org.apache.solr.util.ExternalPaths
>> >
>> > Stack Trace:
>> > java.lang.NoClassDefFoundError: Could not initialize class
>> org.apache.solr.util.ExternalPaths
>> > at
>> org.apache.solr.client.solrj.embedded.SolrExampleEmbeddedTest.beforeTest(
>> SolrExampleEmbeddedTest.java:34)
>> >
>> >
>> >
>> FAILED: junit.framework.TestSuite.org.apache.solr.client.solrj.embedded.
>> SolrExampleJettyTest
>> >
>> > Error Message:
>> > null
>> >
>> > Stack Trace:
>> > java.lang.ExceptionInInitializerError
>> > at
>> org.apache.solr.client.solrj.embedded.SolrExampleJettyTest.beforeTest(Sol
>> rExampleJettyTest.java:37)
>> > Caused by: java.lang.RuntimeException: Cannot find resource: solr/conf
>> > at
>> org.apache.solr.SolrTestCaseJ4.getFile(SolrTestCaseJ4.java:1101)
>> > at
>> org.apache.solr.util.ExternalPaths.determineSourceHome(ExternalPaths.java
>> :40)
>> > at
>> org.apache.solr.util.ExternalPaths.<clinit>(ExternalPaths.java:30)
>> >
>> >
>> >
>> FAILED: junit.framework.TestSuite.org.apache.solr.client.solrj.embedded.
>> SolrExampleStreamingTest
>> >
>> > Error Message:
>> > Could not initialize class org.apache.solr.util.ExternalPaths
>> >
>> > Stack Trace:
>> > java.lang.NoClassDefFoundError: Could not initialize class
>> org.apache.solr.util.ExternalPaths
>> > at
>> org.apache.solr.client.solrj.embedded.SolrExampleStreamingTest.beforeTest
>> (SolrExampleStreamingTest.java:36)
>> >
>> >
>> >
>> FAILED: junit.framework.TestSuite.org.apache.solr.client.solrj.response.
>> TermsResponseTest
>> >
>> > Error Message:
>> > Could not initialize class org.apache.solr.util.ExternalPaths
>> >
>> > Stack Trace:
>> > java.lang.NoClassDefFoundError: Could not initialize class
>> org.apache.solr.util.ExternalPaths
>> > at
>> org.apache.solr.client.solrj.response.TermsResponseTest.beforeTest(TermsR
>> esponseTest.java:38)
>> >
>> >
>> >
>> FAILED: junit.framework.TestSuite.org.apache.solr.client.solrj.response.
>> TestSpellCheckResponse
>> >
>> > Error Message:
>> > Could not initialize class org.apache.solr.util.ExternalPaths
>> >
>> > Stack Trace:
>> > java.lang.NoClassDefFoundError: Could not initialize class
>> org.apache.solr.util.ExternalPaths
>> > at
>> org.apache.solr.client.solrj.response.TestSpellCheckResponse.beforeTest(T
>> estSpellCheckResponse.java:44)
>> >
>> >
>> >
>> >
>> > Build Log (for compile errors):
>> > [...truncated 13804 lines...]
>> >
>> >
>> >
>> > ---------------------------------------------------------------------
>> > To unsubscribe, e-mail: dev-unsubscribe@lucene.apache.org
>> > For additional commands, e-mail: dev-help@lucene.apache.org
>> >
>> >
>>
>>
>>
>> --
>> lucidimagination.com
>>
>> ---------------------------------------------------------------------
>> To unsubscribe, e-mail: dev-unsubscribe@lucene.apache.org
>> For additional commands, e-mail: dev-help@lucene.apache.org
>
>
--
lucidimagination.com
---------------------------------------------------------------------
To unsubscribe, e-mail: dev-unsubscribe@lucene.apache.org
For additional commands, e-mail: dev-help@lucene.apache.org
RE: [JENKINS] Lucene-Solr-tests-only-3.x - Build # 9695 - Failure
Posted by Steven A Rowe <sa...@syr.edu>.
Yeah, almost certainly.
All Lucene/Solr tests succeeded for me locally before I committed, though, via 'ant clean test' at the top level.
> -----Original Message-----
> From: Robert Muir [mailto:rcmuir@gmail.com]
> Sent: Friday, July 22, 2011 12:54 PM
> To: dev@lucene.apache.org
> Subject: Re: [JENKINS] Lucene-Solr-tests-only-3.x - Build # 9695 -
> Failure
>
> [junit] Caused by: java.lang.RuntimeException: Cannot find
> resource: solr/conf
>
> Maybe related to https://issues.apache.org/jira/browse/SOLR-2659 ?
>
> On Fri, Jul 22, 2011 at 12:51 PM, Apache Jenkins Server
> <je...@builds.apache.org> wrote:
> > Build: https://builds.apache.org/job/Lucene-Solr-tests-only-3.x/9695/
> >
> > 15 tests failed.
> >
> FAILED: junit.framework.TestSuite.org.apache.solr.client.solrj.SolrExamp
> leBinaryTest
> >
> > Error Message:
> > null
> >
> > Stack Trace:
> > java.lang.ExceptionInInitializerError
> > at
> org.apache.solr.client.solrj.SolrExampleBinaryTest.beforeTest(SolrExample
> BinaryTest.java:36)
> > Caused by: java.lang.RuntimeException: Cannot find resource: solr/conf
> > at
> org.apache.solr.SolrTestCaseJ4.getFile(SolrTestCaseJ4.java:1101)
> > at
> org.apache.solr.util.ExternalPaths.determineSourceHome(ExternalPaths.java
> :40)
> > at
> org.apache.solr.util.ExternalPaths.<clinit>(ExternalPaths.java:30)
> >
> >
> >
> FAILED: junit.framework.TestSuite.org.apache.solr.client.solrj.TestBatch
> Update
> >
> > Error Message:
> > null
> >
> > Stack Trace:
> > java.lang.ExceptionInInitializerError
> > at
> org.apache.solr.client.solrj.TestBatchUpdate.beforeTest(TestBatchUpdate.j
> ava:43)
> > Caused by: java.lang.RuntimeException: Cannot find resource: solr/conf
> > at
> org.apache.solr.SolrTestCaseJ4.getFile(SolrTestCaseJ4.java:1101)
> > at
> org.apache.solr.util.ExternalPaths.determineSourceHome(ExternalPaths.java
> :40)
> > at
> org.apache.solr.util.ExternalPaths.<clinit>(ExternalPaths.java:30)
> >
> >
> > FAILED: org.apache.solr.client.solrj.embedded.JettyWebappTest.testJSP
> >
> > Error Message:
> > Could not initialize class org.apache.solr.util.ExternalPaths
> >
> > Stack Trace:
> > java.lang.NoClassDefFoundError: Could not initialize class
> org.apache.solr.util.ExternalPaths
> > at
> org.apache.solr.client.solrj.embedded.JettyWebappTest.setUp(JettyWebappTe
> st.java:50)
> > at
> org.apache.lucene.util.LuceneTestCase$LuceneTestCaseRunner.runChild(Lucen
> eTestCase.java:1299)
> > at
> org.apache.lucene.util.LuceneTestCase$LuceneTestCaseRunner.runChild(Lucen
> eTestCase.java:1217)
> >
> >
> >
> FAILED: junit.framework.TestSuite.org.apache.solr.client.solrj.embedded.
> LargeVolumeBinaryJettyTest
> >
> > Error Message:
> > null
> >
> > Stack Trace:
> > java.lang.ExceptionInInitializerError
> > at
> org.apache.solr.client.solrj.embedded.LargeVolumeBinaryJettyTest.beforeTe
> st(LargeVolumeBinaryJettyTest.java:30)
> > Caused by: java.lang.RuntimeException: Cannot find resource: solr/conf
> > at
> org.apache.solr.SolrTestCaseJ4.getFile(SolrTestCaseJ4.java:1101)
> > at
> org.apache.solr.util.ExternalPaths.determineSourceHome(ExternalPaths.java
> :40)
> > at
> org.apache.solr.util.ExternalPaths.<clinit>(ExternalPaths.java:30)
> >
> >
> >
> FAILED: junit.framework.TestSuite.org.apache.solr.client.solrj.embedded.
> LargeVolumeEmbeddedTest
> >
> > Error Message:
> > Could not initialize class org.apache.solr.util.ExternalPaths
> >
> > Stack Trace:
> > java.lang.NoClassDefFoundError: Could not initialize class
> org.apache.solr.util.ExternalPaths
> > at
> org.apache.solr.client.solrj.embedded.LargeVolumeEmbeddedTest.beforeTest(
> LargeVolumeEmbeddedTest.java:27)
> >
> >
> >
> FAILED: junit.framework.TestSuite.org.apache.solr.client.solrj.embedded.
> LargeVolumeJettyTest
> >
> > Error Message:
> > null
> >
> > Stack Trace:
> > java.lang.ExceptionInInitializerError
> > at
> org.apache.solr.client.solrj.embedded.LargeVolumeJettyTest.beforeTest(Lar
> geVolumeJettyTest.java:27)
> > Caused by: java.lang.RuntimeException: Cannot find resource: solr/conf
> > at
> org.apache.solr.SolrTestCaseJ4.getFile(SolrTestCaseJ4.java:1101)
> > at
> org.apache.solr.util.ExternalPaths.determineSourceHome(ExternalPaths.java
> :40)
> > at
> org.apache.solr.util.ExternalPaths.<clinit>(ExternalPaths.java:30)
> >
> >
> >
> FAILED: org.apache.solr.client.solrj.embedded.MergeIndexesEmbeddedTest.t
> estMergeIndexesByDirName
> >
> > Error Message:
> > null
> >
> > Stack Trace:
> > java.lang.ExceptionInInitializerError
> > at
> org.apache.solr.client.solrj.MergeIndexesExampleTestBase.getSolrHome(Merg
> eIndexesExampleTestBase.java:44)
> > at
> org.apache.solr.client.solrj.MergeIndexesExampleTestBase.getSolrConfigFil
> e(MergeIndexesExampleTestBase.java:54)
> > at
> org.apache.solr.util.AbstractSolrTestCase.setUp(AbstractSolrTestCase.java
> :137)
> > at
> org.apache.solr.client.solrj.SolrExampleTestBase.setUp(SolrExampleTestBas
> e.java:43)
> > at
> org.apache.solr.client.solrj.MergeIndexesExampleTestBase.setUp(MergeIndex
> esExampleTestBase.java:59)
> > at
> org.apache.solr.client.solrj.embedded.MergeIndexesEmbeddedTest.setUp(Merg
> eIndexesEmbeddedTest.java:38)
> > at
> org.apache.lucene.util.LuceneTestCase$LuceneTestCaseRunner.runChild(Lucen
> eTestCase.java:1299)
> > at
> org.apache.lucene.util.LuceneTestCase$LuceneTestCaseRunner.runChild(Lucen
> eTestCase.java:1217)
> > Caused by: java.lang.RuntimeException: Cannot find resource: solr/conf
> > at
> org.apache.solr.SolrTestCaseJ4.getFile(SolrTestCaseJ4.java:1101)
> > at
> org.apache.solr.util.ExternalPaths.determineSourceHome(ExternalPaths.java
> :40)
> > at
> org.apache.solr.util.ExternalPaths.<clinit>(ExternalPaths.java:30)
> >
> >
> >
> FAILED: org.apache.solr.client.solrj.embedded.MergeIndexesEmbeddedTest.t
> estMergeIndexesByCoreName
> >
> > Error Message:
> > Could not initialize class org.apache.solr.util.ExternalPaths
> >
> > Stack Trace:
> > java.lang.NoClassDefFoundError: Could not initialize class
> org.apache.solr.util.ExternalPaths
> > at
> org.apache.solr.client.solrj.MergeIndexesExampleTestBase.getSolrHome(Merg
> eIndexesExampleTestBase.java:44)
> > at
> org.apache.solr.client.solrj.MergeIndexesExampleTestBase.getSolrConfigFil
> e(MergeIndexesExampleTestBase.java:54)
> > at
> org.apache.solr.util.AbstractSolrTestCase.setUp(AbstractSolrTestCase.java
> :137)
> > at
> org.apache.solr.client.solrj.SolrExampleTestBase.setUp(SolrExampleTestBas
> e.java:43)
> > at
> org.apache.solr.client.solrj.MergeIndexesExampleTestBase.setUp(MergeIndex
> esExampleTestBase.java:59)
> > at
> org.apache.solr.client.solrj.embedded.MergeIndexesEmbeddedTest.setUp(Merg
> eIndexesEmbeddedTest.java:38)
> > at
> org.apache.lucene.util.LuceneTestCase$LuceneTestCaseRunner.runChild(Lucen
> eTestCase.java:1299)
> > at
> org.apache.lucene.util.LuceneTestCase$LuceneTestCaseRunner.runChild(Lucen
> eTestCase.java:1217)
> >
> >
> >
> FAILED: org.apache.solr.client.solrj.embedded.MultiCoreEmbeddedTest.test
> MultiCore
> >
> > Error Message:
> > Could not initialize class org.apache.solr.util.ExternalPaths
> >
> > Stack Trace:
> > java.lang.NoClassDefFoundError: Could not initialize class
> org.apache.solr.util.ExternalPaths
> > at
> org.apache.solr.client.solrj.MultiCoreExampleTestBase.getSolrHome(MultiCo
> reExampleTestBase.java:43)
> > at
> org.apache.solr.client.solrj.MultiCoreExampleTestBase.getSolrConfigFile(M
> ultiCoreExampleTestBase.java:46)
> > at
> org.apache.solr.util.AbstractSolrTestCase.setUp(AbstractSolrTestCase.java
> :137)
> > at
> org.apache.solr.client.solrj.SolrExampleTestBase.setUp(SolrExampleTestBas
> e.java:43)
> > at
> org.apache.solr.client.solrj.MultiCoreExampleTestBase.setUp(MultiCoreExam
> pleTestBase.java:49)
> > at
> org.apache.solr.client.solrj.embedded.MultiCoreEmbeddedTest.setUp(MultiCo
> reEmbeddedTest.java:37)
> > at
> org.apache.lucene.util.LuceneTestCase$LuceneTestCaseRunner.runChild(Lucen
> eTestCase.java:1299)
> > at
> org.apache.lucene.util.LuceneTestCase$LuceneTestCaseRunner.runChild(Lucen
> eTestCase.java:1217)
> >
> >
> >
> FAILED: org.apache.solr.client.solrj.embedded.MultiCoreExampleJettyTest.
> testMultiCore
> >
> > Error Message:
> > null
> >
> > Stack Trace:
> > java.lang.ExceptionInInitializerError
> > at
> org.apache.solr.client.solrj.MultiCoreExampleTestBase.getSolrHome(MultiCo
> reExampleTestBase.java:43)
> > at
> org.apache.solr.client.solrj.MultiCoreExampleTestBase.getSolrConfigFile(M
> ultiCoreExampleTestBase.java:46)
> > at
> org.apache.solr.util.AbstractSolrTestCase.setUp(AbstractSolrTestCase.java
> :137)
> > at
> org.apache.solr.client.solrj.SolrExampleTestBase.setUp(SolrExampleTestBas
> e.java:43)
> > at
> org.apache.solr.client.solrj.MultiCoreExampleTestBase.setUp(MultiCoreExam
> pleTestBase.java:49)
> > at
> org.apache.solr.client.solrj.embedded.MultiCoreExampleJettyTest.setUp(Mul
> tiCoreExampleJettyTest.java:43)
> > at
> org.apache.lucene.util.LuceneTestCase$LuceneTestCaseRunner.runChild(Lucen
> eTestCase.java:1299)
> > at
> org.apache.lucene.util.LuceneTestCase$LuceneTestCaseRunner.runChild(Lucen
> eTestCase.java:1217)
> > Caused by: java.lang.RuntimeException: Cannot find resource: solr/conf
> > at
> org.apache.solr.SolrTestCaseJ4.getFile(SolrTestCaseJ4.java:1101)
> > at
> org.apache.solr.util.ExternalPaths.determineSourceHome(ExternalPaths.java
> :40)
> > at
> org.apache.solr.util.ExternalPaths.<clinit>(ExternalPaths.java:30)
> >
> >
> >
> FAILED: junit.framework.TestSuite.org.apache.solr.client.solrj.embedded.
> SolrExampleEmbeddedTest
> >
> > Error Message:
> > Could not initialize class org.apache.solr.util.ExternalPaths
> >
> > Stack Trace:
> > java.lang.NoClassDefFoundError: Could not initialize class
> org.apache.solr.util.ExternalPaths
> > at
> org.apache.solr.client.solrj.embedded.SolrExampleEmbeddedTest.beforeTest(
> SolrExampleEmbeddedTest.java:34)
> >
> >
> >
> FAILED: junit.framework.TestSuite.org.apache.solr.client.solrj.embedded.
> SolrExampleJettyTest
> >
> > Error Message:
> > null
> >
> > Stack Trace:
> > java.lang.ExceptionInInitializerError
> > at
> org.apache.solr.client.solrj.embedded.SolrExampleJettyTest.beforeTest(Sol
> rExampleJettyTest.java:37)
> > Caused by: java.lang.RuntimeException: Cannot find resource: solr/conf
> > at
> org.apache.solr.SolrTestCaseJ4.getFile(SolrTestCaseJ4.java:1101)
> > at
> org.apache.solr.util.ExternalPaths.determineSourceHome(ExternalPaths.java
> :40)
> > at
> org.apache.solr.util.ExternalPaths.<clinit>(ExternalPaths.java:30)
> >
> >
> >
> FAILED: junit.framework.TestSuite.org.apache.solr.client.solrj.embedded.
> SolrExampleStreamingTest
> >
> > Error Message:
> > Could not initialize class org.apache.solr.util.ExternalPaths
> >
> > Stack Trace:
> > java.lang.NoClassDefFoundError: Could not initialize class
> org.apache.solr.util.ExternalPaths
> > at
> org.apache.solr.client.solrj.embedded.SolrExampleStreamingTest.beforeTest
> (SolrExampleStreamingTest.java:36)
> >
> >
> >
> FAILED: junit.framework.TestSuite.org.apache.solr.client.solrj.response.
> TermsResponseTest
> >
> > Error Message:
> > Could not initialize class org.apache.solr.util.ExternalPaths
> >
> > Stack Trace:
> > java.lang.NoClassDefFoundError: Could not initialize class
> org.apache.solr.util.ExternalPaths
> > at
> org.apache.solr.client.solrj.response.TermsResponseTest.beforeTest(TermsR
> esponseTest.java:38)
> >
> >
> >
> FAILED: junit.framework.TestSuite.org.apache.solr.client.solrj.response.
> TestSpellCheckResponse
> >
> > Error Message:
> > Could not initialize class org.apache.solr.util.ExternalPaths
> >
> > Stack Trace:
> > java.lang.NoClassDefFoundError: Could not initialize class
> org.apache.solr.util.ExternalPaths
> > at
> org.apache.solr.client.solrj.response.TestSpellCheckResponse.beforeTest(T
> estSpellCheckResponse.java:44)
> >
> >
> >
> >
> > Build Log (for compile errors):
> > [...truncated 13804 lines...]
> >
> >
> >
> > ---------------------------------------------------------------------
> > To unsubscribe, e-mail: dev-unsubscribe@lucene.apache.org
> > For additional commands, e-mail: dev-help@lucene.apache.org
> >
> >
>
>
>
> --
> lucidimagination.com
>
> ---------------------------------------------------------------------
> To unsubscribe, e-mail: dev-unsubscribe@lucene.apache.org
> For additional commands, e-mail: dev-help@lucene.apache.org
Re: [JENKINS] Lucene-Solr-tests-only-3.x - Build # 9695 - Failure
Posted by Robert Muir <rc...@gmail.com>.
[junit] Caused by: java.lang.RuntimeException: Cannot find
resource: solr/conf
Maybe related to https://issues.apache.org/jira/browse/SOLR-2659 ?
On Fri, Jul 22, 2011 at 12:51 PM, Apache Jenkins Server
<je...@builds.apache.org> wrote:
> Build: https://builds.apache.org/job/Lucene-Solr-tests-only-3.x/9695/
>
> 15 tests failed.
> FAILED: junit.framework.TestSuite.org.apache.solr.client.solrj.SolrExampleBinaryTest
>
> Error Message:
> null
>
> Stack Trace:
> java.lang.ExceptionInInitializerError
> at org.apache.solr.client.solrj.SolrExampleBinaryTest.beforeTest(SolrExampleBinaryTest.java:36)
> Caused by: java.lang.RuntimeException: Cannot find resource: solr/conf
> at org.apache.solr.SolrTestCaseJ4.getFile(SolrTestCaseJ4.java:1101)
> at org.apache.solr.util.ExternalPaths.determineSourceHome(ExternalPaths.java:40)
> at org.apache.solr.util.ExternalPaths.<clinit>(ExternalPaths.java:30)
>
>
> FAILED: junit.framework.TestSuite.org.apache.solr.client.solrj.TestBatchUpdate
>
> Error Message:
> null
>
> Stack Trace:
> java.lang.ExceptionInInitializerError
> at org.apache.solr.client.solrj.TestBatchUpdate.beforeTest(TestBatchUpdate.java:43)
> Caused by: java.lang.RuntimeException: Cannot find resource: solr/conf
> at org.apache.solr.SolrTestCaseJ4.getFile(SolrTestCaseJ4.java:1101)
> at org.apache.solr.util.ExternalPaths.determineSourceHome(ExternalPaths.java:40)
> at org.apache.solr.util.ExternalPaths.<clinit>(ExternalPaths.java:30)
>
>
> FAILED: org.apache.solr.client.solrj.embedded.JettyWebappTest.testJSP
>
> Error Message:
> Could not initialize class org.apache.solr.util.ExternalPaths
>
> Stack Trace:
> java.lang.NoClassDefFoundError: Could not initialize class org.apache.solr.util.ExternalPaths
> at org.apache.solr.client.solrj.embedded.JettyWebappTest.setUp(JettyWebappTest.java:50)
> at org.apache.lucene.util.LuceneTestCase$LuceneTestCaseRunner.runChild(LuceneTestCase.java:1299)
> at org.apache.lucene.util.LuceneTestCase$LuceneTestCaseRunner.runChild(LuceneTestCase.java:1217)
>
>
> FAILED: junit.framework.TestSuite.org.apache.solr.client.solrj.embedded.LargeVolumeBinaryJettyTest
>
> Error Message:
> null
>
> Stack Trace:
> java.lang.ExceptionInInitializerError
> at org.apache.solr.client.solrj.embedded.LargeVolumeBinaryJettyTest.beforeTest(LargeVolumeBinaryJettyTest.java:30)
> Caused by: java.lang.RuntimeException: Cannot find resource: solr/conf
> at org.apache.solr.SolrTestCaseJ4.getFile(SolrTestCaseJ4.java:1101)
> at org.apache.solr.util.ExternalPaths.determineSourceHome(ExternalPaths.java:40)
> at org.apache.solr.util.ExternalPaths.<clinit>(ExternalPaths.java:30)
>
>
> FAILED: junit.framework.TestSuite.org.apache.solr.client.solrj.embedded.LargeVolumeEmbeddedTest
>
> Error Message:
> Could not initialize class org.apache.solr.util.ExternalPaths
>
> Stack Trace:
> java.lang.NoClassDefFoundError: Could not initialize class org.apache.solr.util.ExternalPaths
> at org.apache.solr.client.solrj.embedded.LargeVolumeEmbeddedTest.beforeTest(LargeVolumeEmbeddedTest.java:27)
>
>
> FAILED: junit.framework.TestSuite.org.apache.solr.client.solrj.embedded.LargeVolumeJettyTest
>
> Error Message:
> null
>
> Stack Trace:
> java.lang.ExceptionInInitializerError
> at org.apache.solr.client.solrj.embedded.LargeVolumeJettyTest.beforeTest(LargeVolumeJettyTest.java:27)
> Caused by: java.lang.RuntimeException: Cannot find resource: solr/conf
> at org.apache.solr.SolrTestCaseJ4.getFile(SolrTestCaseJ4.java:1101)
> at org.apache.solr.util.ExternalPaths.determineSourceHome(ExternalPaths.java:40)
> at org.apache.solr.util.ExternalPaths.<clinit>(ExternalPaths.java:30)
>
>
> FAILED: org.apache.solr.client.solrj.embedded.MergeIndexesEmbeddedTest.testMergeIndexesByDirName
>
> Error Message:
> null
>
> Stack Trace:
> java.lang.ExceptionInInitializerError
> at org.apache.solr.client.solrj.MergeIndexesExampleTestBase.getSolrHome(MergeIndexesExampleTestBase.java:44)
> at org.apache.solr.client.solrj.MergeIndexesExampleTestBase.getSolrConfigFile(MergeIndexesExampleTestBase.java:54)
> at org.apache.solr.util.AbstractSolrTestCase.setUp(AbstractSolrTestCase.java:137)
> at org.apache.solr.client.solrj.SolrExampleTestBase.setUp(SolrExampleTestBase.java:43)
> at org.apache.solr.client.solrj.MergeIndexesExampleTestBase.setUp(MergeIndexesExampleTestBase.java:59)
> at org.apache.solr.client.solrj.embedded.MergeIndexesEmbeddedTest.setUp(MergeIndexesEmbeddedTest.java:38)
> at org.apache.lucene.util.LuceneTestCase$LuceneTestCaseRunner.runChild(LuceneTestCase.java:1299)
> at org.apache.lucene.util.LuceneTestCase$LuceneTestCaseRunner.runChild(LuceneTestCase.java:1217)
> Caused by: java.lang.RuntimeException: Cannot find resource: solr/conf
> at org.apache.solr.SolrTestCaseJ4.getFile(SolrTestCaseJ4.java:1101)
> at org.apache.solr.util.ExternalPaths.determineSourceHome(ExternalPaths.java:40)
> at org.apache.solr.util.ExternalPaths.<clinit>(ExternalPaths.java:30)
>
>
> FAILED: org.apache.solr.client.solrj.embedded.MergeIndexesEmbeddedTest.testMergeIndexesByCoreName
>
> Error Message:
> Could not initialize class org.apache.solr.util.ExternalPaths
>
> Stack Trace:
> java.lang.NoClassDefFoundError: Could not initialize class org.apache.solr.util.ExternalPaths
> at org.apache.solr.client.solrj.MergeIndexesExampleTestBase.getSolrHome(MergeIndexesExampleTestBase.java:44)
> at org.apache.solr.client.solrj.MergeIndexesExampleTestBase.getSolrConfigFile(MergeIndexesExampleTestBase.java:54)
> at org.apache.solr.util.AbstractSolrTestCase.setUp(AbstractSolrTestCase.java:137)
> at org.apache.solr.client.solrj.SolrExampleTestBase.setUp(SolrExampleTestBase.java:43)
> at org.apache.solr.client.solrj.MergeIndexesExampleTestBase.setUp(MergeIndexesExampleTestBase.java:59)
> at org.apache.solr.client.solrj.embedded.MergeIndexesEmbeddedTest.setUp(MergeIndexesEmbeddedTest.java:38)
> at org.apache.lucene.util.LuceneTestCase$LuceneTestCaseRunner.runChild(LuceneTestCase.java:1299)
> at org.apache.lucene.util.LuceneTestCase$LuceneTestCaseRunner.runChild(LuceneTestCase.java:1217)
>
>
> FAILED: org.apache.solr.client.solrj.embedded.MultiCoreEmbeddedTest.testMultiCore
>
> Error Message:
> Could not initialize class org.apache.solr.util.ExternalPaths
>
> Stack Trace:
> java.lang.NoClassDefFoundError: Could not initialize class org.apache.solr.util.ExternalPaths
> at org.apache.solr.client.solrj.MultiCoreExampleTestBase.getSolrHome(MultiCoreExampleTestBase.java:43)
> at org.apache.solr.client.solrj.MultiCoreExampleTestBase.getSolrConfigFile(MultiCoreExampleTestBase.java:46)
> at org.apache.solr.util.AbstractSolrTestCase.setUp(AbstractSolrTestCase.java:137)
> at org.apache.solr.client.solrj.SolrExampleTestBase.setUp(SolrExampleTestBase.java:43)
> at org.apache.solr.client.solrj.MultiCoreExampleTestBase.setUp(MultiCoreExampleTestBase.java:49)
> at org.apache.solr.client.solrj.embedded.MultiCoreEmbeddedTest.setUp(MultiCoreEmbeddedTest.java:37)
> at org.apache.lucene.util.LuceneTestCase$LuceneTestCaseRunner.runChild(LuceneTestCase.java:1299)
> at org.apache.lucene.util.LuceneTestCase$LuceneTestCaseRunner.runChild(LuceneTestCase.java:1217)
>
>
> FAILED: org.apache.solr.client.solrj.embedded.MultiCoreExampleJettyTest.testMultiCore
>
> Error Message:
> null
>
> Stack Trace:
> java.lang.ExceptionInInitializerError
> at org.apache.solr.client.solrj.MultiCoreExampleTestBase.getSolrHome(MultiCoreExampleTestBase.java:43)
> at org.apache.solr.client.solrj.MultiCoreExampleTestBase.getSolrConfigFile(MultiCoreExampleTestBase.java:46)
> at org.apache.solr.util.AbstractSolrTestCase.setUp(AbstractSolrTestCase.java:137)
> at org.apache.solr.client.solrj.SolrExampleTestBase.setUp(SolrExampleTestBase.java:43)
> at org.apache.solr.client.solrj.MultiCoreExampleTestBase.setUp(MultiCoreExampleTestBase.java:49)
> at org.apache.solr.client.solrj.embedded.MultiCoreExampleJettyTest.setUp(MultiCoreExampleJettyTest.java:43)
> at org.apache.lucene.util.LuceneTestCase$LuceneTestCaseRunner.runChild(LuceneTestCase.java:1299)
> at org.apache.lucene.util.LuceneTestCase$LuceneTestCaseRunner.runChild(LuceneTestCase.java:1217)
> Caused by: java.lang.RuntimeException: Cannot find resource: solr/conf
> at org.apache.solr.SolrTestCaseJ4.getFile(SolrTestCaseJ4.java:1101)
> at org.apache.solr.util.ExternalPaths.determineSourceHome(ExternalPaths.java:40)
> at org.apache.solr.util.ExternalPaths.<clinit>(ExternalPaths.java:30)
>
>
> FAILED: junit.framework.TestSuite.org.apache.solr.client.solrj.embedded.SolrExampleEmbeddedTest
>
> Error Message:
> Could not initialize class org.apache.solr.util.ExternalPaths
>
> Stack Trace:
> java.lang.NoClassDefFoundError: Could not initialize class org.apache.solr.util.ExternalPaths
> at org.apache.solr.client.solrj.embedded.SolrExampleEmbeddedTest.beforeTest(SolrExampleEmbeddedTest.java:34)
>
>
> FAILED: junit.framework.TestSuite.org.apache.solr.client.solrj.embedded.SolrExampleJettyTest
>
> Error Message:
> null
>
> Stack Trace:
> java.lang.ExceptionInInitializerError
> at org.apache.solr.client.solrj.embedded.SolrExampleJettyTest.beforeTest(SolrExampleJettyTest.java:37)
> Caused by: java.lang.RuntimeException: Cannot find resource: solr/conf
> at org.apache.solr.SolrTestCaseJ4.getFile(SolrTestCaseJ4.java:1101)
> at org.apache.solr.util.ExternalPaths.determineSourceHome(ExternalPaths.java:40)
> at org.apache.solr.util.ExternalPaths.<clinit>(ExternalPaths.java:30)
>
>
> FAILED: junit.framework.TestSuite.org.apache.solr.client.solrj.embedded.SolrExampleStreamingTest
>
> Error Message:
> Could not initialize class org.apache.solr.util.ExternalPaths
>
> Stack Trace:
> java.lang.NoClassDefFoundError: Could not initialize class org.apache.solr.util.ExternalPaths
> at org.apache.solr.client.solrj.embedded.SolrExampleStreamingTest.beforeTest(SolrExampleStreamingTest.java:36)
>
>
> FAILED: junit.framework.TestSuite.org.apache.solr.client.solrj.response.TermsResponseTest
>
> Error Message:
> Could not initialize class org.apache.solr.util.ExternalPaths
>
> Stack Trace:
> java.lang.NoClassDefFoundError: Could not initialize class org.apache.solr.util.ExternalPaths
> at org.apache.solr.client.solrj.response.TermsResponseTest.beforeTest(TermsResponseTest.java:38)
>
>
> FAILED: junit.framework.TestSuite.org.apache.solr.client.solrj.response.TestSpellCheckResponse
>
> Error Message:
> Could not initialize class org.apache.solr.util.ExternalPaths
>
> Stack Trace:
> java.lang.NoClassDefFoundError: Could not initialize class org.apache.solr.util.ExternalPaths
> at org.apache.solr.client.solrj.response.TestSpellCheckResponse.beforeTest(TestSpellCheckResponse.java:44)
>
>
>
>
> Build Log (for compile errors):
> [...truncated 13804 lines...]
>
>
>
> ---------------------------------------------------------------------
> To unsubscribe, e-mail: dev-unsubscribe@lucene.apache.org
> For additional commands, e-mail: dev-help@lucene.apache.org
>
>
--
lucidimagination.com
---------------------------------------------------------------------
To unsubscribe, e-mail: dev-unsubscribe@lucene.apache.org
For additional commands, e-mail: dev-help@lucene.apache.org