You are viewing a plain text version of this content. The canonical link for it is here.
Posted to builds@beam.apache.org by Apache Jenkins Server <je...@builds.apache.org> on 2020/03/09 23:58:29 UTC
Build failed in Jenkins: beam_PostCommit_Py_ValCont #5793
See <https://builds.apache.org/job/beam_PostCommit_Py_ValCont/5793/display/redirect?page=changes>
Changes:
[lcwik] [BEAM-9475] Fix typos and shore up expectations on type
------------------------------------------
[...truncated 747.12 KB...]
copying apache_beam/typehints/typehints_test_py3.py -> apache-beam-2.21.0.dev0/apache_beam/typehints
copying apache_beam/utils/__init__.py -> apache-beam-2.21.0.dev0/apache_beam/utils
copying apache_beam/utils/annotations.py -> apache-beam-2.21.0.dev0/apache_beam/utils
copying apache_beam/utils/annotations_test.py -> apache-beam-2.21.0.dev0/apache_beam/utils
copying apache_beam/utils/counters.pxd -> apache-beam-2.21.0.dev0/apache_beam/utils
copying apache_beam/utils/counters.py -> apache-beam-2.21.0.dev0/apache_beam/utils
copying apache_beam/utils/counters_test.py -> apache-beam-2.21.0.dev0/apache_beam/utils
copying apache_beam/utils/interactive_utils.py -> apache-beam-2.21.0.dev0/apache_beam/utils
copying apache_beam/utils/interactive_utils_test.py -> apache-beam-2.21.0.dev0/apache_beam/utils
copying apache_beam/utils/plugin.py -> apache-beam-2.21.0.dev0/apache_beam/utils
copying apache_beam/utils/processes.py -> apache-beam-2.21.0.dev0/apache_beam/utils
copying apache_beam/utils/processes_test.py -> apache-beam-2.21.0.dev0/apache_beam/utils
copying apache_beam/utils/profiler.py -> apache-beam-2.21.0.dev0/apache_beam/utils
copying apache_beam/utils/proto_utils.py -> apache-beam-2.21.0.dev0/apache_beam/utils
copying apache_beam/utils/retry.py -> apache-beam-2.21.0.dev0/apache_beam/utils
copying apache_beam/utils/retry_test.py -> apache-beam-2.21.0.dev0/apache_beam/utils
copying apache_beam/utils/subprocess_server.py -> apache-beam-2.21.0.dev0/apache_beam/utils
copying apache_beam/utils/thread_pool_executor.py -> apache-beam-2.21.0.dev0/apache_beam/utils
copying apache_beam/utils/thread_pool_executor_test.py -> apache-beam-2.21.0.dev0/apache_beam/utils
copying apache_beam/utils/timestamp.py -> apache-beam-2.21.0.dev0/apache_beam/utils
copying apache_beam/utils/timestamp_test.py -> apache-beam-2.21.0.dev0/apache_beam/utils
copying apache_beam/utils/urns.py -> apache-beam-2.21.0.dev0/apache_beam/utils
copying apache_beam/utils/windowed_value.pxd -> apache-beam-2.21.0.dev0/apache_beam/utils
copying apache_beam/utils/windowed_value.py -> apache-beam-2.21.0.dev0/apache_beam/utils
copying apache_beam/utils/windowed_value_test.py -> apache-beam-2.21.0.dev0/apache_beam/utils
Writing apache-beam-2.21.0.dev0/setup.cfg
creating dist
Creating tar archive
removing 'apache-beam-2.21.0.dev0' (and everything under it)
SDK_LOCATION=$(find dist/apache-beam-*.tar.gz)
find dist/apache-beam-*.tar.gz
# Run ValidatesRunner tests on Google Cloud Dataflow service
echo ">>> RUNNING DATAFLOW RUNNER VALIDATESCONTAINER TEST"
>>> RUNNING DATAFLOW RUNNER VALIDATESCONTAINER TEST
python setup.py nosetests \
--attr ValidatesContainer \
--nologcapture \
--processes=1 \
--process-timeout=900 \
--with-xunitmp \
--xunitmp-file=$XUNIT_FILE \
--ignore-files '.*py3\d?\.py$' \
--test-pipeline-options=" \
--runner=TestDataflowRunner \
--project=$PROJECT \
--worker_harness_container_image=$CONTAINER:$TAG \
--staging_location=$GCS_LOCATION/staging-validatesrunner-test \
--temp_location=$GCS_LOCATION/temp-validatesrunner-test \
--output=$GCS_LOCATION/output \
--sdk_location=$SDK_LOCATION \
--num_workers=1"
setup.py:253: UserWarning: You are using Apache Beam with Python 2. New releases of Apache Beam will soon support Python 3 only.
'You are using Apache Beam with Python 2. '
<https://builds.apache.org/job/beam_PostCommit_Py_ValCont/ws/src/sdks/python/container/venv/python/local/lib/python2.7/site-packages/setuptools/dist.py>:476: UserWarning: Normalizing '2.21.0.dev' to '2.21.0.dev0'
normalized_version,
running nosetests
running egg_info
<https://builds.apache.org/job/beam_PostCommit_Py_ValCont/ws/src/sdks/python/gen_protos.py>:241: UserWarning: Installing grpcio-tools is recommended for development.
warnings.warn('Installing grpcio-tools is recommended for development.')
INFO:gen_protos:Skipping proto regeneration: all files up to date
writing requirements to apache_beam.egg-info/requires.txt
writing apache_beam.egg-info/PKG-INFO
writing top-level names to apache_beam.egg-info/top_level.txt
writing dependency_links to apache_beam.egg-info/dependency_links.txt
writing entry points to apache_beam.egg-info/entry_points.txt
reading manifest file 'apache_beam.egg-info/SOURCES.txt'
reading manifest template 'MANIFEST.in'
warning: no files found matching 'README.md'
warning: no files found matching 'NOTICE'
warning: no files found matching 'LICENSE'
writing manifest file 'apache_beam.egg-info/SOURCES.txt'
<https://builds.apache.org/job/beam_PostCommit_Py_ValCont/ws/src/sdks/python/apache_beam/__init__.py>:82: UserWarning: You are using Apache Beam with Python 2. New releases of Apache Beam will soon support Python 3 only.
'You are using Apache Beam with Python 2. '
WARNING:apache_beam.io.gcp.datastore.v1.datastoreio:Using deprecated Datastore client.
This client will be removed in Beam 3.0 (next Beam major release).
Please migrate to apache_beam.io.gcp.datastore.v1new.datastoreio.
WARNING:root:python-snappy is not installed; some tests will be skipped.
WARNING:root:Tensorflow is not installed, so skipping some tests.
WARNING:apache_beam.runners.interactive.interactive_environment:Interactive Beam requires Python 3.5.3+.
WARNING:apache_beam.runners.interactive.interactive_environment:Dependencies required for Interactive Beam PCollection visualization are not available, please use: `pip install apache-beam[interactive]` to install necessary dependencies to enable all data visualization features.
WARNING:apache_beam.runners.interactive.interactive_environment:You cannot use Interactive Beam features when you are not in an interactive environment such as a Jupyter notebook or ipython terminal.
WARNING:root:Make sure that locally built Python SDK docker image has Python 2.7 interpreter.
<https://builds.apache.org/job/beam_PostCommit_Py_ValCont/ws/src/sdks/python/apache_beam/transforms/trigger_test.py>:541: YAMLLoadWarning: calling yaml.load_all() without Loader=... is deprecated, as the default Loader is unsafe. Please read https://msg.pyyaml.org/load for full details.
for spec in yaml.load_all(open(transcript_filename)):
WARNING:apache_beam.options.pipeline_options:--region not set; will default to us-central1. Future releases of Beam will require the user to set --region explicitly, or else have a default set via the gcloud tool. https://cloud.google.com/compute/docs/regions-zones
WARNING:apache_beam.options.pipeline_options:--region not set; will default to us-central1. Future releases of Beam will require the user to set --region explicitly, or else have a default set via the gcloud tool. https://cloud.google.com/compute/docs/regions-zones
test_wordcount_fnapi_it (apache_beam.examples.wordcount_it_test.WordCountIT) ... ERROR
test_metrics_fnapi_it (apache_beam.runners.dataflow.dataflow_exercise_metrics_pipeline_test.ExerciseMetricsPipelineTest) ... ERROR
======================================================================
ERROR: test_wordcount_fnapi_it (apache_beam.examples.wordcount_it_test.WordCountIT)
----------------------------------------------------------------------
Traceback (most recent call last):
File "<https://builds.apache.org/job/beam_PostCommit_Py_ValCont/ws/src/sdks/python/container/venv/python/local/lib/python2.7/site-packages/nose/plugins/multiprocess.py",> line 812, in run
test(orig)
File "<https://builds.apache.org/job/beam_PostCommit_Py_ValCont/ws/src/sdks/python/container/venv/python/local/lib/python2.7/site-packages/nose/case.py",> line 45, in __call__
return self.run(*arg, **kwarg)
File "<https://builds.apache.org/job/beam_PostCommit_Py_ValCont/ws/src/sdks/python/container/venv/python/local/lib/python2.7/site-packages/nose/case.py",> line 133, in run
self.runTest(result)
File "<https://builds.apache.org/job/beam_PostCommit_Py_ValCont/ws/src/sdks/python/container/venv/python/local/lib/python2.7/site-packages/nose/case.py",> line 151, in runTest
test(result)
File "/usr/lib/python2.7/unittest/case.py", line 393, in __call__
return self.run(*args, **kwds)
File "/usr/lib/python2.7/unittest/case.py", line 329, in run
testMethod()
File "<https://builds.apache.org/job/beam_PostCommit_Py_ValCont/ws/src/sdks/python/apache_beam/examples/wordcount_it_test.py",> line 54, in test_wordcount_fnapi_it
self._run_wordcount_it(wordcount.run, experiment='beam_fn_api')
File "<https://builds.apache.org/job/beam_PostCommit_Py_ValCont/ws/src/sdks/python/apache_beam/examples/wordcount_it_test.py",> line 91, in _run_wordcount_it
save_main_session=False)
File "<https://builds.apache.org/job/beam_PostCommit_Py_ValCont/ws/src/sdks/python/apache_beam/examples/wordcount.py",> line 121, in run
result = p.run()
File "<https://builds.apache.org/job/beam_PostCommit_Py_ValCont/ws/src/sdks/python/apache_beam/pipeline.py",> line 495, in run
self._options).run(False)
File "<https://builds.apache.org/job/beam_PostCommit_Py_ValCont/ws/src/sdks/python/apache_beam/pipeline.py",> line 508, in run
return self.runner.run_pipeline(self, self._options)
File "<https://builds.apache.org/job/beam_PostCommit_Py_ValCont/ws/src/sdks/python/apache_beam/runners/dataflow/test_dataflow_runner.py",> line 75, in run_pipeline
self.result.cancel()
File "<https://builds.apache.org/job/beam_PostCommit_Py_ValCont/ws/src/sdks/python/apache_beam/runners/dataflow/dataflow_runner.py",> line 1578, in cancel
return self.state
File "<https://builds.apache.org/job/beam_PostCommit_Py_ValCont/ws/src/sdks/python/apache_beam/runners/dataflow/dataflow_runner.py",> line 1516, in state
self._update_job()
File "<https://builds.apache.org/job/beam_PostCommit_Py_ValCont/ws/src/sdks/python/apache_beam/runners/dataflow/dataflow_runner.py",> line 1469, in _update_job
self._job = self._runner.dataflow_client.get_job(self.job_id())
File "<https://builds.apache.org/job/beam_PostCommit_Py_ValCont/ws/src/sdks/python/apache_beam/utils/retry.py",> line 236, in wrapper
return fun(*args, **kwargs)
File "<https://builds.apache.org/job/beam_PostCommit_Py_ValCont/ws/src/sdks/python/apache_beam/runners/dataflow/internal/apiclient.py",> line 795, in get_job
response = self._client.projects_locations_jobs.Get(request)
File "<https://builds.apache.org/job/beam_PostCommit_Py_ValCont/ws/src/sdks/python/apache_beam/runners/dataflow/internal/clients/dataflow/dataflow_v1b3_client.py",> line 699, in Get
config, request, global_params=global_params)
File "<https://builds.apache.org/job/beam_PostCommit_Py_ValCont/ws/src/sdks/python/container/venv/python/local/lib/python2.7/site-packages/apitools/base/py/base_api.py",> line 729, in _RunMethod
http, http_request, **opts)
File "<https://builds.apache.org/job/beam_PostCommit_Py_ValCont/ws/src/sdks/python/container/venv/python/local/lib/python2.7/site-packages/apitools/base/py/http_wrapper.py",> line 346, in MakeRequest
check_response_func=check_response_func)
File "<https://builds.apache.org/job/beam_PostCommit_Py_ValCont/ws/src/sdks/python/container/venv/python/local/lib/python2.7/site-packages/apitools/base/py/http_wrapper.py",> line 396, in _MakeRequestNoRetry
redirections=redirections, connection_type=connection_type)
File "<https://builds.apache.org/job/beam_PostCommit_Py_ValCont/ws/src/sdks/python/container/venv/python/local/lib/python2.7/site-packages/oauth2client/transport.py",> line 169, in new_request
redirections, connection_type)
File "<https://builds.apache.org/job/beam_PostCommit_Py_ValCont/ws/src/sdks/python/container/venv/python/local/lib/python2.7/site-packages/oauth2client/transport.py",> line 169, in new_request
redirections, connection_type)
File "<https://builds.apache.org/job/beam_PostCommit_Py_ValCont/ws/src/sdks/python/container/venv/python/local/lib/python2.7/site-packages/httplib2/__init__.py",> line 2133, in request
cachekey,
File "<https://builds.apache.org/job/beam_PostCommit_Py_ValCont/ws/src/sdks/python/container/venv/python/local/lib/python2.7/site-packages/httplib2/__init__.py",> line 1796, in _request
conn, request_uri, method, body, headers
File "<https://builds.apache.org/job/beam_PostCommit_Py_ValCont/ws/src/sdks/python/container/venv/python/local/lib/python2.7/site-packages/httplib2/__init__.py",> line 1737, in _conn_request
response = conn.getresponse()
File "/usr/lib/python2.7/httplib.py", line 1152, in getresponse
response.begin()
File "/usr/lib/python2.7/httplib.py", line 463, in begin
version, status, reason = self._read_status()
File "/usr/lib/python2.7/httplib.py", line 419, in _read_status
line = self.fp.readline(_MAXLINE + 1)
File "/usr/lib/python2.7/socket.py", line 480, in readline
data = self._sock.recv(self._rbufsize)
File "/usr/lib/python2.7/ssl.py", line 756, in recv
return self.read(buflen)
File "/usr/lib/python2.7/ssl.py", line 643, in read
v = self._sslobj.read(len)
File "<https://builds.apache.org/job/beam_PostCommit_Py_ValCont/ws/src/sdks/python/container/venv/python/local/lib/python2.7/site-packages/nose/plugins/multiprocess.py",> line 276, in signalhandler
raise TimedOutException()
TimedOutException: 'test_wordcount_fnapi_it (apache_beam.examples.wordcount_it_test.WordCountIT)'
======================================================================
ERROR: test_metrics_fnapi_it (apache_beam.runners.dataflow.dataflow_exercise_metrics_pipeline_test.ExerciseMetricsPipelineTest)
----------------------------------------------------------------------
Traceback (most recent call last):
File "<https://builds.apache.org/job/beam_PostCommit_Py_ValCont/ws/src/sdks/python/container/venv/python/local/lib/python2.7/site-packages/nose/plugins/multiprocess.py",> line 812, in run
test(orig)
File "<https://builds.apache.org/job/beam_PostCommit_Py_ValCont/ws/src/sdks/python/container/venv/python/local/lib/python2.7/site-packages/nose/case.py",> line 45, in __call__
return self.run(*arg, **kwarg)
File "<https://builds.apache.org/job/beam_PostCommit_Py_ValCont/ws/src/sdks/python/container/venv/python/local/lib/python2.7/site-packages/nose/case.py",> line 133, in run
self.runTest(result)
File "<https://builds.apache.org/job/beam_PostCommit_Py_ValCont/ws/src/sdks/python/container/venv/python/local/lib/python2.7/site-packages/nose/case.py",> line 151, in runTest
test(result)
File "/usr/lib/python2.7/unittest/case.py", line 393, in __call__
return self.run(*args, **kwds)
File "/usr/lib/python2.7/unittest/case.py", line 329, in run
testMethod()
File "<https://builds.apache.org/job/beam_PostCommit_Py_ValCont/ws/src/sdks/python/apache_beam/runners/dataflow/dataflow_exercise_metrics_pipeline_test.py",> line 57, in test_metrics_fnapi_it
result = self.run_pipeline(experiment='beam_fn_api')
File "<https://builds.apache.org/job/beam_PostCommit_Py_ValCont/ws/src/sdks/python/apache_beam/runners/dataflow/dataflow_exercise_metrics_pipeline_test.py",> line 38, in run_pipeline
test_pipeline = TestPipeline(is_integration_test=True)
File "<https://builds.apache.org/job/beam_PostCommit_Py_ValCont/ws/src/sdks/python/apache_beam/testing/test_pipeline.py",> line 107, in __init__
super(TestPipeline, self).__init__(runner, options)
File "<https://builds.apache.org/job/beam_PostCommit_Py_ValCont/ws/src/sdks/python/apache_beam/pipeline.py",> line 196, in __init__
errors = PipelineOptionsValidator(self._options, runner).validate()
File "<https://builds.apache.org/job/beam_PostCommit_Py_ValCont/ws/src/sdks/python/apache_beam/options/pipeline_options_validator.py",> line 121, in validate
errors.extend(self.options.view_as(cls).validate(self))
File "<https://builds.apache.org/job/beam_PostCommit_Py_ValCont/ws/src/sdks/python/apache_beam/options/pipeline_options.py",> line 619, in validate
self.view_as(GoogleCloudOptions).region = self._get_default_gcp_region()
File "<https://builds.apache.org/job/beam_PostCommit_Py_ValCont/ws/src/sdks/python/apache_beam/options/pipeline_options.py",> line 584, in _get_default_gcp_region
raw_output = processes.check_output(cmd, stderr=DEVNULL)
File "<https://builds.apache.org/job/beam_PostCommit_Py_ValCont/ws/src/sdks/python/apache_beam/utils/processes.py",> line 91, in check_output
out = subprocess.check_output(*args, **kwargs)
File "/usr/lib/python2.7/subprocess.py", line 568, in check_output
output, unused_err = process.communicate()
File "/usr/lib/python2.7/subprocess.py", line 792, in communicate
stdout = _eintr_retry_call(self.stdout.read)
File "/usr/lib/python2.7/subprocess.py", line 476, in _eintr_retry_call
return func(*args)
File "<https://builds.apache.org/job/beam_PostCommit_Py_ValCont/ws/src/sdks/python/container/venv/python/local/lib/python2.7/site-packages/nose/plugins/multiprocess.py",> line 276, in signalhandler
raise TimedOutException()
TimedOutException: 'test_metrics_fnapi_it (apache_beam.runners.dataflow.dataflow_exercise_metrics_pipeline_test.ExerciseMetricsPipelineTest)'
----------------------------------------------------------------------
XML: nosetests-beam_python2.7_sdk.xml
----------------------------------------------------------------------
XML: <https://builds.apache.org/job/beam_PostCommit_Py_ValCont/ws/src/sdks/python/nosetests.xml>
----------------------------------------------------------------------
Ran 2 tests in 904.127s
FAILED (errors=2)
cleanup_container
Untagged: us.gcr.io/apache-beam-testing/jenkins/beam_python2.7_sdk:20200309-233411
Untagged: us.gcr.io/apache-beam-testing/jenkins/beam_python2.7_sdk@sha256:5d2cf06a0ef0b4c0078978c03dc933c756fcb0532a6e4bbab9189a22920238a3
Deleted: sha256:f8c5691d9eed5ff85173a616950f6ff5053bcf2e5eed2904caad3aa8f381ca14
Deleted: sha256:ab0a5300c6b7c1e1b1cb85e773a6c436dc2dd0c67f2fc6791d9db5149ae19616
Deleted: sha256:0bbf15d57f2a71245f724ba4aa286bff70dd5388ca4a430ff93e5852813020ac
Deleted: sha256:0be2b146411b4b2c17af13d2db5e797c19526355be3e27a5b89a0f0d89d94a1a
Deleted: sha256:c1ee635f60bd4cf6808da5755d3b616d5b1be731c1f7e1302c1d17349f47f4c2
Deleted: sha256:70616eff17ba3fbee3b4f8ff5d0bab93f1f5c719453361a8b44bd13577ae3bda
Deleted: sha256:70146032990b9447641e4bc04ef686d7c2ab7641946954370f6b798d2cedf710
Deleted: sha256:da755315b9c9e0c03886fd91e036553d2e70643b6bd48922878e373465ec2bd1
Deleted: sha256:f29c6cc9bf1a52fc7027ab47e3c4b1bd0f07abeb5fd5cdfed028d72ccdb25195
Deleted: sha256:4f3dcdbfd126eafa146607ee93704d31283cf8d7a879ae1854552b35676ddf85
Deleted: sha256:badf492781fad418052aeb204c7745346ad39122b89074c250636a3f3edbba88
Deleted: sha256:245ae5c5983aafb08cc82ae40b763598304e2fad347a56e7dae5c41c76146577
Deleted: sha256:617080e13fde696c0b2522a891817e9df5d669295686f6913c94eeb2efc4954d
Deleted: sha256:5dc3cc6f4e2b320e383ef931fcd02cced0a7e893c9872534b3ee0ee43dfe7a3b
Deleted: sha256:bb2fa8d750b9bb3532bdc93c926206377a5297286a8b68271fd5cce0b8dd2741
Deleted: sha256:235ba55de9f930c2c8ad3e01634f151f3e99c8167818dc249c97991adeb650b8
Deleted: sha256:679c511ef8347d2f7bb052bbd8799b5d8a8230c3649fcecfc5cb7af7ed6edb26
Deleted: sha256:0d725fb36ed75cfc3f2fbef25a689b09c09f6bb1e644d530f6a2f25fbd953d63
Deleted: sha256:e6f0cb572899c7d857c90d9bd78ae7560e526d1a545f5d2c59208b42f751cf74
Deleted: sha256:96e649b95f98943c4ed58cacd86bd96bc871f0bde7cc938557d8ff2aedf4320f
Deleted: sha256:0ef60594e4b6cf0760000ae592c9eda92cf84b56be96322c572dbcd42ae2f681
Deleted: sha256:29b7cb68791c494177fad9416dd9798c37c396cfe8bb6fde85b8ef94ff6c895e
Deleted: sha256:c2e2a4fbf2d8f812fef92aaf05e7c9707c28989383e305398d79ec682c7fd1e8
Deleted: sha256:e395f95cb6cc3c917681a34518ea8b48b0b3d783f03c45a975c1dd40f49432ec
Digests:
- us.gcr.io/apache-beam-testing/jenkins/beam_python2.7_sdk@sha256:5d2cf06a0ef0b4c0078978c03dc933c756fcb0532a6e4bbab9189a22920238a3
Associated tags:
- 20200309-233411
Tags:
- us.gcr.io/apache-beam-testing/jenkins/beam_python2.7_sdk:20200309-233411
Deleted [us.gcr.io/apache-beam-testing/jenkins/beam_python2.7_sdk:20200309-233411].
Deleted [us.gcr.io/apache-beam-testing/jenkins/beam_python2.7_sdk@sha256:5d2cf06a0ef0b4c0078978c03dc933c756fcb0532a6e4bbab9189a22920238a3].
Removed the container
Build step 'Execute shell' marked build as failure
---------------------------------------------------------------------
To unsubscribe, e-mail: builds-unsubscribe@beam.apache.org
For additional commands, e-mail: builds-help@beam.apache.org
Jenkins build is back to normal : beam_PostCommit_Py_ValCont #5795
Posted by Apache Jenkins Server <je...@builds.apache.org>.
See <https://builds.apache.org/job/beam_PostCommit_Py_ValCont/5795/display/redirect?page=changes>
---------------------------------------------------------------------
To unsubscribe, e-mail: builds-unsubscribe@beam.apache.org
For additional commands, e-mail: builds-help@beam.apache.org
Build failed in Jenkins: beam_PostCommit_Py_ValCont #5794
Posted by Apache Jenkins Server <je...@builds.apache.org>.
See <https://builds.apache.org/job/beam_PostCommit_Py_ValCont/5794/display/redirect>
Changes:
------------------------------------------
[...truncated 746.92 KB...]
copying apache_beam/typehints/typed_pipeline_test.py -> apache-beam-2.21.0.dev0/apache_beam/typehints
copying apache_beam/typehints/typed_pipeline_test_py3.py -> apache-beam-2.21.0.dev0/apache_beam/typehints
copying apache_beam/typehints/typehints.py -> apache-beam-2.21.0.dev0/apache_beam/typehints
copying apache_beam/typehints/typehints_test.py -> apache-beam-2.21.0.dev0/apache_beam/typehints
copying apache_beam/typehints/typehints_test_py3.py -> apache-beam-2.21.0.dev0/apache_beam/typehints
copying apache_beam/utils/__init__.py -> apache-beam-2.21.0.dev0/apache_beam/utils
copying apache_beam/utils/annotations.py -> apache-beam-2.21.0.dev0/apache_beam/utils
copying apache_beam/utils/annotations_test.py -> apache-beam-2.21.0.dev0/apache_beam/utils
copying apache_beam/utils/counters.pxd -> apache-beam-2.21.0.dev0/apache_beam/utils
copying apache_beam/utils/counters.py -> apache-beam-2.21.0.dev0/apache_beam/utils
copying apache_beam/utils/counters_test.py -> apache-beam-2.21.0.dev0/apache_beam/utils
copying apache_beam/utils/interactive_utils.py -> apache-beam-2.21.0.dev0/apache_beam/utils
copying apache_beam/utils/interactive_utils_test.py -> apache-beam-2.21.0.dev0/apache_beam/utils
copying apache_beam/utils/plugin.py -> apache-beam-2.21.0.dev0/apache_beam/utils
copying apache_beam/utils/processes.py -> apache-beam-2.21.0.dev0/apache_beam/utils
copying apache_beam/utils/processes_test.py -> apache-beam-2.21.0.dev0/apache_beam/utils
copying apache_beam/utils/profiler.py -> apache-beam-2.21.0.dev0/apache_beam/utils
copying apache_beam/utils/proto_utils.py -> apache-beam-2.21.0.dev0/apache_beam/utils
copying apache_beam/utils/retry.py -> apache-beam-2.21.0.dev0/apache_beam/utils
copying apache_beam/utils/retry_test.py -> apache-beam-2.21.0.dev0/apache_beam/utils
copying apache_beam/utils/subprocess_server.py -> apache-beam-2.21.0.dev0/apache_beam/utils
copying apache_beam/utils/thread_pool_executor.py -> apache-beam-2.21.0.dev0/apache_beam/utils
copying apache_beam/utils/thread_pool_executor_test.py -> apache-beam-2.21.0.dev0/apache_beam/utils
copying apache_beam/utils/timestamp.py -> apache-beam-2.21.0.dev0/apache_beam/utils
copying apache_beam/utils/timestamp_test.py -> apache-beam-2.21.0.dev0/apache_beam/utils
copying apache_beam/utils/urns.py -> apache-beam-2.21.0.dev0/apache_beam/utils
copying apache_beam/utils/windowed_value.pxd -> apache-beam-2.21.0.dev0/apache_beam/utils
copying apache_beam/utils/windowed_value.py -> apache-beam-2.21.0.dev0/apache_beam/utils
copying apache_beam/utils/windowed_value_test.py -> apache-beam-2.21.0.dev0/apache_beam/utils
Writing apache-beam-2.21.0.dev0/setup.cfg
creating dist
Creating tar archive
removing 'apache-beam-2.21.0.dev0' (and everything under it)
SDK_LOCATION=$(find dist/apache-beam-*.tar.gz)
find dist/apache-beam-*.tar.gz
# Run ValidatesRunner tests on Google Cloud Dataflow service
echo ">>> RUNNING DATAFLOW RUNNER VALIDATESCONTAINER TEST"
>>> RUNNING DATAFLOW RUNNER VALIDATESCONTAINER TEST
python setup.py nosetests \
--attr ValidatesContainer \
--nologcapture \
--processes=1 \
--process-timeout=900 \
--with-xunitmp \
--xunitmp-file=$XUNIT_FILE \
--ignore-files '.*py3\d?\.py$' \
--test-pipeline-options=" \
--runner=TestDataflowRunner \
--project=$PROJECT \
--worker_harness_container_image=$CONTAINER:$TAG \
--staging_location=$GCS_LOCATION/staging-validatesrunner-test \
--temp_location=$GCS_LOCATION/temp-validatesrunner-test \
--output=$GCS_LOCATION/output \
--sdk_location=$SDK_LOCATION \
--num_workers=1"
setup.py:253: UserWarning: You are using Apache Beam with Python 2. New releases of Apache Beam will soon support Python 3 only.
'You are using Apache Beam with Python 2. '
<https://builds.apache.org/job/beam_PostCommit_Py_ValCont/ws/src/sdks/python/container/venv/python/local/lib/python2.7/site-packages/setuptools/dist.py>:476: UserWarning: Normalizing '2.21.0.dev' to '2.21.0.dev0'
normalized_version,
running nosetests
running egg_info
<https://builds.apache.org/job/beam_PostCommit_Py_ValCont/ws/src/sdks/python/gen_protos.py>:241: UserWarning: Installing grpcio-tools is recommended for development.
warnings.warn('Installing grpcio-tools is recommended for development.')
INFO:gen_protos:Skipping proto regeneration: all files up to date
writing requirements to apache_beam.egg-info/requires.txt
writing apache_beam.egg-info/PKG-INFO
writing top-level names to apache_beam.egg-info/top_level.txt
writing dependency_links to apache_beam.egg-info/dependency_links.txt
writing entry points to apache_beam.egg-info/entry_points.txt
reading manifest file 'apache_beam.egg-info/SOURCES.txt'
reading manifest template 'MANIFEST.in'
warning: no files found matching 'README.md'
warning: no files found matching 'NOTICE'
warning: no files found matching 'LICENSE'
writing manifest file 'apache_beam.egg-info/SOURCES.txt'
<https://builds.apache.org/job/beam_PostCommit_Py_ValCont/ws/src/sdks/python/apache_beam/__init__.py>:82: UserWarning: You are using Apache Beam with Python 2. New releases of Apache Beam will soon support Python 3 only.
'You are using Apache Beam with Python 2. '
WARNING:apache_beam.io.gcp.datastore.v1.datastoreio:Using deprecated Datastore client.
This client will be removed in Beam 3.0 (next Beam major release).
Please migrate to apache_beam.io.gcp.datastore.v1new.datastoreio.
WARNING:root:python-snappy is not installed; some tests will be skipped.
WARNING:root:Tensorflow is not installed, so skipping some tests.
WARNING:apache_beam.runners.interactive.interactive_environment:Interactive Beam requires Python 3.5.3+.
WARNING:apache_beam.runners.interactive.interactive_environment:Dependencies required for Interactive Beam PCollection visualization are not available, please use: `pip install apache-beam[interactive]` to install necessary dependencies to enable all data visualization features.
WARNING:apache_beam.runners.interactive.interactive_environment:You cannot use Interactive Beam features when you are not in an interactive environment such as a Jupyter notebook or ipython terminal.
WARNING:root:Make sure that locally built Python SDK docker image has Python 2.7 interpreter.
<https://builds.apache.org/job/beam_PostCommit_Py_ValCont/ws/src/sdks/python/apache_beam/transforms/trigger_test.py>:541: YAMLLoadWarning: calling yaml.load_all() without Loader=... is deprecated, as the default Loader is unsafe. Please read https://msg.pyyaml.org/load for full details.
for spec in yaml.load_all(open(transcript_filename)):
WARNING:apache_beam.options.pipeline_options:--region not set; will default to us-central1. Future releases of Beam will require the user to set --region explicitly, or else have a default set via the gcloud tool. https://cloud.google.com/compute/docs/regions-zones
WARNING:apache_beam.options.pipeline_options:--region not set; will default to us-central1. Future releases of Beam will require the user to set --region explicitly, or else have a default set via the gcloud tool. https://cloud.google.com/compute/docs/regions-zones
test_wordcount_fnapi_it (apache_beam.examples.wordcount_it_test.WordCountIT) ... ERROR
test_metrics_fnapi_it (apache_beam.runners.dataflow.dataflow_exercise_metrics_pipeline_test.ExerciseMetricsPipelineTest) ... ERROR
======================================================================
ERROR: test_wordcount_fnapi_it (apache_beam.examples.wordcount_it_test.WordCountIT)
----------------------------------------------------------------------
Traceback (most recent call last):
File "<https://builds.apache.org/job/beam_PostCommit_Py_ValCont/ws/src/sdks/python/container/venv/python/local/lib/python2.7/site-packages/nose/plugins/multiprocess.py",> line 812, in run
test(orig)
File "<https://builds.apache.org/job/beam_PostCommit_Py_ValCont/ws/src/sdks/python/container/venv/python/local/lib/python2.7/site-packages/nose/case.py",> line 45, in __call__
return self.run(*arg, **kwarg)
File "<https://builds.apache.org/job/beam_PostCommit_Py_ValCont/ws/src/sdks/python/container/venv/python/local/lib/python2.7/site-packages/nose/case.py",> line 133, in run
self.runTest(result)
File "<https://builds.apache.org/job/beam_PostCommit_Py_ValCont/ws/src/sdks/python/container/venv/python/local/lib/python2.7/site-packages/nose/case.py",> line 151, in runTest
test(result)
File "/usr/lib/python2.7/unittest/case.py", line 393, in __call__
return self.run(*args, **kwds)
File "/usr/lib/python2.7/unittest/case.py", line 329, in run
testMethod()
File "<https://builds.apache.org/job/beam_PostCommit_Py_ValCont/ws/src/sdks/python/apache_beam/examples/wordcount_it_test.py",> line 54, in test_wordcount_fnapi_it
self._run_wordcount_it(wordcount.run, experiment='beam_fn_api')
File "<https://builds.apache.org/job/beam_PostCommit_Py_ValCont/ws/src/sdks/python/apache_beam/examples/wordcount_it_test.py",> line 91, in _run_wordcount_it
save_main_session=False)
File "<https://builds.apache.org/job/beam_PostCommit_Py_ValCont/ws/src/sdks/python/apache_beam/examples/wordcount.py",> line 121, in run
result = p.run()
File "<https://builds.apache.org/job/beam_PostCommit_Py_ValCont/ws/src/sdks/python/apache_beam/pipeline.py",> line 495, in run
self._options).run(False)
File "<https://builds.apache.org/job/beam_PostCommit_Py_ValCont/ws/src/sdks/python/apache_beam/pipeline.py",> line 508, in run
return self.runner.run_pipeline(self, self._options)
File "<https://builds.apache.org/job/beam_PostCommit_Py_ValCont/ws/src/sdks/python/apache_beam/runners/dataflow/test_dataflow_runner.py",> line 75, in run_pipeline
self.result.cancel()
File "<https://builds.apache.org/job/beam_PostCommit_Py_ValCont/ws/src/sdks/python/apache_beam/runners/dataflow/dataflow_runner.py",> line 1571, in cancel
self.job_id(), 'JOB_STATE_CANCELLED'):
File "<https://builds.apache.org/job/beam_PostCommit_Py_ValCont/ws/src/sdks/python/apache_beam/utils/retry.py",> line 236, in wrapper
return fun(*args, **kwargs)
File "<https://builds.apache.org/job/beam_PostCommit_Py_ValCont/ws/src/sdks/python/apache_beam/runners/dataflow/internal/apiclient.py",> line 765, in modify_job_state
self._client.projects_locations_jobs.Update(request)
File "<https://builds.apache.org/job/beam_PostCommit_Py_ValCont/ws/src/sdks/python/apache_beam/runners/dataflow/internal/clients/dataflow/dataflow_v1b3_client.py",> line 796, in Update
config, request, global_params=global_params)
File "<https://builds.apache.org/job/beam_PostCommit_Py_ValCont/ws/src/sdks/python/container/venv/python/local/lib/python2.7/site-packages/apitools/base/py/base_api.py",> line 729, in _RunMethod
http, http_request, **opts)
File "<https://builds.apache.org/job/beam_PostCommit_Py_ValCont/ws/src/sdks/python/container/venv/python/local/lib/python2.7/site-packages/apitools/base/py/http_wrapper.py",> line 346, in MakeRequest
check_response_func=check_response_func)
File "<https://builds.apache.org/job/beam_PostCommit_Py_ValCont/ws/src/sdks/python/container/venv/python/local/lib/python2.7/site-packages/apitools/base/py/http_wrapper.py",> line 396, in _MakeRequestNoRetry
redirections=redirections, connection_type=connection_type)
File "<https://builds.apache.org/job/beam_PostCommit_Py_ValCont/ws/src/sdks/python/container/venv/python/local/lib/python2.7/site-packages/oauth2client/transport.py",> line 169, in new_request
redirections, connection_type)
File "<https://builds.apache.org/job/beam_PostCommit_Py_ValCont/ws/src/sdks/python/container/venv/python/local/lib/python2.7/site-packages/oauth2client/transport.py",> line 169, in new_request
redirections, connection_type)
File "<https://builds.apache.org/job/beam_PostCommit_Py_ValCont/ws/src/sdks/python/container/venv/python/local/lib/python2.7/site-packages/httplib2/__init__.py",> line 2133, in request
cachekey,
File "<https://builds.apache.org/job/beam_PostCommit_Py_ValCont/ws/src/sdks/python/container/venv/python/local/lib/python2.7/site-packages/httplib2/__init__.py",> line 1796, in _request
conn, request_uri, method, body, headers
File "<https://builds.apache.org/job/beam_PostCommit_Py_ValCont/ws/src/sdks/python/container/venv/python/local/lib/python2.7/site-packages/httplib2/__init__.py",> line 1737, in _conn_request
response = conn.getresponse()
File "/usr/lib/python2.7/httplib.py", line 1152, in getresponse
response.begin()
File "/usr/lib/python2.7/httplib.py", line 463, in begin
version, status, reason = self._read_status()
File "/usr/lib/python2.7/httplib.py", line 419, in _read_status
line = self.fp.readline(_MAXLINE + 1)
File "/usr/lib/python2.7/socket.py", line 480, in readline
data = self._sock.recv(self._rbufsize)
File "/usr/lib/python2.7/ssl.py", line 756, in recv
return self.read(buflen)
File "/usr/lib/python2.7/ssl.py", line 643, in read
v = self._sslobj.read(len)
File "<https://builds.apache.org/job/beam_PostCommit_Py_ValCont/ws/src/sdks/python/container/venv/python/local/lib/python2.7/site-packages/nose/plugins/multiprocess.py",> line 276, in signalhandler
raise TimedOutException()
TimedOutException: 'test_wordcount_fnapi_it (apache_beam.examples.wordcount_it_test.WordCountIT)'
======================================================================
ERROR: test_metrics_fnapi_it (apache_beam.runners.dataflow.dataflow_exercise_metrics_pipeline_test.ExerciseMetricsPipelineTest)
----------------------------------------------------------------------
Traceback (most recent call last):
File "<https://builds.apache.org/job/beam_PostCommit_Py_ValCont/ws/src/sdks/python/container/venv/python/local/lib/python2.7/site-packages/nose/plugins/multiprocess.py",> line 812, in run
test(orig)
File "<https://builds.apache.org/job/beam_PostCommit_Py_ValCont/ws/src/sdks/python/container/venv/python/local/lib/python2.7/site-packages/nose/case.py",> line 45, in __call__
return self.run(*arg, **kwarg)
File "<https://builds.apache.org/job/beam_PostCommit_Py_ValCont/ws/src/sdks/python/container/venv/python/local/lib/python2.7/site-packages/nose/case.py",> line 133, in run
self.runTest(result)
File "<https://builds.apache.org/job/beam_PostCommit_Py_ValCont/ws/src/sdks/python/container/venv/python/local/lib/python2.7/site-packages/nose/case.py",> line 151, in runTest
test(result)
File "/usr/lib/python2.7/unittest/case.py", line 393, in __call__
return self.run(*args, **kwds)
File "/usr/lib/python2.7/unittest/case.py", line 329, in run
testMethod()
File "<https://builds.apache.org/job/beam_PostCommit_Py_ValCont/ws/src/sdks/python/apache_beam/runners/dataflow/dataflow_exercise_metrics_pipeline_test.py",> line 57, in test_metrics_fnapi_it
result = self.run_pipeline(experiment='beam_fn_api')
File "<https://builds.apache.org/job/beam_PostCommit_Py_ValCont/ws/src/sdks/python/apache_beam/runners/dataflow/dataflow_exercise_metrics_pipeline_test.py",> line 38, in run_pipeline
test_pipeline = TestPipeline(is_integration_test=True)
File "<https://builds.apache.org/job/beam_PostCommit_Py_ValCont/ws/src/sdks/python/apache_beam/testing/test_pipeline.py",> line 107, in __init__
super(TestPipeline, self).__init__(runner, options)
File "<https://builds.apache.org/job/beam_PostCommit_Py_ValCont/ws/src/sdks/python/apache_beam/pipeline.py",> line 196, in __init__
errors = PipelineOptionsValidator(self._options, runner).validate()
File "<https://builds.apache.org/job/beam_PostCommit_Py_ValCont/ws/src/sdks/python/apache_beam/options/pipeline_options_validator.py",> line 121, in validate
errors.extend(self.options.view_as(cls).validate(self))
File "<https://builds.apache.org/job/beam_PostCommit_Py_ValCont/ws/src/sdks/python/apache_beam/options/pipeline_options.py",> line 619, in validate
self.view_as(GoogleCloudOptions).region = self._get_default_gcp_region()
File "<https://builds.apache.org/job/beam_PostCommit_Py_ValCont/ws/src/sdks/python/apache_beam/options/pipeline_options.py",> line 584, in _get_default_gcp_region
raw_output = processes.check_output(cmd, stderr=DEVNULL)
File "<https://builds.apache.org/job/beam_PostCommit_Py_ValCont/ws/src/sdks/python/apache_beam/utils/processes.py",> line 91, in check_output
out = subprocess.check_output(*args, **kwargs)
File "/usr/lib/python2.7/subprocess.py", line 568, in check_output
output, unused_err = process.communicate()
File "/usr/lib/python2.7/subprocess.py", line 792, in communicate
stdout = _eintr_retry_call(self.stdout.read)
File "/usr/lib/python2.7/subprocess.py", line 476, in _eintr_retry_call
return func(*args)
File "<https://builds.apache.org/job/beam_PostCommit_Py_ValCont/ws/src/sdks/python/container/venv/python/local/lib/python2.7/site-packages/nose/plugins/multiprocess.py",> line 276, in signalhandler
raise TimedOutException()
TimedOutException: 'test_metrics_fnapi_it (apache_beam.runners.dataflow.dataflow_exercise_metrics_pipeline_test.ExerciseMetricsPipelineTest)'
----------------------------------------------------------------------
XML: nosetests-beam_python2.7_sdk.xml
----------------------------------------------------------------------
XML: <https://builds.apache.org/job/beam_PostCommit_Py_ValCont/ws/src/sdks/python/nosetests.xml>
----------------------------------------------------------------------
Ran 2 tests in 911.679s
FAILED (errors=2)
cleanup_container
Untagged: us.gcr.io/apache-beam-testing/jenkins/beam_python2.7_sdk:20200310-004451
Untagged: us.gcr.io/apache-beam-testing/jenkins/beam_python2.7_sdk@sha256:5a55eb9cba8b6e20b4125ffaa778b80f9ab26b13a586cb14840f217260e8ead9
Deleted: sha256:5c147b22dc8691f44effaaf2ebefe39d930c030d863079e87449911952b323c4
Deleted: sha256:0e81fd307c33213b1b9d286e2e2ce7f6db11ce8c7fc5c2d91f20bb4e8c2e77d4
Deleted: sha256:9a2ac4e61ccddb58befe60b3d280a07dfab84736ffcbb033d83d22c519f030a7
Deleted: sha256:7d66d178f0a1b347a0ffaa519fc649e1b390175c7a1b4c1bbd12a774152542e4
Deleted: sha256:f2004640cf37b76d924b529773bd1a2ebd4c4e3a579dea78624a2e66db9287dd
Deleted: sha256:511c38abc601482558aa20901f773ee4bcd1b17a5ac5784253c99e225ceda78e
Deleted: sha256:41614a6507e69ff3c700dec3a92c8311819cc33a0ab3c6910d67729354b5301f
Deleted: sha256:ea1c91873dd59c88c46b6aa3aa936477a4ac9ea3647f1391c0d1e956266eba3c
Deleted: sha256:d287594fbca83e5e910fc0b9c280f85686953ecbfc86138ef47f65cca7427932
Deleted: sha256:b2672441ff81e059f604b1102c4d8d6ee18a1eb07043ad844385f718fe86f289
Deleted: sha256:e5ba7de49b3f616bf930179f97af7bf81de0b1a99fe135176cb7cf6526edb092
Deleted: sha256:08b6a520af89fa32123058b686144c91c4c3d2c1f2ed3ea0064a2e1433467e3e
Deleted: sha256:4bb4f82e3e55ef7f52e34eae977fa728ee372066d2ccd6cca939d01b1e146051
Deleted: sha256:431933d6faa331d65bb28c45b8431e9740ebbb97b365848db9b5a1d57e247b19
Deleted: sha256:0946998e49ed30a7a0ee62d8fab1ce00b2eb047d3b2282d62ba0d03cbb7aeb43
Deleted: sha256:f0cb8c2ce1f7b69bbd65ab4eebae1de1e31d22adc125892830a8fdf4a0710308
Deleted: sha256:2340c7926b0c6c0223068334e966c54b04bac90a07c928b7549a2a3d9a700ac8
Deleted: sha256:9e609639eda61f4e5f966c6ecd98d4b7560b5034701ef16c7079477573ba6933
Deleted: sha256:f860ace6bd48b39f4292b609f3a6782fb6076aba6a210410261e4f9bcba03ef4
Deleted: sha256:4ef229b3b96dd093795d54e21d88f8e2743739cf8b5bee1fbd1bff760202e81e
Deleted: sha256:9d94401508b282a64dc9c6935bc5544a6a7d02fdfa493a0ce49378e01d27a84d
Deleted: sha256:ef794c45130552439ec6c57dda1ccce012265b731516f9eae78a7cdd3516a997
Deleted: sha256:72d8cac4a8bcbe65c868d2aa105312f88ec0554f2a8e418fe491cc7ad0ef5c1a
Deleted: sha256:de9bbddf21909b465a8c7d751de38cbf1edfa68c25fb25e126d8da40e03b7a48
Digests:
- us.gcr.io/apache-beam-testing/jenkins/beam_python2.7_sdk@sha256:5a55eb9cba8b6e20b4125ffaa778b80f9ab26b13a586cb14840f217260e8ead9
Associated tags:
- 20200310-004451
Tags:
- us.gcr.io/apache-beam-testing/jenkins/beam_python2.7_sdk:20200310-004451
Deleted [us.gcr.io/apache-beam-testing/jenkins/beam_python2.7_sdk:20200310-004451].
Deleted [us.gcr.io/apache-beam-testing/jenkins/beam_python2.7_sdk@sha256:5a55eb9cba8b6e20b4125ffaa778b80f9ab26b13a586cb14840f217260e8ead9].
Removed the container
Build step 'Execute shell' marked build as failure
---------------------------------------------------------------------
To unsubscribe, e-mail: builds-unsubscribe@beam.apache.org
For additional commands, e-mail: builds-help@beam.apache.org