You are viewing a plain text version of this content. The canonical link for it is here.
Posted to yarn-dev@hadoop.apache.org by Apache Jenkins Server <je...@builds.apache.org> on 2015/08/27 15:11:27 UTC
Failed: YARN-4089 PreCommit Build #8927
Jira: https://issues.apache.org/jira/browse/YARN-4089
Build: https://builds.apache.org/job/PreCommit-YARN-Build/8927/
###################################################################################
########################## LAST 60 LINES OF THE CONSOLE ###########################
[...truncated 284 lines...]
| | | | warnings.
| -1 | checkstyle | 0m 51s | The applied patch generated 1 new
| | | | checkstyle issues (total was 70, now
| | | | 71).
| +1 | whitespace | 0m 0s | The patch has no lines that end in
| | | | whitespace.
| +1 | install | 1m 28s | mvn install still works.
| +1 | eclipse:eclipse | 0m 34s | The patch built with
| | | | eclipse:eclipse.
| +1 | findbugs | 1m 28s | The patch does not introduce any
| | | | new Findbugs (version 3.0.0)
| | | | warnings.
| +1 | yarn tests | 53m 30s | Tests passed in
| | | | hadoop-yarn-server-resourcemanager.
| | | 92m 57s |
|| Subsystem || Report/Notes ||
============================================================================
| Patch URL | http://issues.apache.org/jira/secure/attachment/12752718/YARN-4089.001.patch |
| Optional Tests | javadoc javac unit findbugs checkstyle |
| git revision | trunk / 0bf2854 |
| checkstyle | /home/jenkins/jenkins-slave/workspace/PreCommit-YARN-Build/patchprocess/diffcheckstylehadoop-yarn-server-resourcemanager.txt |
| hadoop-yarn-server-resourcemanager test log | /home/jenkins/jenkins-slave/workspace/PreCommit-YARN-Build/patchprocess/testrun_hadoop-yarn-server-resourcemanager.txt |
| Test Results | https://builds.apache.org/job/PreCommit-YARN-Build/8927/testReport/ |
| Java | 1.7.0_55 |
| uname | Linux asf905.gq1.ygridcore.net 3.13.0-36-lowlatency #63-Ubuntu SMP PREEMPT Wed Sep 3 21:56:12 UTC 2014 x86_64 x86_64 x86_64 GNU/Linux |
============================================================================
============================================================================
Adding comment to JIRA
============================================================================
============================================================================
Comment added.
4ba72443daba89d71a85b82ea87fdf10cfb860f2 logged out
============================================================================
============================================================================
Finished build.
============================================================================
============================================================================
Build step 'Execute shell' marked build as failure
Archiving artifacts
Sending artifact delta relative to PreCommit-YARN-Build #8916
Archived 30 artifacts
Archive block size is 32768
Received 108 blocks and 9816733 bytes
Compression is 26.5%
Took 2.8 sec
[description-setter] Could not determine description.
Recording test results
Email was triggered for: Failure
Sending email for trigger: Failure
###################################################################################
############################## FAILED TESTS (if any) ##############################
All tests passed
Failed: YARN-4092 PreCommit Build #8936
Posted by Apache Jenkins Server <je...@builds.apache.org>.
Jira: https://issues.apache.org/jira/browse/YARN-4092
Build: https://builds.apache.org/job/PreCommit-YARN-Build/8936/
###################################################################################
########################## LAST 60 LINES OF THE CONSOLE ###########################
[...truncated 360 lines...]
| | | | p-yarn-server/hadoop-yarn-server-reso
| | | | urcemanager compilation is broken.
| +1 | findbugs | 0m 46s | The patch does not introduce any
| | | | new Findbugs (version ) warnings.
| -1 | yarn tests | 0m 15s | Tests failed in hadoop-yarn-client.
| +1 | yarn tests | 2m 0s | Tests passed in hadoop-yarn-common.
| +1 | yarn tests | 54m 2s | Tests passed in
| | | | hadoop-yarn-server-resourcemanager.
| | | 98m 56s |
Reason | Tests
Failed build | hadoop-yarn-client
|| Subsystem || Report/Notes ||
============================================================================
| Patch URL | http://issues.apache.org/jira/secure/attachment/12753069/YARN-4092.2.patch |
| Optional Tests | javac unit findbugs checkstyle javadoc |
| git revision | trunk / cbb2495 |
| whitespace | /home/jenkins/jenkins-slave/workspace/PreCommit-YARN-Build/patchprocess/whitespace.txt |
| hadoop-yarn-client test log | /home/jenkins/jenkins-slave/workspace/PreCommit-YARN-Build/patchprocess/testrun_hadoop-yarn-client.txt |
| hadoop-yarn-common test log | /home/jenkins/jenkins-slave/workspace/PreCommit-YARN-Build/patchprocess/testrun_hadoop-yarn-common.txt |
| hadoop-yarn-server-resourcemanager test log | /home/jenkins/jenkins-slave/workspace/PreCommit-YARN-Build/patchprocess/testrun_hadoop-yarn-server-resourcemanager.txt |
| Test Results | https://builds.apache.org/job/PreCommit-YARN-Build/8936/testReport/ |
| Java | 1.7.0_55 |
| uname | Linux asf905.gq1.ygridcore.net 3.13.0-36-lowlatency #63-Ubuntu SMP PREEMPT Wed Sep 3 21:56:12 UTC 2014 x86_64 x86_64 x86_64 GNU/Linux |
============================================================================
============================================================================
Adding comment to JIRA
============================================================================
============================================================================
Comment added.
4bfdd489013ed3e79789a237f4387a7323918664 logged out
============================================================================
============================================================================
Finished build.
============================================================================
============================================================================
Build step 'Execute shell' marked build as failure
Archiving artifacts
Sending artifact delta relative to PreCommit-YARN-Build #8916
Archived 42 artifacts
Archive block size is 32768
Received 73 blocks and 11311278 bytes
Compression is 17.5%
Took 2.7 sec
Description set: MAPREDUCE-6452
Recording test results
Email was triggered for: Failure
Sending email for trigger: Failure
###################################################################################
############################## FAILED TESTS (if any) ##############################
All tests passed
Failed: YARN-4092 PreCommit Build #8935
Posted by Apache Jenkins Server <je...@builds.apache.org>.
Jira: https://issues.apache.org/jira/browse/YARN-4092
Build: https://builds.apache.org/job/PreCommit-YARN-Build/8935/
###################################################################################
########################## LAST 60 LINES OF THE CONSOLE ###########################
[...truncated 314 lines...]
| +1 | yarn tests | 1m 58s | Tests passed in hadoop-yarn-common.
| -1 | yarn tests | 50m 10s | Tests failed in
| | | | hadoop-yarn-server-resourcemanager.
| | | 95m 26s |
Reason | Tests
FindBugs | module:hadoop-yarn-server-resourcemanager
Failed unit tests | hadoop.yarn.server.resourcemanager.scheduler.fair.TestFairSchedulerEventLog
| hadoop.yarn.server.resourcemanager.scheduler.fair.TestFairSchedulerQueueACLs
| hadoop.yarn.server.resourcemanager.scheduler.fair.TestFairScheduler
| hadoop.yarn.server.resourcemanager.scheduler.capacity.TestCapacityScheduler
Timed out tests | org.apache.hadoop.yarn.server.resourcemanager.scheduler.capacity.TestNodeLabelContainerAllocation
| org.apache.hadoop.yarn.server.resourcemanager.scheduler.fair.TestMaxRunningAppsEnforcer
|| Subsystem || Report/Notes ||
============================================================================
| Patch URL | http://issues.apache.org/jira/secure/attachment/12753032/YARN-4092.1.patch |
| Optional Tests | javadoc javac unit findbugs checkstyle |
| git revision | trunk / beb65c9 |
| Findbugs warnings | /home/jenkins/jenkins-slave/workspace/PreCommit-YARN-Build/patchprocess/newPatchFindbugsWarningshadoop-yarn-server-resourcemanager.html |
| hadoop-yarn-common test log | /home/jenkins/jenkins-slave/workspace/PreCommit-YARN-Build/patchprocess/testrun_hadoop-yarn-common.txt |
| hadoop-yarn-server-resourcemanager test log | /home/jenkins/jenkins-slave/workspace/PreCommit-YARN-Build/patchprocess/testrun_hadoop-yarn-server-resourcemanager.txt |
| Test Results | https://builds.apache.org/job/PreCommit-YARN-Build/8935/testReport/ |
| Java | 1.7.0_55 |
| uname | Linux asf905.gq1.ygridcore.net 3.13.0-36-lowlatency #63-Ubuntu SMP PREEMPT Wed Sep 3 21:56:12 UTC 2014 x86_64 x86_64 x86_64 GNU/Linux |
============================================================================
============================================================================
Adding comment to JIRA
============================================================================
============================================================================
Comment added.
907da8eb2ef9d2b0d51a4cbf28beebf07a86e476 logged out
============================================================================
============================================================================
Finished build.
============================================================================
============================================================================
Build step 'Execute shell' marked build as failure
Archiving artifacts
Sending artifact delta relative to PreCommit-YARN-Build #8916
Archived 43 artifacts
Archive block size is 32768
Received 79 blocks and 11994026 bytes
Compression is 17.8%
Took 3.1 sec
[description-setter] Could not determine description.
Recording test results
Email was triggered for: Failure
Sending email for trigger: Failure
###################################################################################
############################## FAILED TESTS (if any) ##############################
125 tests failed.
REGRESSION: org.apache.hadoop.yarn.server.resourcemanager.scheduler.capacity.TestCapacityScheduler.testRefreshQueues
Error Message:
java.util.zip.ZipException: invalid stored block lengths
Stack Trace:
java.lang.RuntimeException: java.util.zip.ZipException: invalid stored block lengths
at java.util.zip.InflaterInputStream.read(InflaterInputStream.java:164)
at java.util.zip.InflaterInputStream.read(InflaterInputStream.java:122)
at java.io.FilterInputStream.read(FilterInputStream.java:83)
at org.apache.xerces.impl.XMLEntityManager$RewindableInputStream.read(Unknown Source)
at org.apache.xerces.impl.XMLEntityManager.setupCurrentEntity(Unknown Source)
at org.apache.xerces.impl.XMLVersionDetector.determineDocVersion(Unknown Source)
at org.apache.xerces.parsers.XML11Configuration.parse(Unknown Source)
at org.apache.xerces.parsers.XML11Configuration.parse(Unknown Source)
at org.apache.xerces.parsers.XMLParser.parse(Unknown Source)
at org.apache.xerces.parsers.DOMParser.parse(Unknown Source)
at org.apache.xerces.jaxp.DocumentBuilderImpl.parse(Unknown Source)
at javax.xml.parsers.DocumentBuilder.parse(DocumentBuilder.java:150)
at org.apache.hadoop.conf.Configuration.parse(Configuration.java:2546)
at org.apache.hadoop.conf.Configuration.parse(Configuration.java:2534)
at org.apache.hadoop.conf.Configuration.loadResource(Configuration.java:2605)
at org.apache.hadoop.conf.Configuration.loadResources(Configuration.java:2558)
at org.apache.hadoop.conf.Configuration.getProps(Configuration.java:2469)
at org.apache.hadoop.conf.Configuration.set(Configuration.java:1205)
at org.apache.hadoop.conf.Configuration.set(Configuration.java:1177)
at org.apache.hadoop.yarn.server.resourcemanager.scheduler.capacity.CapacitySchedulerConfiguration.setQueues(CapacitySchedulerConfiguration.java:606)
at org.apache.hadoop.yarn.server.resourcemanager.scheduler.capacity.TestCapacityScheduler.setupQueueConfiguration(TestCapacityScheduler.java:382)
at org.apache.hadoop.yarn.server.resourcemanager.scheduler.capacity.TestCapacityScheduler.setUp(TestCapacityScheduler.java:181)
REGRESSION: org.apache.hadoop.yarn.server.resourcemanager.scheduler.capacity.TestCapacityScheduler.testRefreshQueues
Error Message:
null
Stack Trace:
java.lang.NullPointerException: null
at org.apache.hadoop.yarn.server.resourcemanager.ResourceManager.transitionToStandby(ResourceManager.java:1029)
at org.apache.hadoop.yarn.server.resourcemanager.ResourceManager.serviceStop(ResourceManager.java:1085)
at org.apache.hadoop.service.AbstractService.stop(AbstractService.java:221)
at org.apache.hadoop.yarn.server.resourcemanager.scheduler.capacity.TestCapacityScheduler.tearDown(TestCapacityScheduler.java:197)
REGRESSION: org.apache.hadoop.yarn.server.resourcemanager.scheduler.capacity.TestCapacityScheduler.testParentQueueMaxCapsAreRespected
Error Message:
java.util.zip.ZipException: invalid stored block lengths
Stack Trace:
java.lang.RuntimeException: java.util.zip.ZipException: invalid stored block lengths
at java.util.zip.InflaterInputStream.read(InflaterInputStream.java:164)
at java.util.zip.InflaterInputStream.read(InflaterInputStream.java:122)
at java.io.FilterInputStream.read(FilterInputStream.java:83)
at org.apache.xerces.impl.XMLEntityManager$RewindableInputStream.read(Unknown Source)
at org.apache.xerces.impl.XMLEntityManager.setupCurrentEntity(Unknown Source)
at org.apache.xerces.impl.XMLVersionDetector.determineDocVersion(Unknown Source)
at org.apache.xerces.parsers.XML11Configuration.parse(Unknown Source)
at org.apache.xerces.parsers.XML11Configuration.parse(Unknown Source)
at org.apache.xerces.parsers.XMLParser.parse(Unknown Source)
at org.apache.xerces.parsers.DOMParser.parse(Unknown Source)
at org.apache.xerces.jaxp.DocumentBuilderImpl.parse(Unknown Source)
at javax.xml.parsers.DocumentBuilder.parse(DocumentBuilder.java:150)
at org.apache.hadoop.conf.Configuration.parse(Configuration.java:2546)
at org.apache.hadoop.conf.Configuration.parse(Configuration.java:2534)
at org.apache.hadoop.conf.Configuration.loadResource(Configuration.java:2605)
at org.apache.hadoop.conf.Configuration.loadResources(Configuration.java:2558)
at org.apache.hadoop.conf.Configuration.getProps(Configuration.java:2469)
at org.apache.hadoop.conf.Configuration.set(Configuration.java:1205)
at org.apache.hadoop.conf.Configuration.set(Configuration.java:1177)
at org.apache.hadoop.yarn.server.resourcemanager.scheduler.capacity.CapacitySchedulerConfiguration.setQueues(CapacitySchedulerConfiguration.java:606)
at org.apache.hadoop.yarn.server.resourcemanager.scheduler.capacity.TestCapacityScheduler.setupQueueConfiguration(TestCapacityScheduler.java:382)
at org.apache.hadoop.yarn.server.resourcemanager.scheduler.capacity.TestCapacityScheduler.setUp(TestCapacityScheduler.java:181)
REGRESSION: org.apache.hadoop.yarn.server.resourcemanager.scheduler.capacity.TestCapacityScheduler.testParentQueueMaxCapsAreRespected
Error Message:
null
Stack Trace:
java.lang.NullPointerException: null
at org.apache.hadoop.yarn.server.resourcemanager.ResourceManager.transitionToStandby(ResourceManager.java:1029)
at org.apache.hadoop.yarn.server.resourcemanager.ResourceManager.serviceStop(ResourceManager.java:1085)
at org.apache.hadoop.service.AbstractService.stop(AbstractService.java:221)
at org.apache.hadoop.yarn.server.resourcemanager.scheduler.capacity.TestCapacityScheduler.tearDown(TestCapacityScheduler.java:197)
REGRESSION: org.apache.hadoop.yarn.server.resourcemanager.scheduler.capacity.TestCapacityScheduler.testKillAllAppsInvalidSource
Error Message:
java.util.zip.ZipException: invalid stored block lengths
Stack Trace:
java.lang.RuntimeException: java.util.zip.ZipException: invalid stored block lengths
at java.util.zip.InflaterInputStream.read(InflaterInputStream.java:164)
at java.util.zip.InflaterInputStream.read(InflaterInputStream.java:122)
at java.io.FilterInputStream.read(FilterInputStream.java:83)
at org.apache.xerces.impl.XMLEntityManager$RewindableInputStream.read(Unknown Source)
at org.apache.xerces.impl.XMLEntityManager.setupCurrentEntity(Unknown Source)
at org.apache.xerces.impl.XMLVersionDetector.determineDocVersion(Unknown Source)
at org.apache.xerces.parsers.XML11Configuration.parse(Unknown Source)
at org.apache.xerces.parsers.XML11Configuration.parse(Unknown Source)
at org.apache.xerces.parsers.XMLParser.parse(Unknown Source)
at org.apache.xerces.parsers.DOMParser.parse(Unknown Source)
at org.apache.xerces.jaxp.DocumentBuilderImpl.parse(Unknown Source)
at javax.xml.parsers.DocumentBuilder.parse(DocumentBuilder.java:150)
at org.apache.hadoop.conf.Configuration.parse(Configuration.java:2546)
at org.apache.hadoop.conf.Configuration.parse(Configuration.java:2534)
at org.apache.hadoop.conf.Configuration.loadResource(Configuration.java:2605)
at org.apache.hadoop.conf.Configuration.loadResources(Configuration.java:2558)
at org.apache.hadoop.conf.Configuration.getProps(Configuration.java:2469)
at org.apache.hadoop.conf.Configuration.set(Configuration.java:1205)
at org.apache.hadoop.conf.Configuration.set(Configuration.java:1177)
at org.apache.hadoop.yarn.server.resourcemanager.scheduler.capacity.CapacitySchedulerConfiguration.setQueues(CapacitySchedulerConfiguration.java:606)
at org.apache.hadoop.yarn.server.resourcemanager.scheduler.capacity.TestCapacityScheduler.setupQueueConfiguration(TestCapacityScheduler.java:382)
at org.apache.hadoop.yarn.server.resourcemanager.scheduler.capacity.TestCapacityScheduler.setUp(TestCapacityScheduler.java:181)
REGRESSION: org.apache.hadoop.yarn.server.resourcemanager.scheduler.capacity.TestCapacityScheduler.testKillAllAppsInvalidSource
Error Message:
null
Stack Trace:
java.lang.NullPointerException: null
at org.apache.hadoop.yarn.server.resourcemanager.ResourceManager.transitionToStandby(ResourceManager.java:1029)
at org.apache.hadoop.yarn.server.resourcemanager.ResourceManager.serviceStop(ResourceManager.java:1085)
at org.apache.hadoop.service.AbstractService.stop(AbstractService.java:221)
at org.apache.hadoop.yarn.server.resourcemanager.scheduler.capacity.TestCapacityScheduler.tearDown(TestCapacityScheduler.java:197)
REGRESSION: org.apache.hadoop.yarn.server.resourcemanager.scheduler.capacity.TestCapacityScheduler.testResourceOverCommit
Error Message:
java.util.zip.ZipException: invalid stored block lengths
Stack Trace:
java.lang.RuntimeException: java.util.zip.ZipException: invalid stored block lengths
at java.util.zip.InflaterInputStream.read(InflaterInputStream.java:164)
at java.util.zip.InflaterInputStream.read(InflaterInputStream.java:122)
at java.io.FilterInputStream.read(FilterInputStream.java:83)
at org.apache.xerces.impl.XMLEntityManager$RewindableInputStream.read(Unknown Source)
at org.apache.xerces.impl.XMLEntityManager.setupCurrentEntity(Unknown Source)
at org.apache.xerces.impl.XMLVersionDetector.determineDocVersion(Unknown Source)
at org.apache.xerces.parsers.XML11Configuration.parse(Unknown Source)
at org.apache.xerces.parsers.XML11Configuration.parse(Unknown Source)
at org.apache.xerces.parsers.XMLParser.parse(Unknown Source)
at org.apache.xerces.parsers.DOMParser.parse(Unknown Source)
at org.apache.xerces.jaxp.DocumentBuilderImpl.parse(Unknown Source)
at javax.xml.parsers.DocumentBuilder.parse(DocumentBuilder.java:150)
at org.apache.hadoop.conf.Configuration.parse(Configuration.java:2546)
at org.apache.hadoop.conf.Configuration.parse(Configuration.java:2534)
at org.apache.hadoop.conf.Configuration.loadResource(Configuration.java:2605)
at org.apache.hadoop.conf.Configuration.loadResources(Configuration.java:2558)
at org.apache.hadoop.conf.Configuration.getProps(Configuration.java:2469)
at org.apache.hadoop.conf.Configuration.set(Configuration.java:1205)
at org.apache.hadoop.conf.Configuration.set(Configuration.java:1177)
at org.apache.hadoop.yarn.server.resourcemanager.scheduler.capacity.CapacitySchedulerConfiguration.setQueues(CapacitySchedulerConfiguration.java:606)
at org.apache.hadoop.yarn.server.resourcemanager.scheduler.capacity.TestCapacityScheduler.setupQueueConfiguration(TestCapacityScheduler.java:382)
at org.apache.hadoop.yarn.server.resourcemanager.scheduler.capacity.TestCapacityScheduler.setUp(TestCapacityScheduler.java:181)
REGRESSION: org.apache.hadoop.yarn.server.resourcemanager.scheduler.capacity.TestCapacityScheduler.testResourceOverCommit
Error Message:
null
Stack Trace:
java.lang.NullPointerException: null
at org.apache.hadoop.yarn.server.resourcemanager.ResourceManager.transitionToStandby(ResourceManager.java:1029)
at org.apache.hadoop.yarn.server.resourcemanager.ResourceManager.serviceStop(ResourceManager.java:1085)
at org.apache.hadoop.service.AbstractService.stop(AbstractService.java:221)
at org.apache.hadoop.yarn.server.resourcemanager.scheduler.capacity.TestCapacityScheduler.tearDown(TestCapacityScheduler.java:197)
REGRESSION: org.apache.hadoop.yarn.server.resourcemanager.scheduler.capacity.TestCapacityScheduler.testNumClusterNodes
Error Message:
java.util.zip.ZipException: invalid stored block lengths
Stack Trace:
java.lang.RuntimeException: java.util.zip.ZipException: invalid stored block lengths
at java.util.zip.InflaterInputStream.read(InflaterInputStream.java:164)
at java.util.zip.InflaterInputStream.read(InflaterInputStream.java:122)
at java.io.FilterInputStream.read(FilterInputStream.java:83)
at org.apache.xerces.impl.XMLEntityManager$RewindableInputStream.read(Unknown Source)
at org.apache.xerces.impl.XMLEntityManager.setupCurrentEntity(Unknown Source)
at org.apache.xerces.impl.XMLVersionDetector.determineDocVersion(Unknown Source)
at org.apache.xerces.parsers.XML11Configuration.parse(Unknown Source)
at org.apache.xerces.parsers.XML11Configuration.parse(Unknown Source)
at org.apache.xerces.parsers.XMLParser.parse(Unknown Source)
at org.apache.xerces.parsers.DOMParser.parse(Unknown Source)
at org.apache.xerces.jaxp.DocumentBuilderImpl.parse(Unknown Source)
at javax.xml.parsers.DocumentBuilder.parse(DocumentBuilder.java:150)
at org.apache.hadoop.conf.Configuration.parse(Configuration.java:2546)
at org.apache.hadoop.conf.Configuration.parse(Configuration.java:2534)
at org.apache.hadoop.conf.Configuration.loadResource(Configuration.java:2605)
at org.apache.hadoop.conf.Configuration.loadResources(Configuration.java:2558)
at org.apache.hadoop.conf.Configuration.getProps(Configuration.java:2469)
at org.apache.hadoop.conf.Configuration.set(Configuration.java:1205)
at org.apache.hadoop.conf.Configuration.set(Configuration.java:1177)
at org.apache.hadoop.yarn.server.resourcemanager.scheduler.capacity.CapacitySchedulerConfiguration.setQueues(CapacitySchedulerConfiguration.java:606)
at org.apache.hadoop.yarn.server.resourcemanager.scheduler.capacity.TestCapacityScheduler.setupQueueConfiguration(TestCapacityScheduler.java:382)
at org.apache.hadoop.yarn.server.resourcemanager.scheduler.capacity.TestCapacityScheduler.setUp(TestCapacityScheduler.java:181)
REGRESSION: org.apache.hadoop.yarn.server.resourcemanager.scheduler.capacity.TestCapacityScheduler.testNumClusterNodes
Error Message:
null
Stack Trace:
java.lang.NullPointerException: null
at org.apache.hadoop.yarn.server.resourcemanager.ResourceManager.transitionToStandby(ResourceManager.java:1029)
at org.apache.hadoop.yarn.server.resourcemanager.ResourceManager.serviceStop(ResourceManager.java:1085)
at org.apache.hadoop.service.AbstractService.stop(AbstractService.java:221)
at org.apache.hadoop.yarn.server.resourcemanager.scheduler.capacity.TestCapacityScheduler.tearDown(TestCapacityScheduler.java:197)
REGRESSION: org.apache.hadoop.yarn.server.resourcemanager.scheduler.capacity.TestCapacityScheduler.testKillAllAppsInQueue
Error Message:
java.util.zip.ZipException: invalid stored block lengths
Stack Trace:
java.lang.RuntimeException: java.util.zip.ZipException: invalid stored block lengths
at java.util.zip.InflaterInputStream.read(InflaterInputStream.java:164)
at java.util.zip.InflaterInputStream.read(InflaterInputStream.java:122)
at java.io.FilterInputStream.read(FilterInputStream.java:83)
at org.apache.xerces.impl.XMLEntityManager$RewindableInputStream.read(Unknown Source)
at org.apache.xerces.impl.XMLEntityManager.setupCurrentEntity(Unknown Source)
at org.apache.xerces.impl.XMLVersionDetector.determineDocVersion(Unknown Source)
at org.apache.xerces.parsers.XML11Configuration.parse(Unknown Source)
at org.apache.xerces.parsers.XML11Configuration.parse(Unknown Source)
at org.apache.xerces.parsers.XMLParser.parse(Unknown Source)
at org.apache.xerces.parsers.DOMParser.parse(Unknown Source)
at org.apache.xerces.jaxp.DocumentBuilderImpl.parse(Unknown Source)
at javax.xml.parsers.DocumentBuilder.parse(DocumentBuilder.java:150)
at org.apache.hadoop.conf.Configuration.parse(Configuration.java:2546)
at org.apache.hadoop.conf.Configuration.parse(Configuration.java:2534)
at org.apache.hadoop.conf.Configuration.loadResource(Configuration.java:2605)
at org.apache.hadoop.conf.Configuration.loadResources(Configuration.java:2558)
at org.apache.hadoop.conf.Configuration.getProps(Configuration.java:2469)
at org.apache.hadoop.conf.Configuration.set(Configuration.java:1205)
at org.apache.hadoop.conf.Configuration.set(Configuration.java:1177)
at org.apache.hadoop.yarn.server.resourcemanager.scheduler.capacity.CapacitySchedulerConfiguration.setQueues(CapacitySchedulerConfiguration.java:606)
at org.apache.hadoop.yarn.server.resourcemanager.scheduler.capacity.TestCapacityScheduler.setupQueueConfiguration(TestCapacityScheduler.java:382)
at org.apache.hadoop.yarn.server.resourcemanager.scheduler.capacity.TestCapacityScheduler.setUp(TestCapacityScheduler.java:181)
REGRESSION: org.apache.hadoop.yarn.server.resourcemanager.scheduler.capacity.TestCapacityScheduler.testKillAllAppsInQueue
Error Message:
null
Stack Trace:
java.lang.NullPointerException: null
at org.apache.hadoop.yarn.server.resourcemanager.ResourceManager.transitionToStandby(ResourceManager.java:1029)
at org.apache.hadoop.yarn.server.resourcemanager.ResourceManager.serviceStop(ResourceManager.java:1085)
at org.apache.hadoop.service.AbstractService.stop(AbstractService.java:221)
at org.apache.hadoop.yarn.server.resourcemanager.scheduler.capacity.TestCapacityScheduler.tearDown(TestCapacityScheduler.java:197)
REGRESSION: org.apache.hadoop.yarn.server.resourcemanager.scheduler.capacity.TestCapacityScheduler.testMoveAppForMoveToQueueWithFreeCap
Error Message:
java.util.zip.ZipException: invalid stored block lengths
Stack Trace:
java.lang.RuntimeException: java.util.zip.ZipException: invalid stored block lengths
at java.util.zip.InflaterInputStream.read(InflaterInputStream.java:164)
at java.util.zip.InflaterInputStream.read(InflaterInputStream.java:122)
at java.io.FilterInputStream.read(FilterInputStream.java:83)
at org.apache.xerces.impl.XMLEntityManager$RewindableInputStream.read(Unknown Source)
at org.apache.xerces.impl.XMLEntityManager.setupCurrentEntity(Unknown Source)
at org.apache.xerces.impl.XMLVersionDetector.determineDocVersion(Unknown Source)
at org.apache.xerces.parsers.XML11Configuration.parse(Unknown Source)
at org.apache.xerces.parsers.XML11Configuration.parse(Unknown Source)
at org.apache.xerces.parsers.XMLParser.parse(Unknown Source)
at org.apache.xerces.parsers.DOMParser.parse(Unknown Source)
at org.apache.xerces.jaxp.DocumentBuilderImpl.parse(Unknown Source)
at javax.xml.parsers.DocumentBuilder.parse(DocumentBuilder.java:150)
at org.apache.hadoop.conf.Configuration.parse(Configuration.java:2546)
at org.apache.hadoop.conf.Configuration.parse(Configuration.java:2534)
at org.apache.hadoop.conf.Configuration.loadResource(Configuration.java:2605)
at org.apache.hadoop.conf.Configuration.loadResources(Configuration.java:2558)
at org.apache.hadoop.conf.Configuration.getProps(Configuration.java:2469)
at org.apache.hadoop.conf.Configuration.set(Configuration.java:1205)
at org.apache.hadoop.conf.Configuration.set(Configuration.java:1177)
at org.apache.hadoop.yarn.server.resourcemanager.scheduler.capacity.CapacitySchedulerConfiguration.setQueues(CapacitySchedulerConfiguration.java:606)
at org.apache.hadoop.yarn.server.resourcemanager.scheduler.capacity.TestCapacityScheduler.setupQueueConfiguration(TestCapacityScheduler.java:382)
at org.apache.hadoop.yarn.server.resourcemanager.scheduler.capacity.TestCapacityScheduler.setUp(TestCapacityScheduler.java:181)
REGRESSION: org.apache.hadoop.yarn.server.resourcemanager.scheduler.capacity.TestCapacityScheduler.testMoveAppForMoveToQueueWithFreeCap
Error Message:
null
Stack Trace:
java.lang.NullPointerException: null
at org.apache.hadoop.yarn.server.resourcemanager.ResourceManager.transitionToStandby(ResourceManager.java:1029)
at org.apache.hadoop.yarn.server.resourcemanager.ResourceManager.serviceStop(ResourceManager.java:1085)
at org.apache.hadoop.service.AbstractService.stop(AbstractService.java:221)
at org.apache.hadoop.yarn.server.resourcemanager.scheduler.capacity.TestCapacityScheduler.tearDown(TestCapacityScheduler.java:197)
REGRESSION: org.apache.hadoop.yarn.server.resourcemanager.scheduler.capacity.TestCapacityScheduler.testAllocateReorder
Error Message:
java.util.zip.ZipException: invalid stored block lengths
Stack Trace:
java.lang.RuntimeException: java.util.zip.ZipException: invalid stored block lengths
at java.util.zip.InflaterInputStream.read(InflaterInputStream.java:164)
at java.util.zip.InflaterInputStream.read(InflaterInputStream.java:122)
at java.io.FilterInputStream.read(FilterInputStream.java:83)
at org.apache.xerces.impl.XMLEntityManager$RewindableInputStream.read(Unknown Source)
at org.apache.xerces.impl.XMLEntityManager.setupCurrentEntity(Unknown Source)
at org.apache.xerces.impl.XMLVersionDetector.determineDocVersion(Unknown Source)
at org.apache.xerces.parsers.XML11Configuration.parse(Unknown Source)
at org.apache.xerces.parsers.XML11Configuration.parse(Unknown Source)
at org.apache.xerces.parsers.XMLParser.parse(Unknown Source)
at org.apache.xerces.parsers.DOMParser.parse(Unknown Source)
at org.apache.xerces.jaxp.DocumentBuilderImpl.parse(Unknown Source)
at javax.xml.parsers.DocumentBuilder.parse(DocumentBuilder.java:150)
at org.apache.hadoop.conf.Configuration.parse(Configuration.java:2546)
at org.apache.hadoop.conf.Configuration.parse(Configuration.java:2534)
at org.apache.hadoop.conf.Configuration.loadResource(Configuration.java:2605)
at org.apache.hadoop.conf.Configuration.loadResources(Configuration.java:2558)
at org.apache.hadoop.conf.Configuration.getProps(Configuration.java:2469)
at org.apache.hadoop.conf.Configuration.set(Configuration.java:1205)
at org.apache.hadoop.conf.Configuration.set(Configuration.java:1177)
at org.apache.hadoop.yarn.server.resourcemanager.scheduler.capacity.CapacitySchedulerConfiguration.setQueues(CapacitySchedulerConfiguration.java:606)
at org.apache.hadoop.yarn.server.resourcemanager.scheduler.capacity.TestCapacityScheduler.setupQueueConfiguration(TestCapacityScheduler.java:382)
at org.apache.hadoop.yarn.server.resourcemanager.scheduler.capacity.TestCapacityScheduler.setUp(TestCapacityScheduler.java:181)
REGRESSION: org.apache.hadoop.yarn.server.resourcemanager.scheduler.capacity.TestCapacityScheduler.testAllocateReorder
Error Message:
null
Stack Trace:
java.lang.NullPointerException: null
at org.apache.hadoop.yarn.server.resourcemanager.ResourceManager.transitionToStandby(ResourceManager.java:1029)
at org.apache.hadoop.yarn.server.resourcemanager.ResourceManager.serviceStop(ResourceManager.java:1085)
at org.apache.hadoop.service.AbstractService.stop(AbstractService.java:221)
at org.apache.hadoop.yarn.server.resourcemanager.scheduler.capacity.TestCapacityScheduler.tearDown(TestCapacityScheduler.java:197)
REGRESSION: org.apache.hadoop.yarn.server.resourcemanager.scheduler.capacity.TestCapacityScheduler.testMoveAppQueueMetricsCheck
Error Message:
java.util.zip.ZipException: invalid stored block lengths
Stack Trace:
java.lang.RuntimeException: java.util.zip.ZipException: invalid stored block lengths
at java.util.zip.InflaterInputStream.read(InflaterInputStream.java:164)
at java.util.zip.InflaterInputStream.read(InflaterInputStream.java:122)
at java.io.FilterInputStream.read(FilterInputStream.java:83)
at org.apache.xerces.impl.XMLEntityManager$RewindableInputStream.read(Unknown Source)
at org.apache.xerces.impl.XMLEntityManager.setupCurrentEntity(Unknown Source)
at org.apache.xerces.impl.XMLVersionDetector.determineDocVersion(Unknown Source)
at org.apache.xerces.parsers.XML11Configuration.parse(Unknown Source)
at org.apache.xerces.parsers.XML11Configuration.parse(Unknown Source)
at org.apache.xerces.parsers.XMLParser.parse(Unknown Source)
at org.apache.xerces.parsers.DOMParser.parse(Unknown Source)
at org.apache.xerces.jaxp.DocumentBuilderImpl.parse(Unknown Source)
at javax.xml.parsers.DocumentBuilder.parse(DocumentBuilder.java:150)
at org.apache.hadoop.conf.Configuration.parse(Configuration.java:2546)
at org.apache.hadoop.conf.Configuration.parse(Configuration.java:2534)
at org.apache.hadoop.conf.Configuration.loadResource(Configuration.java:2605)
at org.apache.hadoop.conf.Configuration.loadResources(Configuration.java:2558)
at org.apache.hadoop.conf.Configuration.getProps(Configuration.java:2469)
at org.apache.hadoop.conf.Configuration.set(Configuration.java:1205)
at org.apache.hadoop.conf.Configuration.set(Configuration.java:1177)
at org.apache.hadoop.yarn.server.resourcemanager.scheduler.capacity.CapacitySchedulerConfiguration.setQueues(CapacitySchedulerConfiguration.java:606)
at org.apache.hadoop.yarn.server.resourcemanager.scheduler.capacity.TestCapacityScheduler.setupQueueConfiguration(TestCapacityScheduler.java:382)
at org.apache.hadoop.yarn.server.resourcemanager.scheduler.capacity.TestCapacityScheduler.setUp(TestCapacityScheduler.java:181)
REGRESSION: org.apache.hadoop.yarn.server.resourcemanager.scheduler.capacity.TestCapacityScheduler.testMoveAppQueueMetricsCheck
Error Message:
null
Stack Trace:
java.lang.NullPointerException: null
at org.apache.hadoop.yarn.server.resourcemanager.ResourceManager.transitionToStandby(ResourceManager.java:1029)
at org.apache.hadoop.yarn.server.resourcemanager.ResourceManager.serviceStop(ResourceManager.java:1085)
at org.apache.hadoop.service.AbstractService.stop(AbstractService.java:221)
at org.apache.hadoop.yarn.server.resourcemanager.scheduler.capacity.TestCapacityScheduler.tearDown(TestCapacityScheduler.java:197)
REGRESSION: org.apache.hadoop.yarn.server.resourcemanager.scheduler.capacity.TestCapacityScheduler.testGetAppsInQueue
Error Message:
java.util.zip.ZipException: invalid stored block lengths
Stack Trace:
java.lang.RuntimeException: java.util.zip.ZipException: invalid stored block lengths
at java.util.zip.InflaterInputStream.read(InflaterInputStream.java:164)
at java.util.zip.InflaterInputStream.read(InflaterInputStream.java:122)
at java.io.FilterInputStream.read(FilterInputStream.java:83)
at org.apache.xerces.impl.XMLEntityManager$RewindableInputStream.read(Unknown Source)
at org.apache.xerces.impl.XMLEntityManager.setupCurrentEntity(Unknown Source)
at org.apache.xerces.impl.XMLVersionDetector.determineDocVersion(Unknown Source)
at org.apache.xerces.parsers.XML11Configuration.parse(Unknown Source)
at org.apache.xerces.parsers.XML11Configuration.parse(Unknown Source)
at org.apache.xerces.parsers.XMLParser.parse(Unknown Source)
at org.apache.xerces.parsers.DOMParser.parse(Unknown Source)
at org.apache.xerces.jaxp.DocumentBuilderImpl.parse(Unknown Source)
at javax.xml.parsers.DocumentBuilder.parse(DocumentBuilder.java:150)
at org.apache.hadoop.conf.Configuration.parse(Configuration.java:2546)
at org.apache.hadoop.conf.Configuration.parse(Configuration.java:2534)
at org.apache.hadoop.conf.Configuration.loadResource(Configuration.java:2605)
at org.apache.hadoop.conf.Configuration.loadResources(Configuration.java:2558)
at org.apache.hadoop.conf.Configuration.getProps(Configuration.java:2469)
at org.apache.hadoop.conf.Configuration.set(Configuration.java:1205)
at org.apache.hadoop.conf.Configuration.set(Configuration.java:1177)
at org.apache.hadoop.yarn.server.resourcemanager.scheduler.capacity.CapacitySchedulerConfiguration.setQueues(CapacitySchedulerConfiguration.java:606)
at org.apache.hadoop.yarn.server.resourcemanager.scheduler.capacity.TestCapacityScheduler.setupQueueConfiguration(TestCapacityScheduler.java:382)
at org.apache.hadoop.yarn.server.resourcemanager.scheduler.capacity.TestCapacityScheduler.setUp(TestCapacityScheduler.java:181)
REGRESSION: org.apache.hadoop.yarn.server.resourcemanager.scheduler.capacity.TestCapacityScheduler.testGetAppsInQueue
Error Message:
null
Stack Trace:
java.lang.NullPointerException: null
at org.apache.hadoop.yarn.server.resourcemanager.ResourceManager.transitionToStandby(ResourceManager.java:1029)
at org.apache.hadoop.yarn.server.resourcemanager.ResourceManager.serviceStop(ResourceManager.java:1085)
at org.apache.hadoop.service.AbstractService.stop(AbstractService.java:221)
at org.apache.hadoop.yarn.server.resourcemanager.scheduler.capacity.TestCapacityScheduler.tearDown(TestCapacityScheduler.java:197)
REGRESSION: org.apache.hadoop.yarn.server.resourcemanager.scheduler.capacity.TestCapacityScheduler.testMoveAppSameParent
Error Message:
java.util.zip.ZipException: invalid stored block lengths
Stack Trace:
java.lang.RuntimeException: java.util.zip.ZipException: invalid stored block lengths
at java.util.zip.InflaterInputStream.read(InflaterInputStream.java:164)
at java.util.zip.InflaterInputStream.read(InflaterInputStream.java:122)
at java.io.FilterInputStream.read(FilterInputStream.java:83)
at org.apache.xerces.impl.XMLEntityManager$RewindableInputStream.read(Unknown Source)
at org.apache.xerces.impl.XMLEntityManager.setupCurrentEntity(Unknown Source)
at org.apache.xerces.impl.XMLVersionDetector.determineDocVersion(Unknown Source)
at org.apache.xerces.parsers.XML11Configuration.parse(Unknown Source)
at org.apache.xerces.parsers.XML11Configuration.parse(Unknown Source)
at org.apache.xerces.parsers.XMLParser.parse(Unknown Source)
at org.apache.xerces.parsers.DOMParser.parse(Unknown Source)
at org.apache.xerces.jaxp.DocumentBuilderImpl.parse(Unknown Source)
at javax.xml.parsers.DocumentBuilder.parse(DocumentBuilder.java:150)
at org.apache.hadoop.conf.Configuration.parse(Configuration.java:2546)
at org.apache.hadoop.conf.Configuration.parse(Configuration.java:2534)
at org.apache.hadoop.conf.Configuration.loadResource(Configuration.java:2605)
at org.apache.hadoop.conf.Configuration.loadResources(Configuration.java:2558)
at org.apache.hadoop.conf.Configuration.getProps(Configuration.java:2469)
at org.apache.hadoop.conf.Configuration.set(Configuration.java:1205)
at org.apache.hadoop.conf.Configuration.set(Configuration.java:1177)
at org.apache.hadoop.yarn.server.resourcemanager.scheduler.capacity.CapacitySchedulerConfiguration.setQueues(CapacitySchedulerConfiguration.java:606)
at org.apache.hadoop.yarn.server.resourcemanager.scheduler.capacity.TestCapacityScheduler.setupQueueConfiguration(TestCapacityScheduler.java:382)
at org.apache.hadoop.yarn.server.resourcemanager.scheduler.capacity.TestCapacityScheduler.setUp(TestCapacityScheduler.java:181)
REGRESSION: org.apache.hadoop.yarn.server.resourcemanager.scheduler.capacity.TestCapacityScheduler.testMoveAppSameParent
Error Message:
null
Stack Trace:
java.lang.NullPointerException: null
at org.apache.hadoop.yarn.server.resourcemanager.ResourceManager.transitionToStandby(ResourceManager.java:1029)
at org.apache.hadoop.yarn.server.resourcemanager.ResourceManager.serviceStop(ResourceManager.java:1085)
at org.apache.hadoop.service.AbstractService.stop(AbstractService.java:221)
at org.apache.hadoop.yarn.server.resourcemanager.scheduler.capacity.TestCapacityScheduler.tearDown(TestCapacityScheduler.java:197)
REGRESSION: org.apache.hadoop.yarn.server.resourcemanager.scheduler.capacity.TestCapacityScheduler.testHierarchyQueuesCurrentLimits
Error Message:
java.util.zip.ZipException: invalid stored block lengths
Stack Trace:
java.lang.RuntimeException: java.util.zip.ZipException: invalid stored block lengths
at java.util.zip.InflaterInputStream.read(InflaterInputStream.java:164)
at java.util.zip.InflaterInputStream.read(InflaterInputStream.java:122)
at java.io.FilterInputStream.read(FilterInputStream.java:83)
at org.apache.xerces.impl.XMLEntityManager$RewindableInputStream.read(Unknown Source)
at org.apache.xerces.impl.XMLEntityManager.setupCurrentEntity(Unknown Source)
at org.apache.xerces.impl.XMLVersionDetector.determineDocVersion(Unknown Source)
at org.apache.xerces.parsers.XML11Configuration.parse(Unknown Source)
at org.apache.xerces.parsers.XML11Configuration.parse(Unknown Source)
at org.apache.xerces.parsers.XMLParser.parse(Unknown Source)
at org.apache.xerces.parsers.DOMParser.parse(Unknown Source)
at org.apache.xerces.jaxp.DocumentBuilderImpl.parse(Unknown Source)
at javax.xml.parsers.DocumentBuilder.parse(DocumentBuilder.java:150)
at org.apache.hadoop.conf.Configuration.parse(Configuration.java:2546)
at org.apache.hadoop.conf.Configuration.parse(Configuration.java:2534)
at org.apache.hadoop.conf.Configuration.loadResource(Configuration.java:2605)
at org.apache.hadoop.conf.Configuration.loadResources(Configuration.java:2558)
at org.apache.hadoop.conf.Configuration.getProps(Configuration.java:2469)
at org.apache.hadoop.conf.Configuration.set(Configuration.java:1205)
at org.apache.hadoop.conf.Configuration.set(Configuration.java:1177)
at org.apache.hadoop.yarn.server.resourcemanager.scheduler.capacity.CapacitySchedulerConfiguration.setQueues(CapacitySchedulerConfiguration.java:606)
at org.apache.hadoop.yarn.server.resourcemanager.scheduler.capacity.TestCapacityScheduler.setupQueueConfiguration(TestCapacityScheduler.java:382)
at org.apache.hadoop.yarn.server.resourcemanager.scheduler.capacity.TestCapacityScheduler.setUp(TestCapacityScheduler.java:181)
REGRESSION: org.apache.hadoop.yarn.server.resourcemanager.scheduler.capacity.TestCapacityScheduler.testHierarchyQueuesCurrentLimits
Error Message:
null
Stack Trace:
java.lang.NullPointerException: null
at org.apache.hadoop.yarn.server.resourcemanager.ResourceManager.transitionToStandby(ResourceManager.java:1029)
at org.apache.hadoop.yarn.server.resourcemanager.ResourceManager.serviceStop(ResourceManager.java:1085)
at org.apache.hadoop.service.AbstractService.stop(AbstractService.java:221)
at org.apache.hadoop.yarn.server.resourcemanager.scheduler.capacity.TestCapacityScheduler.tearDown(TestCapacityScheduler.java:197)
REGRESSION: org.apache.hadoop.yarn.server.resourcemanager.scheduler.capacity.TestCapacityScheduler.testAsyncScheduling
Error Message:
java.util.zip.ZipException: invalid stored block lengths
Stack Trace:
java.lang.RuntimeException: java.util.zip.ZipException: invalid stored block lengths
at java.util.zip.InflaterInputStream.read(InflaterInputStream.java:164)
at java.util.zip.InflaterInputStream.read(InflaterInputStream.java:122)
at java.io.FilterInputStream.read(FilterInputStream.java:83)
at org.apache.xerces.impl.XMLEntityManager$RewindableInputStream.read(Unknown Source)
at org.apache.xerces.impl.XMLEntityManager.setupCurrentEntity(Unknown Source)
at org.apache.xerces.impl.XMLVersionDetector.determineDocVersion(Unknown Source)
at org.apache.xerces.parsers.XML11Configuration.parse(Unknown Source)
at org.apache.xerces.parsers.XML11Configuration.parse(Unknown Source)
at org.apache.xerces.parsers.XMLParser.parse(Unknown Source)
at org.apache.xerces.parsers.DOMParser.parse(Unknown Source)
at org.apache.xerces.jaxp.DocumentBuilderImpl.parse(Unknown Source)
at javax.xml.parsers.DocumentBuilder.parse(DocumentBuilder.java:150)
at org.apache.hadoop.conf.Configuration.parse(Configuration.java:2546)
at org.apache.hadoop.conf.Configuration.parse(Configuration.java:2534)
at org.apache.hadoop.conf.Configuration.loadResource(Configuration.java:2605)
at org.apache.hadoop.conf.Configuration.loadResources(Configuration.java:2558)
at org.apache.hadoop.conf.Configuration.getProps(Configuration.java:2469)
at org.apache.hadoop.conf.Configuration.set(Configuration.java:1205)
at org.apache.hadoop.conf.Configuration.set(Configuration.java:1177)
at org.apache.hadoop.yarn.server.resourcemanager.scheduler.capacity.CapacitySchedulerConfiguration.setQueues(CapacitySchedulerConfiguration.java:606)
at org.apache.hadoop.yarn.server.resourcemanager.scheduler.capacity.TestCapacityScheduler.setupQueueConfiguration(TestCapacityScheduler.java:382)
at org.apache.hadoop.yarn.server.resourcemanager.scheduler.capacity.TestCapacityScheduler.setUp(TestCapacityScheduler.java:181)
REGRESSION: org.apache.hadoop.yarn.server.resourcemanager.scheduler.capacity.TestCapacityScheduler.testAsyncScheduling
Error Message:
null
Stack Trace:
java.lang.NullPointerException: null
at org.apache.hadoop.yarn.server.resourcemanager.ResourceManager.transitionToStandby(ResourceManager.java:1029)
at org.apache.hadoop.yarn.server.resourcemanager.ResourceManager.serviceStop(ResourceManager.java:1085)
at org.apache.hadoop.service.AbstractService.stop(AbstractService.java:221)
at org.apache.hadoop.yarn.server.resourcemanager.scheduler.capacity.TestCapacityScheduler.tearDown(TestCapacityScheduler.java:197)
REGRESSION: org.apache.hadoop.yarn.server.resourcemanager.scheduler.capacity.TestCapacityScheduler.testQueueHierarchyPendingResourceUpdate
Error Message:
java.util.zip.ZipException: invalid stored block lengths
Stack Trace:
java.lang.RuntimeException: java.util.zip.ZipException: invalid stored block lengths
at java.util.zip.InflaterInputStream.read(InflaterInputStream.java:164)
at java.util.zip.InflaterInputStream.read(InflaterInputStream.java:122)
at java.io.FilterInputStream.read(FilterInputStream.java:83)
at org.apache.xerces.impl.XMLEntityManager$RewindableInputStream.read(Unknown Source)
at org.apache.xerces.impl.XMLEntityManager.setupCurrentEntity(Unknown Source)
at org.apache.xerces.impl.XMLVersionDetector.determineDocVersion(Unknown Source)
at org.apache.xerces.parsers.XML11Configuration.parse(Unknown Source)
at org.apache.xerces.parsers.XML11Configuration.parse(Unknown Source)
at org.apache.xerces.parsers.XMLParser.parse(Unknown Source)
at org.apache.xerces.parsers.DOMParser.parse(Unknown Source)
at org.apache.xerces.jaxp.DocumentBuilderImpl.parse(Unknown Source)
at javax.xml.parsers.DocumentBuilder.parse(DocumentBuilder.java:150)
at org.apache.hadoop.conf.Configuration.parse(Configuration.java:2546)
at org.apache.hadoop.conf.Configuration.parse(Configuration.java:2534)
at org.apache.hadoop.conf.Configuration.loadResource(Configuration.java:2605)
at org.apache.hadoop.conf.Configuration.loadResources(Configuration.java:2558)
at org.apache.hadoop.conf.Configuration.getProps(Configuration.java:2469)
at org.apache.hadoop.conf.Configuration.set(Configuration.java:1205)
at org.apache.hadoop.conf.Configuration.set(Configuration.java:1177)
at org.apache.hadoop.yarn.server.resourcemanager.scheduler.capacity.CapacitySchedulerConfiguration.setQueues(CapacitySchedulerConfiguration.java:606)
at org.apache.hadoop.yarn.server.resourcemanager.scheduler.capacity.TestCapacityScheduler.setupQueueConfiguration(TestCapacityScheduler.java:382)
at org.apache.hadoop.yarn.server.resourcemanager.scheduler.capacity.TestCapacityScheduler.setUp(TestCapacityScheduler.java:181)
REGRESSION: org.apache.hadoop.yarn.server.resourcemanager.scheduler.capacity.TestCapacityScheduler.testQueueHierarchyPendingResourceUpdate
Error Message:
null
Stack Trace:
java.lang.NullPointerException: null
at org.apache.hadoop.yarn.server.resourcemanager.ResourceManager.transitionToStandby(ResourceManager.java:1029)
at org.apache.hadoop.yarn.server.resourcemanager.ResourceManager.serviceStop(ResourceManager.java:1085)
at org.apache.hadoop.service.AbstractService.stop(AbstractService.java:221)
at org.apache.hadoop.yarn.server.resourcemanager.scheduler.capacity.TestCapacityScheduler.tearDown(TestCapacityScheduler.java:197)
REGRESSION: org.apache.hadoop.yarn.server.resourcemanager.scheduler.capacity.TestCapacityScheduler.testRefreshQueuesWithNewQueue
Error Message:
java.util.zip.ZipException: invalid stored block lengths
Stack Trace:
java.lang.RuntimeException: java.util.zip.ZipException: invalid stored block lengths
at java.util.zip.InflaterInputStream.read(InflaterInputStream.java:164)
at java.util.zip.InflaterInputStream.read(InflaterInputStream.java:122)
at java.io.FilterInputStream.read(FilterInputStream.java:83)
at org.apache.xerces.impl.XMLEntityManager$RewindableInputStream.read(Unknown Source)
at org.apache.xerces.impl.XMLEntityManager.setupCurrentEntity(Unknown Source)
at org.apache.xerces.impl.XMLVersionDetector.determineDocVersion(Unknown Source)
at org.apache.xerces.parsers.XML11Configuration.parse(Unknown Source)
at org.apache.xerces.parsers.XML11Configuration.parse(Unknown Source)
at org.apache.xerces.parsers.XMLParser.parse(Unknown Source)
at org.apache.xerces.parsers.DOMParser.parse(Unknown Source)
at org.apache.xerces.jaxp.DocumentBuilderImpl.parse(Unknown Source)
at javax.xml.parsers.DocumentBuilder.parse(DocumentBuilder.java:150)
at org.apache.hadoop.conf.Configuration.parse(Configuration.java:2546)
at org.apache.hadoop.conf.Configuration.parse(Configuration.java:2534)
at org.apache.hadoop.conf.Configuration.loadResource(Configuration.java:2605)
at org.apache.hadoop.conf.Configuration.loadResources(Configuration.java:2558)
at org.apache.hadoop.conf.Configuration.getProps(Configuration.java:2469)
at org.apache.hadoop.conf.Configuration.set(Configuration.java:1205)
at org.apache.hadoop.conf.Configuration.set(Configuration.java:1177)
at org.apache.hadoop.yarn.server.resourcemanager.scheduler.capacity.CapacitySchedulerConfiguration.setQueues(CapacitySchedulerConfiguration.java:606)
at org.apache.hadoop.yarn.server.resourcemanager.scheduler.capacity.TestCapacityScheduler.setupQueueConfiguration(TestCapacityScheduler.java:382)
at org.apache.hadoop.yarn.server.resourcemanager.scheduler.capacity.TestCapacityScheduler.setUp(TestCapacityScheduler.java:181)
REGRESSION: org.apache.hadoop.yarn.server.resourcemanager.scheduler.capacity.TestCapacityScheduler.testRefreshQueuesWithNewQueue
Error Message:
null
Stack Trace:
java.lang.NullPointerException: null
at org.apache.hadoop.yarn.server.resourcemanager.ResourceManager.transitionToStandby(ResourceManager.java:1029)
at org.apache.hadoop.yarn.server.resourcemanager.ResourceManager.serviceStop(ResourceManager.java:1085)
at org.apache.hadoop.service.AbstractService.stop(AbstractService.java:221)
at org.apache.hadoop.yarn.server.resourcemanager.scheduler.capacity.TestCapacityScheduler.tearDown(TestCapacityScheduler.java:197)
REGRESSION: org.apache.hadoop.yarn.server.resourcemanager.scheduler.capacity.TestCapacityScheduler.testMoveAppBasic
Error Message:
java.util.zip.ZipException: invalid stored block lengths
Stack Trace:
java.lang.RuntimeException: java.util.zip.ZipException: invalid stored block lengths
at java.util.zip.InflaterInputStream.read(InflaterInputStream.java:164)
at java.util.zip.InflaterInputStream.read(InflaterInputStream.java:122)
at java.io.FilterInputStream.read(FilterInputStream.java:83)
at org.apache.xerces.impl.XMLEntityManager$RewindableInputStream.read(Unknown Source)
at org.apache.xerces.impl.XMLEntityManager.setupCurrentEntity(Unknown Source)
at org.apache.xerces.impl.XMLVersionDetector.determineDocVersion(Unknown Source)
at org.apache.xerces.parsers.XML11Configuration.parse(Unknown Source)
at org.apache.xerces.parsers.XML11Configuration.parse(Unknown Source)
at org.apache.xerces.parsers.XMLParser.parse(Unknown Source)
at org.apache.xerces.parsers.DOMParser.parse(Unknown Source)
at org.apache.xerces.jaxp.DocumentBuilderImpl.parse(Unknown Source)
at javax.xml.parsers.DocumentBuilder.parse(DocumentBuilder.java:150)
at org.apache.hadoop.conf.Configuration.parse(Configuration.java:2546)
at org.apache.hadoop.conf.Configuration.parse(Configuration.java:2534)
at org.apache.hadoop.conf.Configuration.loadResource(Configuration.java:2605)
at org.apache.hadoop.conf.Configuration.loadResources(Configuration.java:2558)
at org.apache.hadoop.conf.Configuration.getProps(Configuration.java:2469)
at org.apache.hadoop.conf.Configuration.set(Configuration.java:1205)
at org.apache.hadoop.conf.Configuration.set(Configuration.java:1177)
at org.apache.hadoop.yarn.server.resourcemanager.scheduler.capacity.CapacitySchedulerConfiguration.setQueues(CapacitySchedulerConfiguration.java:606)
at org.apache.hadoop.yarn.server.resourcemanager.scheduler.capacity.TestCapacityScheduler.setupQueueConfiguration(TestCapacityScheduler.java:382)
at org.apache.hadoop.yarn.server.resourcemanager.scheduler.capacity.TestCapacityScheduler.setUp(TestCapacityScheduler.java:181)
REGRESSION: org.apache.hadoop.yarn.server.resourcemanager.scheduler.capacity.TestCapacityScheduler.testMoveAppBasic
Error Message:
null
Stack Trace:
java.lang.NullPointerException: null
at org.apache.hadoop.yarn.server.resourcemanager.ResourceManager.transitionToStandby(ResourceManager.java:1029)
at org.apache.hadoop.yarn.server.resourcemanager.ResourceManager.serviceStop(ResourceManager.java:1085)
at org.apache.hadoop.service.AbstractService.stop(AbstractService.java:221)
at org.apache.hadoop.yarn.server.resourcemanager.scheduler.capacity.TestCapacityScheduler.tearDown(TestCapacityScheduler.java:197)
REGRESSION: org.apache.hadoop.yarn.server.resourcemanager.scheduler.capacity.TestCapacityScheduler.testRefreshQueuesMaxAllocationRefreshLarger
Error Message:
java.util.zip.ZipException: invalid stored block lengths
Stack Trace:
java.lang.RuntimeException: java.util.zip.ZipException: invalid stored block lengths
at java.util.zip.InflaterInputStream.read(InflaterInputStream.java:164)
at java.util.zip.InflaterInputStream.read(InflaterInputStream.java:122)
at java.io.FilterInputStream.read(FilterInputStream.java:83)
at org.apache.xerces.impl.XMLEntityManager$RewindableInputStream.read(Unknown Source)
at org.apache.xerces.impl.XMLEntityManager.setupCurrentEntity(Unknown Source)
at org.apache.xerces.impl.XMLVersionDetector.determineDocVersion(Unknown Source)
at org.apache.xerces.parsers.XML11Configuration.parse(Unknown Source)
at org.apache.xerces.parsers.XML11Configuration.parse(Unknown Source)
at org.apache.xerces.parsers.XMLParser.parse(Unknown Source)
at org.apache.xerces.parsers.DOMParser.parse(Unknown Source)
at org.apache.xerces.jaxp.DocumentBuilderImpl.parse(Unknown Source)
at javax.xml.parsers.DocumentBuilder.parse(DocumentBuilder.java:150)
at org.apache.hadoop.conf.Configuration.parse(Configuration.java:2546)
at org.apache.hadoop.conf.Configuration.parse(Configuration.java:2534)
at org.apache.hadoop.conf.Configuration.loadResource(Configuration.java:2605)
at org.apache.hadoop.conf.Configuration.loadResources(Configuration.java:2558)
at org.apache.hadoop.conf.Configuration.getProps(Configuration.java:2469)
at org.apache.hadoop.conf.Configuration.set(Configuration.java:1205)
at org.apache.hadoop.conf.Configuration.set(Configuration.java:1177)
at org.apache.hadoop.yarn.server.resourcemanager.scheduler.capacity.CapacitySchedulerConfiguration.setQueues(CapacitySchedulerConfiguration.java:606)
at org.apache.hadoop.yarn.server.resourcemanager.scheduler.capacity.TestCapacityScheduler.setupQueueConfiguration(TestCapacityScheduler.java:382)
at org.apache.hadoop.yarn.server.resourcemanager.scheduler.capacity.TestCapacityScheduler.setUp(TestCapacityScheduler.java:181)
REGRESSION: org.apache.hadoop.yarn.server.resourcemanager.scheduler.capacity.TestCapacityScheduler.testRefreshQueuesMaxAllocationRefreshLarger
Error Message:
null
Stack Trace:
java.lang.NullPointerException: null
at org.apache.hadoop.yarn.server.resourcemanager.ResourceManager.transitionToStandby(ResourceManager.java:1029)
at org.apache.hadoop.yarn.server.resourcemanager.ResourceManager.serviceStop(ResourceManager.java:1085)
at org.apache.hadoop.service.AbstractService.stop(AbstractService.java:221)
at org.apache.hadoop.yarn.server.resourcemanager.scheduler.capacity.TestCapacityScheduler.tearDown(TestCapacityScheduler.java:197)
REGRESSION: org.apache.hadoop.yarn.server.resourcemanager.scheduler.capacity.TestCapacityScheduler.testMaximumCapacitySetup
Error Message:
java.util.zip.ZipException: invalid stored block lengths
Stack Trace:
java.lang.RuntimeException: java.util.zip.ZipException: invalid stored block lengths
at java.util.zip.InflaterInputStream.read(InflaterInputStream.java:164)
at java.util.zip.InflaterInputStream.read(InflaterInputStream.java:122)
at java.io.FilterInputStream.read(FilterInputStream.java:83)
at org.apache.xerces.impl.XMLEntityManager$RewindableInputStream.read(Unknown Source)
at org.apache.xerces.impl.XMLEntityManager.setupCurrentEntity(Unknown Source)
at org.apache.xerces.impl.XMLVersionDetector.determineDocVersion(Unknown Source)
at org.apache.xerces.parsers.XML11Configuration.parse(Unknown Source)
at org.apache.xerces.parsers.XML11Configuration.parse(Unknown Source)
at org.apache.xerces.parsers.XMLParser.parse(Unknown Source)
at org.apache.xerces.parsers.DOMParser.parse(Unknown Source)
at org.apache.xerces.jaxp.DocumentBuilderImpl.parse(Unknown Source)
at javax.xml.parsers.DocumentBuilder.parse(DocumentBuilder.java:150)
at org.apache.hadoop.conf.Configuration.parse(Configuration.java:2546)
at org.apache.hadoop.conf.Configuration.parse(Configuration.java:2534)
at org.apache.hadoop.conf.Configuration.loadResource(Configuration.java:2605)
at org.apache.hadoop.conf.Configuration.loadResources(Configuration.java:2558)
at org.apache.hadoop.conf.Configuration.getProps(Configuration.java:2469)
at org.apache.hadoop.conf.Configuration.set(Configuration.java:1205)
at org.apache.hadoop.conf.Configuration.set(Configuration.java:1177)
at org.apache.hadoop.yarn.server.resourcemanager.scheduler.capacity.CapacitySchedulerConfiguration.setQueues(CapacitySchedulerConfiguration.java:606)
at org.apache.hadoop.yarn.server.resourcemanager.scheduler.capacity.TestCapacityScheduler.setupQueueConfiguration(TestCapacityScheduler.java:382)
at org.apache.hadoop.yarn.server.resourcemanager.scheduler.capacity.TestCapacityScheduler.setUp(TestCapacityScheduler.java:181)
REGRESSION: org.apache.hadoop.yarn.server.resourcemanager.scheduler.capacity.TestCapacityScheduler.testMaximumCapacitySetup
Error Message:
null
Stack Trace:
java.lang.NullPointerException: null
at org.apache.hadoop.yarn.server.resourcemanager.ResourceManager.transitionToStandby(ResourceManager.java:1029)
at org.apache.hadoop.yarn.server.resourcemanager.ResourceManager.serviceStop(ResourceManager.java:1085)
at org.apache.hadoop.service.AbstractService.stop(AbstractService.java:221)
at org.apache.hadoop.yarn.server.resourcemanager.scheduler.capacity.TestCapacityScheduler.tearDown(TestCapacityScheduler.java:197)
REGRESSION: org.apache.hadoop.yarn.server.resourcemanager.scheduler.capacity.TestCapacityScheduler.testApplicationHeadRoom
Error Message:
java.util.zip.ZipException: invalid stored block lengths
Stack Trace:
java.lang.RuntimeException: java.util.zip.ZipException: invalid stored block lengths
at java.util.zip.InflaterInputStream.read(InflaterInputStream.java:164)
at java.util.zip.InflaterInputStream.read(InflaterInputStream.java:122)
at java.io.FilterInputStream.read(FilterInputStream.java:83)
at org.apache.xerces.impl.XMLEntityManager$RewindableInputStream.read(Unknown Source)
at org.apache.xerces.impl.XMLEntityManager.setupCurrentEntity(Unknown Source)
at org.apache.xerces.impl.XMLVersionDetector.determineDocVersion(Unknown Source)
at org.apache.xerces.parsers.XML11Configuration.parse(Unknown Source)
at org.apache.xerces.parsers.XML11Configuration.parse(Unknown Source)
at org.apache.xerces.parsers.XMLParser.parse(Unknown Source)
at org.apache.xerces.parsers.DOMParser.parse(Unknown Source)
at org.apache.xerces.jaxp.DocumentBuilderImpl.parse(Unknown Source)
at javax.xml.parsers.DocumentBuilder.parse(DocumentBuilder.java:150)
at org.apache.hadoop.conf.Configuration.parse(Configuration.java:2546)
at org.apache.hadoop.conf.Configuration.parse(Configuration.java:2534)
at org.apache.hadoop.conf.Configuration.loadResource(Configuration.java:2605)
at org.apache.hadoop.conf.Configuration.loadResources(Configuration.java:2558)
at org.apache.hadoop.conf.Configuration.getProps(Configuration.java:2469)
at org.apache.hadoop.conf.Configuration.set(Configuration.java:1205)
at org.apache.hadoop.conf.Configuration.set(Configuration.java:1177)
at org.apache.hadoop.yarn.server.resourcemanager.scheduler.capacity.CapacitySchedulerConfiguration.setQueues(CapacitySchedulerConfiguration.java:606)
at org.apache.hadoop.yarn.server.resourcemanager.scheduler.capacity.TestCapacityScheduler.setupQueueConfiguration(TestCapacityScheduler.java:382)
at org.apache.hadoop.yarn.server.resourcemanager.scheduler.capacity.TestCapacityScheduler.setUp(TestCapacityScheduler.java:181)
REGRESSION: org.apache.hadoop.yarn.server.resourcemanager.scheduler.capacity.TestCapacityScheduler.testApplicationHeadRoom
Error Message:
null
Stack Trace:
java.lang.NullPointerException: null
at org.apache.hadoop.yarn.server.resourcemanager.ResourceManager.transitionToStandby(ResourceManager.java:1029)
at org.apache.hadoop.yarn.server.resourcemanager.ResourceManager.serviceStop(ResourceManager.java:1085)
at org.apache.hadoop.service.AbstractService.stop(AbstractService.java:221)
at org.apache.hadoop.yarn.server.resourcemanager.scheduler.capacity.TestCapacityScheduler.tearDown(TestCapacityScheduler.java:197)
REGRESSION: org.apache.hadoop.yarn.server.resourcemanager.scheduler.fair.TestFairScheduler.testLowestCommonAncestorRootParent
Error Message:
org/apache/hadoop/yarn/server/applicationhistoryservice/ApplicationHistoryWriter
Stack Trace:
java.lang.NoClassDefFoundError: org/apache/hadoop/yarn/server/applicationhistoryservice/ApplicationHistoryWriter
at java.net.URLClassLoader$1.run(URLClassLoader.java:366)
at java.net.URLClassLoader$1.run(URLClassLoader.java:355)
at java.security.AccessController.doPrivileged(Native Method)
at java.net.URLClassLoader.findClass(URLClassLoader.java:354)
at java.lang.ClassLoader.loadClass(ClassLoader.java:425)
at sun.misc.Launcher$AppClassLoader.loadClass(Launcher.java:308)
at java.lang.ClassLoader.loadClass(ClassLoader.java:358)
at org.apache.hadoop.yarn.server.resourcemanager.ResourceManager.createRMApplicationHistoryWriter(ResourceManager.java:364)
at org.apache.hadoop.yarn.server.resourcemanager.ResourceManager.serviceInit(ResourceManager.java:262)
at org.apache.hadoop.service.AbstractService.init(AbstractService.java:163)
at org.apache.hadoop.yarn.server.resourcemanager.MockRM.<init>(MockRM.java:120)
at org.apache.hadoop.yarn.server.resourcemanager.MockRM.<init>(MockRM.java:113)
at org.apache.hadoop.yarn.server.resourcemanager.MockRM.<init>(MockRM.java:109)
at org.apache.hadoop.yarn.server.resourcemanager.scheduler.fair.TestFairScheduler.setUp(TestFairScheduler.java:122)
REGRESSION: org.apache.hadoop.yarn.server.resourcemanager.scheduler.fair.TestFairScheduler.testSimpleFairShareCalculation
Error Message:
org/apache/hadoop/yarn/server/applicationhistoryservice/ApplicationHistoryWriter
Stack Trace:
java.lang.NoClassDefFoundError: org/apache/hadoop/yarn/server/applicationhistoryservice/ApplicationHistoryWriter
at java.net.URLClassLoader$1.run(URLClassLoader.java:366)
at java.net.URLClassLoader$1.run(URLClassLoader.java:355)
at java.security.AccessController.doPrivileged(Native Method)
at java.net.URLClassLoader.findClass(URLClassLoader.java:354)
at java.lang.ClassLoader.loadClass(ClassLoader.java:425)
at sun.misc.Launcher$AppClassLoader.loadClass(Launcher.java:308)
at java.lang.ClassLoader.loadClass(ClassLoader.java:358)
at org.apache.hadoop.yarn.server.resourcemanager.ResourceManager.createRMApplicationHistoryWriter(ResourceManager.java:364)
at org.apache.hadoop.yarn.server.resourcemanager.ResourceManager.serviceInit(ResourceManager.java:262)
at org.apache.hadoop.service.AbstractService.init(AbstractService.java:163)
at org.apache.hadoop.yarn.server.resourcemanager.MockRM.<init>(MockRM.java:120)
at org.apache.hadoop.yarn.server.resourcemanager.MockRM.<init>(MockRM.java:113)
at org.apache.hadoop.yarn.server.resourcemanager.MockRM.<init>(MockRM.java:109)
at org.apache.hadoop.yarn.server.resourcemanager.scheduler.fair.TestFairScheduler.setUp(TestFairScheduler.java:122)
REGRESSION: org.apache.hadoop.yarn.server.resourcemanager.scheduler.fair.TestFairScheduler.testDefaultRuleInitializesProperlyWhenPolicyNotConfigured
Error Message:
org/apache/hadoop/yarn/server/applicationhistoryservice/ApplicationHistoryWriter
Stack Trace:
java.lang.NoClassDefFoundError: org/apache/hadoop/yarn/server/applicationhistoryservice/ApplicationHistoryWriter
at java.net.URLClassLoader$1.run(URLClassLoader.java:366)
at java.net.URLClassLoader$1.run(URLClassLoader.java:355)
at java.security.AccessController.doPrivileged(Native Method)
at java.net.URLClassLoader.findClass(URLClassLoader.java:354)
at java.lang.ClassLoader.loadClass(ClassLoader.java:425)
at sun.misc.Launcher$AppClassLoader.loadClass(Launcher.java:308)
at java.lang.ClassLoader.loadClass(ClassLoader.java:358)
at org.apache.hadoop.yarn.server.resourcemanager.ResourceManager.createRMApplicationHistoryWriter(ResourceManager.java:364)
at org.apache.hadoop.yarn.server.resourcemanager.ResourceManager.serviceInit(ResourceManager.java:262)
at org.apache.hadoop.service.AbstractService.init(AbstractService.java:163)
at org.apache.hadoop.yarn.server.resourcemanager.MockRM.<init>(MockRM.java:120)
at org.apache.hadoop.yarn.server.resourcemanager.MockRM.<init>(MockRM.java:113)
at org.apache.hadoop.yarn.server.resourcemanager.MockRM.<init>(MockRM.java:109)
at org.apache.hadoop.yarn.server.resourcemanager.scheduler.fair.TestFairScheduler.setUp(TestFairScheduler.java:122)
REGRESSION: org.apache.hadoop.yarn.server.resourcemanager.scheduler.fair.TestFairScheduler.testSteadyFairShareWithReloadAndNodeAddRemove
Error Message:
org/apache/hadoop/yarn/server/applicationhistoryservice/ApplicationHistoryWriter
Stack Trace:
java.lang.NoClassDefFoundError: org/apache/hadoop/yarn/server/applicationhistoryservice/ApplicationHistoryWriter
at java.net.URLClassLoader$1.run(URLClassLoader.java:366)
at java.net.URLClassLoader$1.run(URLClassLoader.java:355)
at java.security.AccessController.doPrivileged(Native Method)
at java.net.URLClassLoader.findClass(URLClassLoader.java:354)
at java.lang.ClassLoader.loadClass(ClassLoader.java:425)
at sun.misc.Launcher$AppClassLoader.loadClass(Launcher.java:308)
at java.lang.ClassLoader.loadClass(ClassLoader.java:358)
at org.apache.hadoop.yarn.server.resourcemanager.ResourceManager.createRMApplicationHistoryWriter(ResourceManager.java:364)
at org.apache.hadoop.yarn.server.resourcemanager.ResourceManager.serviceInit(ResourceManager.java:262)
at org.apache.hadoop.service.AbstractService.init(AbstractService.java:163)
at org.apache.hadoop.yarn.server.resourcemanager.MockRM.<init>(MockRM.java:120)
at org.apache.hadoop.yarn.server.resourcemanager.MockRM.<init>(MockRM.java:113)
at org.apache.hadoop.yarn.server.resourcemanager.MockRM.<init>(MockRM.java:109)
at org.apache.hadoop.yarn.server.resourcemanager.scheduler.fair.TestFairScheduler.setUp(TestFairScheduler.java:122)
REGRESSION: org.apache.hadoop.yarn.server.resourcemanager.scheduler.fair.TestFairScheduler.testEmptyQueueNameInConfigFile
Error Message:
org/apache/hadoop/yarn/server/applicationhistoryservice/ApplicationHistoryWriter
Stack Trace:
java.lang.NoClassDefFoundError: org/apache/hadoop/yarn/server/applicationhistoryservice/ApplicationHistoryWriter
at java.net.URLClassLoader$1.run(URLClassLoader.java:366)
at java.net.URLClassLoader$1.run(URLClassLoader.java:355)
at java.security.AccessController.doPrivileged(Native Method)
at java.net.URLClassLoader.findClass(URLClassLoader.java:354)
at java.lang.ClassLoader.loadClass(ClassLoader.java:425)
at sun.misc.Launcher$AppClassLoader.loadClass(Launcher.java:308)
at java.lang.ClassLoader.loadClass(ClassLoader.java:358)
at org.apache.hadoop.yarn.server.resourcemanager.ResourceManager.createRMApplicationHistoryWriter(ResourceManager.java:364)
at org.apache.hadoop.yarn.server.resourcemanager.ResourceManager.serviceInit(ResourceManager.java:262)
at org.apache.hadoop.service.AbstractService.init(AbstractService.java:163)
at org.apache.hadoop.yarn.server.resourcemanager.MockRM.<init>(MockRM.java:120)
at org.apache.hadoop.yarn.server.resourcemanager.MockRM.<init>(MockRM.java:113)
at org.apache.hadoop.yarn.server.resourcemanager.MockRM.<init>(MockRM.java:109)
at org.apache.hadoop.yarn.server.resourcemanager.scheduler.fair.TestFairScheduler.setUp(TestFairScheduler.java:122)
REGRESSION: org.apache.hadoop.yarn.server.resourcemanager.scheduler.fair.TestFairScheduler.testQueueMaxAMShare
Error Message:
org/apache/hadoop/yarn/server/applicationhistoryservice/ApplicationHistoryWriter
Stack Trace:
java.lang.NoClassDefFoundError: org/apache/hadoop/yarn/server/applicationhistoryservice/ApplicationHistoryWriter
at java.net.URLClassLoader$1.run(URLClassLoader.java:366)
at java.net.URLClassLoader$1.run(URLClassLoader.java:355)
at java.security.AccessController.doPrivileged(Native Method)
at java.net.URLClassLoader.findClass(URLClassLoader.java:354)
at java.lang.ClassLoader.loadClass(ClassLoader.java:425)
at sun.misc.Launcher$AppClassLoader.loadClass(Launcher.java:308)
at java.lang.ClassLoader.loadClass(ClassLoader.java:358)
at org.apache.hadoop.yarn.server.resourcemanager.ResourceManager.createRMApplicationHistoryWriter(ResourceManager.java:364)
at org.apache.hadoop.yarn.server.resourcemanager.ResourceManager.serviceInit(ResourceManager.java:262)
at org.apache.hadoop.service.AbstractService.init(AbstractService.java:163)
at org.apache.hadoop.yarn.server.resourcemanager.MockRM.<init>(MockRM.java:120)
at org.apache.hadoop.yarn.server.resourcemanager.MockRM.<init>(MockRM.java:113)
at org.apache.hadoop.yarn.server.resourcemanager.MockRM.<init>(MockRM.java:109)
at org.apache.hadoop.yarn.server.resourcemanager.scheduler.fair.TestFairScheduler.setUp(TestFairScheduler.java:122)
REGRESSION: org.apache.hadoop.yarn.server.resourcemanager.scheduler.fair.TestFairScheduler.testFairShareWithMinAlloc
Error Message:
org/apache/hadoop/yarn/server/applicationhistoryservice/ApplicationHistoryWriter
Stack Trace:
java.lang.NoClassDefFoundError: org/apache/hadoop/yarn/server/applicationhistoryservice/ApplicationHistoryWriter
at java.net.URLClassLoader$1.run(URLClassLoader.java:366)
at java.net.URLClassLoader$1.run(URLClassLoader.java:355)
at java.security.AccessController.doPrivileged(Native Method)
at java.net.URLClassLoader.findClass(URLClassLoader.java:354)
at java.lang.ClassLoader.loadClass(ClassLoader.java:425)
at sun.misc.Launcher$AppClassLoader.loadClass(Launcher.java:308)
at java.lang.ClassLoader.loadClass(ClassLoader.java:358)
at org.apache.hadoop.yarn.server.resourcemanager.ResourceManager.createRMApplicationHistoryWriter(ResourceManager.java:364)
at org.apache.hadoop.yarn.server.resourcemanager.ResourceManager.serviceInit(ResourceManager.java:262)
at org.apache.hadoop.service.AbstractService.init(AbstractService.java:163)
at org.apache.hadoop.yarn.server.resourcemanager.MockRM.<init>(MockRM.java:120)
at org.apache.hadoop.yarn.server.resourcemanager.MockRM.<init>(MockRM.java:113)
at org.apache.hadoop.yarn.server.resourcemanager.MockRM.<init>(MockRM.java:109)
at org.apache.hadoop.yarn.server.resourcemanager.scheduler.fair.TestFairScheduler.setUp(TestFairScheduler.java:122)
REGRESSION: org.apache.hadoop.yarn.server.resourcemanager.scheduler.fair.TestFairScheduler.testRecoverRequestAfterPreemption
Error Message:
org/apache/hadoop/yarn/server/applicationhistoryservice/ApplicationHistoryWriter
Stack Trace:
java.lang.NoClassDefFoundError: org/apache/hadoop/yarn/server/applicationhistoryservice/ApplicationHistoryWriter
at java.net.URLClassLoader$1.run(URLClassLoader.java:366)
at java.net.URLClassLoader$1.run(URLClassLoader.java:355)
at java.security.AccessController.doPrivileged(Native Method)
at java.net.URLClassLoader.findClass(URLClassLoader.java:354)
at java.lang.ClassLoader.loadClass(ClassLoader.java:425)
at sun.misc.Launcher$AppClassLoader.loadClass(Launcher.java:308)
at java.lang.ClassLoader.loadClass(ClassLoader.java:358)
at org.apache.hadoop.yarn.server.resourcemanager.ResourceManager.createRMApplicationHistoryWriter(ResourceManager.java:364)
at org.apache.hadoop.yarn.server.resourcemanager.ResourceManager.serviceInit(ResourceManager.java:262)
at org.apache.hadoop.service.AbstractService.init(AbstractService.java:163)
at org.apache.hadoop.yarn.server.resourcemanager.MockRM.<init>(MockRM.java:120)
at org.apache.hadoop.yarn.server.resourcemanager.MockRM.<init>(MockRM.java:113)
at org.apache.hadoop.yarn.server.resourcemanager.MockRM.<init>(MockRM.java:109)
at org.apache.hadoop.yarn.server.resourcemanager.scheduler.fair.TestFairScheduler.setUp(TestFairScheduler.java:122)
REGRESSION: org.apache.hadoop.yarn.server.resourcemanager.scheduler.fair.TestFairScheduler.testConfValidation
Error Message:
org/apache/hadoop/yarn/server/applicationhistoryservice/ApplicationHistoryWriter
Stack Trace:
java.lang.NoClassDefFoundError: org/apache/hadoop/yarn/server/applicationhistoryservice/ApplicationHistoryWriter
at java.net.URLClassLoader$1.run(URLClassLoader.java:366)
at java.net.URLClassLoader$1.run(URLClassLoader.java:355)
at java.security.AccessController.doPrivileged(Native Method)
at java.net.URLClassLoader.findClass(URLClassLoader.java:354)
at java.lang.ClassLoader.loadClass(ClassLoader.java:425)
at sun.misc.Launcher$AppClassLoader.loadClass(Launcher.java:308)
at java.lang.ClassLoader.loadClass(ClassLoader.java:358)
at org.apache.hadoop.yarn.server.resourcemanager.ResourceManager.createRMApplicationHistoryWriter(ResourceManager.java:364)
at org.apache.hadoop.yarn.server.resourcemanager.ResourceManager.serviceInit(ResourceManager.java:262)
at org.apache.hadoop.service.AbstractService.init(AbstractService.java:163)
at org.apache.hadoop.yarn.server.resourcemanager.MockRM.<init>(MockRM.java:120)
at org.apache.hadoop.yarn.server.resourcemanager.MockRM.<init>(MockRM.java:113)
at org.apache.hadoop.yarn.server.resourcemanager.MockRM.<init>(MockRM.java:109)
at org.apache.hadoop.yarn.server.resourcemanager.scheduler.fair.TestFairScheduler.setUp(TestFairScheduler.java:122)
REGRESSION: org.apache.hadoop.yarn.server.resourcemanager.scheduler.fair.TestFairScheduler.testBackwardsCompatiblePreemptionConfiguration
Error Message:
org/apache/hadoop/yarn/server/applicationhistoryservice/ApplicationHistoryWriter
Stack Trace:
java.lang.NoClassDefFoundError: org/apache/hadoop/yarn/server/applicationhistoryservice/ApplicationHistoryWriter
at java.net.URLClassLoader$1.run(URLClassLoader.java:366)
at java.net.URLClassLoader$1.run(URLClassLoader.java:355)
at java.security.AccessController.doPrivileged(Native Method)
at java.net.URLClassLoader.findClass(URLClassLoader.java:354)
at java.lang.ClassLoader.loadClass(ClassLoader.java:425)
at sun.misc.Launcher$AppClassLoader.loadClass(Launcher.java:308)
at java.lang.ClassLoader.loadClass(ClassLoader.java:358)
at org.apache.hadoop.yarn.server.resourcemanager.ResourceManager.createRMApplicationHistoryWriter(ResourceManager.java:364)
at org.apache.hadoop.yarn.server.resourcemanager.ResourceManager.serviceInit(ResourceManager.java:262)
at org.apache.hadoop.service.AbstractService.init(AbstractService.java:163)
at org.apache.hadoop.yarn.server.resourcemanager.MockRM.<init>(MockRM.java:120)
at org.apache.hadoop.yarn.server.resourcemanager.MockRM.<init>(MockRM.java:113)
at org.apache.hadoop.yarn.server.resourcemanager.MockRM.<init>(MockRM.java:109)
at org.apache.hadoop.yarn.server.resourcemanager.scheduler.fair.TestFairScheduler.setUp(TestFairScheduler.java:122)
REGRESSION: org.apache.hadoop.yarn.server.resourcemanager.scheduler.fair.TestFairScheduler.testFairShareWithZeroWeight
Error Message:
org/apache/hadoop/yarn/server/applicationhistoryservice/ApplicationHistoryWriter
Stack Trace:
java.lang.NoClassDefFoundError: org/apache/hadoop/yarn/server/applicationhistoryservice/ApplicationHistoryWriter
at java.net.URLClassLoader$1.run(URLClassLoader.java:366)
at java.net.URLClassLoader$1.run(URLClassLoader.java:355)
at java.security.AccessController.doPrivileged(Native Method)
at java.net.URLClassLoader.findClass(URLClassLoader.java:354)
at java.lang.ClassLoader.loadClass(ClassLoader.java:425)
at sun.misc.Launcher$AppClassLoader.loadClass(Launcher.java:308)
at java.lang.ClassLoader.loadClass(ClassLoader.java:358)
at org.apache.hadoop.yarn.server.resourcemanager.ResourceManager.createRMApplicationHistoryWriter(ResourceManager.java:364)
at org.apache.hadoop.yarn.server.resourcemanager.ResourceManager.serviceInit(ResourceManager.java:262)
at org.apache.hadoop.service.AbstractService.init(AbstractService.java:163)
at org.apache.hadoop.yarn.server.resourcemanager.MockRM.<init>(MockRM.java:120)
at org.apache.hadoop.yarn.server.resourcemanager.MockRM.<init>(MockRM.java:113)
at org.apache.hadoop.yarn.server.resourcemanager.MockRM.<init>(MockRM.java:109)
at org.apache.hadoop.yarn.server.resourcemanager.scheduler.fair.TestFairScheduler.setUp(TestFairScheduler.java:122)
REGRESSION: org.apache.hadoop.yarn.server.resourcemanager.scheduler.fair.TestFairScheduler.testUserAndQueueMaxRunningApps
Error Message:
org/apache/hadoop/yarn/server/applicationhistoryservice/ApplicationHistoryWriter
Stack Trace:
java.lang.NoClassDefFoundError: org/apache/hadoop/yarn/server/applicationhistoryservice/ApplicationHistoryWriter
at java.net.URLClassLoader$1.run(URLClassLoader.java:366)
at java.net.URLClassLoader$1.run(URLClassLoader.java:355)
at java.security.AccessController.doPrivileged(Native Method)
at java.net.URLClassLoader.findClass(URLClassLoader.java:354)
at java.lang.ClassLoader.loadClass(ClassLoader.java:425)
at sun.misc.Launcher$AppClassLoader.loadClass(Launcher.java:308)
at java.lang.ClassLoader.loadClass(ClassLoader.java:358)
at org.apache.hadoop.yarn.server.resourcemanager.ResourceManager.createRMApplicationHistoryWriter(ResourceManager.java:364)
at org.apache.hadoop.yarn.server.resourcemanager.ResourceManager.serviceInit(ResourceManager.java:262)
at org.apache.hadoop.service.AbstractService.init(AbstractService.java:163)
at org.apache.hadoop.yarn.server.resourcemanager.MockRM.<init>(MockRM.java:120)
at org.apache.hadoop.yarn.server.resourcemanager.MockRM.<init>(MockRM.java:113)
at org.apache.hadoop.yarn.server.resourcemanager.MockRM.<init>(MockRM.java:109)
at org.apache.hadoop.yarn.server.resourcemanager.scheduler.fair.TestFairScheduler.setUp(TestFairScheduler.java:122)
REGRESSION: org.apache.hadoop.yarn.server.resourcemanager.scheduler.fair.TestFairScheduler.testMinZeroResourcesSettings
Error Message:
org/apache/hadoop/yarn/server/applicationhistoryservice/ApplicationHistoryWriter
Stack Trace:
java.lang.NoClassDefFoundError: org/apache/hadoop/yarn/server/applicationhistoryservice/ApplicationHistoryWriter
at java.net.URLClassLoader$1.run(URLClassLoader.java:366)
at java.net.URLClassLoader$1.run(URLClassLoader.java:355)
at java.security.AccessController.doPrivileged(Native Method)
at java.net.URLClassLoader.findClass(URLClassLoader.java:354)
at java.lang.ClassLoader.loadClass(ClassLoader.java:425)
at sun.misc.Launcher$AppClassLoader.loadClass(Launcher.java:308)
at java.lang.ClassLoader.loadClass(ClassLoader.java:358)
at org.apache.hadoop.yarn.server.resourcemanager.ResourceManager.createRMApplicationHistoryWriter(ResourceManager.java:364)
at org.apache.hadoop.yarn.server.resourcemanager.ResourceManager.serviceInit(ResourceManager.java:262)
at org.apache.hadoop.service.AbstractService.init(AbstractService.java:163)
at org.apache.hadoop.yarn.server.resourcemanager.MockRM.<init>(MockRM.java:120)
at org.apache.hadoop.yarn.server.resourcemanager.MockRM.<init>(MockRM.java:113)
at org.apache.hadoop.yarn.server.resourcemanager.MockRM.<init>(MockRM.java:109)
at org.apache.hadoop.yarn.server.resourcemanager.scheduler.fair.TestFairScheduler.setUp(TestFairScheduler.java:122)
REGRESSION: org.apache.hadoop.yarn.server.resourcemanager.scheduler.fair.TestFairScheduler.testCancelStrictLocality
Error Message:
org/apache/hadoop/yarn/server/applicationhistoryservice/ApplicationHistoryWriter
Stack Trace:
java.lang.NoClassDefFoundError: org/apache/hadoop/yarn/server/applicationhistoryservice/ApplicationHistoryWriter
at java.net.URLClassLoader$1.run(URLClassLoader.java:366)
at java.net.URLClassLoader$1.run(URLClassLoader.java:355)
at java.security.AccessController.doPrivileged(Native Method)
at java.net.URLClassLoader.findClass(URLClassLoader.java:354)
at java.lang.ClassLoader.loadClass(ClassLoader.java:425)
at sun.misc.Launcher$AppClassLoader.loadClass(Launcher.java:308)
at java.lang.ClassLoader.loadClass(ClassLoader.java:358)
at org.apache.hadoop.yarn.server.resourcemanager.ResourceManager.createRMApplicationHistoryWriter(ResourceManager.java:364)
at org.apache.hadoop.yarn.server.resourcemanager.ResourceManager.serviceInit(ResourceManager.java:262)
at org.apache.hadoop.service.AbstractService.init(AbstractService.java:163)
at org.apache.hadoop.yarn.server.resourcemanager.MockRM.<init>(MockRM.java:120)
at org.apache.hadoop.yarn.server.resourcemanager.MockRM.<init>(MockRM.java:113)
at org.apache.hadoop.yarn.server.resourcemanager.MockRM.<init>(MockRM.java:109)
at org.apache.hadoop.yarn.server.resourcemanager.scheduler.fair.TestFairScheduler.setUp(TestFairScheduler.java:122)
REGRESSION: org.apache.hadoop.yarn.server.resourcemanager.scheduler.fair.TestFairScheduler.testNonMinZeroResourcesSettings
Error Message:
org/apache/hadoop/yarn/server/applicationhistoryservice/ApplicationHistoryWriter
Stack Trace:
java.lang.NoClassDefFoundError: org/apache/hadoop/yarn/server/applicationhistoryservice/ApplicationHistoryWriter
at java.net.URLClassLoader$1.run(URLClassLoader.java:366)
at java.net.URLClassLoader$1.run(URLClassLoader.java:355)
at java.security.AccessController.doPrivileged(Native Method)
at java.net.URLClassLoader.findClass(URLClassLoader.java:354)
at java.lang.ClassLoader.loadClass(ClassLoader.java:425)
at sun.misc.Launcher$AppClassLoader.loadClass(Launcher.java:308)
at java.lang.ClassLoader.loadClass(ClassLoader.java:358)
at org.apache.hadoop.yarn.server.resourcemanager.ResourceManager.createRMApplicationHistoryWriter(ResourceManager.java:364)
at org.apache.hadoop.yarn.server.resourcemanager.ResourceManager.serviceInit(ResourceManager.java:262)
at org.apache.hadoop.service.AbstractService.init(AbstractService.java:163)
at org.apache.hadoop.yarn.server.resourcemanager.MockRM.<init>(MockRM.java:120)
at org.apache.hadoop.yarn.server.resourcemanager.MockRM.<init>(MockRM.java:113)
at org.apache.hadoop.yarn.server.resourcemanager.MockRM.<init>(MockRM.java:109)
at org.apache.hadoop.yarn.server.resourcemanager.scheduler.fair.TestFairScheduler.setUp(TestFairScheduler.java:122)
REGRESSION: org.apache.hadoop.yarn.server.resourcemanager.scheduler.fair.TestFairScheduler.testDecreaseUserMaxRunningAppsOnTheFly
Error Message:
org/apache/hadoop/yarn/server/applicationhistoryservice/ApplicationHistoryWriter
Stack Trace:
java.lang.NoClassDefFoundError: org/apache/hadoop/yarn/server/applicationhistoryservice/ApplicationHistoryWriter
at java.net.URLClassLoader$1.run(URLClassLoader.java:366)
at java.net.URLClassLoader$1.run(URLClassLoader.java:355)
at java.security.AccessController.doPrivileged(Native Method)
at java.net.URLClassLoader.findClass(URLClassLoader.java:354)
at java.lang.ClassLoader.loadClass(ClassLoader.java:425)
at sun.misc.Launcher$AppClassLoader.loadClass(Launcher.java:308)
at java.lang.ClassLoader.loadClass(ClassLoader.java:358)
at org.apache.hadoop.yarn.server.resourcemanager.ResourceManager.createRMApplicationHistoryWriter(ResourceManager.java:364)
at org.apache.hadoop.yarn.server.resourcemanager.ResourceManager.serviceInit(ResourceManager.java:262)
at org.apache.hadoop.service.AbstractService.init(AbstractService.java:163)
at org.apache.hadoop.yarn.server.resourcemanager.MockRM.<init>(MockRM.java:120)
at org.apache.hadoop.yarn.server.resourcemanager.MockRM.<init>(MockRM.java:113)
at org.apache.hadoop.yarn.server.resourcemanager.MockRM.<init>(MockRM.java:109)
at org.apache.hadoop.yarn.server.resourcemanager.scheduler.fair.TestFairScheduler.setUp(TestFairScheduler.java:122)
REGRESSION: org.apache.hadoop.yarn.server.resourcemanager.scheduler.fair.TestFairScheduler.testSteadyFairShareWithQueueCreatedRuntime
Error Message:
org/apache/hadoop/yarn/server/applicationhistoryservice/ApplicationHistoryWriter
Stack Trace:
java.lang.NoClassDefFoundError: org/apache/hadoop/yarn/server/applicationhistoryservice/ApplicationHistoryWriter
at java.net.URLClassLoader$1.run(URLClassLoader.java:366)
at java.net.URLClassLoader$1.run(URLClassLoader.java:355)
at java.security.AccessController.doPrivileged(Native Method)
at java.net.URLClassLoader.findClass(URLClassLoader.java:354)
at java.lang.ClassLoader.loadClass(ClassLoader.java:425)
at sun.misc.Launcher$AppClassLoader.loadClass(Launcher.java:308)
at java.lang.ClassLoader.loadClass(ClassLoader.java:358)
at org.apache.hadoop.yarn.server.resourcemanager.ResourceManager.createRMApplicationHistoryWriter(ResourceManager.java:364)
at org.apache.hadoop.yarn.server.resourcemanager.ResourceManager.serviceInit(ResourceManager.java:262)
at org.apache.hadoop.service.AbstractService.init(AbstractService.java:163)
at org.apache.hadoop.yarn.server.resourcemanager.MockRM.<init>(MockRM.java:120)
at org.apache.hadoop.yarn.server.resourcemanager.MockRM.<init>(MockRM.java:113)
at org.apache.hadoop.yarn.server.resourcemanager.MockRM.<init>(MockRM.java:109)
at org.apache.hadoop.yarn.server.resourcemanager.scheduler.fair.TestFairScheduler.setUp(TestFairScheduler.java:122)
REGRESSION: org.apache.hadoop.yarn.server.resourcemanager.scheduler.fair.TestFairScheduler.testMultipleNodesSingleRackRequest
Error Message:
org/apache/hadoop/yarn/server/applicationhistoryservice/ApplicationHistoryWriter
Stack Trace:
java.lang.NoClassDefFoundError: org/apache/hadoop/yarn/server/applicationhistoryservice/ApplicationHistoryWriter
at java.net.URLClassLoader$1.run(URLClassLoader.java:366)
at java.net.URLClassLoader$1.run(URLClassLoader.java:355)
at java.security.AccessController.doPrivileged(Native Method)
at java.net.URLClassLoader.findClass(URLClassLoader.java:354)
at java.lang.ClassLoader.loadClass(ClassLoader.java:425)
at sun.misc.Launcher$AppClassLoader.loadClass(Launcher.java:308)
at java.lang.ClassLoader.loadClass(ClassLoader.java:358)
at org.apache.hadoop.yarn.server.resourcemanager.ResourceManager.createRMApplicationHistoryWriter(ResourceManager.java:364)
at org.apache.hadoop.yarn.server.resourcemanager.ResourceManager.serviceInit(ResourceManager.java:262)
at org.apache.hadoop.service.AbstractService.init(AbstractService.java:163)
at org.apache.hadoop.yarn.server.resourcemanager.MockRM.<init>(MockRM.java:120)
at org.apache.hadoop.yarn.server.resourcemanager.MockRM.<init>(MockRM.java:113)
at org.apache.hadoop.yarn.server.resourcemanager.MockRM.<init>(MockRM.java:109)
at org.apache.hadoop.yarn.server.resourcemanager.scheduler.fair.TestFairScheduler.setUp(TestFairScheduler.java:122)
REGRESSION: org.apache.hadoop.yarn.server.resourcemanager.scheduler.fair.TestFairScheduler.testLowestCommonAncestorDeeperHierarchy
Error Message:
org/apache/hadoop/yarn/server/applicationhistoryservice/ApplicationHistoryWriter
Stack Trace:
java.lang.NoClassDefFoundError: org/apache/hadoop/yarn/server/applicationhistoryservice/ApplicationHistoryWriter
at java.net.URLClassLoader$1.run(URLClassLoader.java:366)
at java.net.URLClassLoader$1.run(URLClassLoader.java:355)
at java.security.AccessController.doPrivileged(Native Method)
at java.net.URLClassLoader.findClass(URLClassLoader.java:354)
at java.lang.ClassLoader.loadClass(ClassLoader.java:425)
at sun.misc.Launcher$AppClassLoader.loadClass(Launcher.java:308)
at java.lang.ClassLoader.loadClass(ClassLoader.java:358)
at org.apache.hadoop.yarn.server.resourcemanager.ResourceManager.createRMApplicationHistoryWriter(ResourceManager.java:364)
at org.apache.hadoop.yarn.server.resourcemanager.ResourceManager.serviceInit(ResourceManager.java:262)
at org.apache.hadoop.service.AbstractService.init(AbstractService.java:163)
at org.apache.hadoop.yarn.server.resourcemanager.MockRM.<init>(MockRM.java:120)
at org.apache.hadoop.yarn.server.resourcemanager.MockRM.<init>(MockRM.java:113)
at org.apache.hadoop.yarn.server.resourcemanager.MockRM.<init>(MockRM.java:109)
at org.apache.hadoop.yarn.server.resourcemanager.scheduler.fair.TestFairScheduler.setUp(TestFairScheduler.java:122)
REGRESSION: org.apache.hadoop.yarn.server.resourcemanager.scheduler.fair.TestFairScheduler.testReservationWhileMultiplePriorities
Error Message:
org/apache/hadoop/yarn/server/applicationhistoryservice/ApplicationHistoryWriter
Stack Trace:
java.lang.NoClassDefFoundError: org/apache/hadoop/yarn/server/applicationhistoryservice/ApplicationHistoryWriter
at java.net.URLClassLoader$1.run(URLClassLoader.java:366)
at java.net.URLClassLoader$1.run(URLClassLoader.java:355)
at java.security.AccessController.doPrivileged(Native Method)
at java.net.URLClassLoader.findClass(URLClassLoader.java:354)
at java.lang.ClassLoader.loadClass(ClassLoader.java:425)
at sun.misc.Launcher$AppClassLoader.loadClass(Launcher.java:308)
at java.lang.ClassLoader.loadClass(ClassLoader.java:358)
at org.apache.hadoop.yarn.server.resourcemanager.ResourceManager.createRMApplicationHistoryWriter(ResourceManager.java:364)
at org.apache.hadoop.yarn.server.resourcemanager.ResourceManager.serviceInit(ResourceManager.java:262)
at org.apache.hadoop.service.AbstractService.init(AbstractService.java:163)
at org.apache.hadoop.yarn.server.resourcemanager.MockRM.<init>(MockRM.java:120)
at org.apache.hadoop.yarn.server.resourcemanager.MockRM.<init>(MockRM.java:113)
at org.apache.hadoop.yarn.server.resourcemanager.MockRM.<init>(MockRM.java:109)
at org.apache.hadoop.yarn.server.resourcemanager.scheduler.fair.TestFairScheduler.setUp(TestFairScheduler.java:122)
REGRESSION: org.apache.hadoop.yarn.server.resourcemanager.scheduler.fair.TestFairScheduler.testPreemptionDecisionWithDRF
Error Message:
org/apache/hadoop/yarn/server/applicationhistoryservice/ApplicationHistoryWriter
Stack Trace:
java.lang.NoClassDefFoundError: org/apache/hadoop/yarn/server/applicationhistoryservice/ApplicationHistoryWriter
at java.net.URLClassLoader$1.run(URLClassLoader.java:366)
at java.net.URLClassLoader$1.run(URLClassLoader.java:355)
at java.security.AccessController.doPrivileged(Native Method)
at java.net.URLClassLoader.findClass(URLClassLoader.java:354)
at java.lang.ClassLoader.loadClass(ClassLoader.java:425)
at sun.misc.Launcher$AppClassLoader.loadClass(Launcher.java:308)
at java.lang.ClassLoader.loadClass(ClassLoader.java:358)
at org.apache.hadoop.yarn.server.resourcemanager.ResourceManager.createRMApplicationHistoryWriter(ResourceManager.java:364)
at org.apache.hadoop.yarn.server.resourcemanager.ResourceManager.serviceInit(ResourceManager.java:262)
at org.apache.hadoop.service.AbstractService.init(AbstractService.java:163)
at org.apache.hadoop.yarn.server.resourcemanager.MockRM.<init>(MockRM.java:120)
at org.apache.hadoop.yarn.server.resourcemanager.MockRM.<init>(MockRM.java:113)
at org.apache.hadoop.yarn.server.resourcemanager.MockRM.<init>(MockRM.java:109)
at org.apache.hadoop.yarn.server.resourcemanager.scheduler.fair.TestFairScheduler.setUp(TestFairScheduler.java:122)
REGRESSION: org.apache.hadoop.yarn.server.resourcemanager.scheduler.fair.TestFairScheduler.testContinuousSchedulingWithNodeRemoved
Error Message:
org/apache/hadoop/yarn/server/applicationhistoryservice/ApplicationHistoryWriter
Stack Trace:
java.lang.NoClassDefFoundError: org/apache/hadoop/yarn/server/applicationhistoryservice/ApplicationHistoryWriter
at java.net.URLClassLoader$1.run(URLClassLoader.java:366)
at java.net.URLClassLoader$1.run(URLClassLoader.java:355)
at java.security.AccessController.doPrivileged(Native Method)
at java.net.URLClassLoader.findClass(URLClassLoader.java:354)
at java.lang.ClassLoader.loadClass(ClassLoader.java:425)
at sun.misc.Launcher$AppClassLoader.loadClass(Launcher.java:308)
at java.lang.ClassLoader.loadClass(ClassLoader.java:358)
at org.apache.hadoop.yarn.server.resourcemanager.ResourceManager.createRMApplicationHistoryWriter(ResourceManager.java:364)
at org.apache.hadoop.yarn.server.resourcemanager.ResourceManager.serviceInit(ResourceManager.java:262)
at org.apache.hadoop.service.AbstractService.init(AbstractService.java:163)
at org.apache.hadoop.yarn.server.resourcemanager.MockRM.<init>(MockRM.java:120)
at org.apache.hadoop.yarn.server.resourcemanager.MockRM.<init>(MockRM.java:113)
at org.apache.hadoop.yarn.server.resourcemanager.MockRM.<init>(MockRM.java:109)
at org.apache.hadoop.yarn.server.resourcemanager.scheduler.fair.TestFairScheduler.setUp(TestFairScheduler.java:122)
REGRESSION: org.apache.hadoop.yarn.server.resourcemanager.scheduler.fair.TestFairScheduler.testEmptyQueueName
Error Message:
org/apache/hadoop/yarn/server/applicationhistoryservice/ApplicationHistoryWriter
Stack Trace:
java.lang.NoClassDefFoundError: org/apache/hadoop/yarn/server/applicationhistoryservice/ApplicationHistoryWriter
at java.net.URLClassLoader$1.run(URLClassLoader.java:366)
at java.net.URLClassLoader$1.run(URLClassLoader.java:355)
at java.security.AccessController.doPrivileged(Native Method)
at java.net.URLClassLoader.findClass(URLClassLoader.java:354)
at java.lang.ClassLoader.loadClass(ClassLoader.java:425)
at sun.misc.Launcher$AppClassLoader.loadClass(Launcher.java:308)
at java.lang.ClassLoader.loadClass(ClassLoader.java:358)
at org.apache.hadoop.yarn.server.resourcemanager.ResourceManager.createRMApplicationHistoryWriter(ResourceManager.java:364)
at org.apache.hadoop.yarn.server.resourcemanager.ResourceManager.serviceInit(ResourceManager.java:262)
at org.apache.hadoop.service.AbstractService.init(AbstractService.java:163)
at org.apache.hadoop.yarn.server.resourcemanager.MockRM.<init>(MockRM.java:120)
at org.apache.hadoop.yarn.server.resourcemanager.MockRM.<init>(MockRM.java:113)
at org.apache.hadoop.yarn.server.resourcemanager.MockRM.<init>(MockRM.java:109)
at org.apache.hadoop.yarn.server.resourcemanager.scheduler.fair.TestFairScheduler.setUp(TestFairScheduler.java:122)
REGRESSION: org.apache.hadoop.yarn.server.resourcemanager.scheduler.fair.TestFairScheduler.testUserMaxRunningApps
Error Message:
org/apache/hadoop/yarn/server/applicationhistoryservice/ApplicationHistoryWriter
Stack Trace:
java.lang.NoClassDefFoundError: org/apache/hadoop/yarn/server/applicationhistoryservice/ApplicationHistoryWriter
at java.net.URLClassLoader$1.run(URLClassLoader.java:366)
at java.net.URLClassLoader$1.run(URLClassLoader.java:355)
at java.security.AccessController.doPrivileged(Native Method)
at java.net.URLClassLoader.findClass(URLClassLoader.java:354)
at java.lang.ClassLoader.loadClass(ClassLoader.java:425)
at sun.misc.Launcher$AppClassLoader.loadClass(Launcher.java:308)
at java.lang.ClassLoader.loadClass(ClassLoader.java:358)
at org.apache.hadoop.yarn.server.resourcemanager.ResourceManager.createRMApplicationHistoryWriter(ResourceManager.java:364)
at org.apache.hadoop.yarn.server.resourcemanager.ResourceManager.serviceInit(ResourceManager.java:262)
at org.apache.hadoop.service.AbstractService.init(AbstractService.java:163)
at org.apache.hadoop.yarn.server.resourcemanager.MockRM.<init>(MockRM.java:120)
at org.apache.hadoop.yarn.server.resourcemanager.MockRM.<init>(MockRM.java:113)
at org.apache.hadoop.yarn.server.resourcemanager.MockRM.<init>(MockRM.java:109)
at org.apache.hadoop.yarn.server.resourcemanager.scheduler.fair.TestFairScheduler.setUp(TestFairScheduler.java:122)
REGRESSION: org.apache.hadoop.yarn.server.resourcemanager.scheduler.fair.TestFairScheduler.testQueueInfo
Error Message:
org/apache/hadoop/yarn/server/applicationhistoryservice/ApplicationHistoryWriter
Stack Trace:
java.lang.NoClassDefFoundError: org/apache/hadoop/yarn/server/applicationhistoryservice/ApplicationHistoryWriter
at java.net.URLClassLoader$1.run(URLClassLoader.java:366)
at java.net.URLClassLoader$1.run(URLClassLoader.java:355)
at java.security.AccessController.doPrivileged(Native Method)
at java.net.URLClassLoader.findClass(URLClassLoader.java:354)
at java.lang.ClassLoader.loadClass(ClassLoader.java:425)
at sun.misc.Launcher$AppClassLoader.loadClass(Launcher.java:308)
at java.lang.ClassLoader.loadClass(ClassLoader.java:358)
at org.apache.hadoop.yarn.server.resourcemanager.ResourceManager.createRMApplicationHistoryWriter(ResourceManager.java:364)
at org.apache.hadoop.yarn.server.resourcemanager.ResourceManager.serviceInit(ResourceManager.java:262)
at org.apache.hadoop.service.AbstractService.init(AbstractService.java:163)
at org.apache.hadoop.yarn.server.resourcemanager.MockRM.<init>(MockRM.java:120)
at org.apache.hadoop.yarn.server.resourcemanager.MockRM.<init>(MockRM.java:113)
at org.apache.hadoop.yarn.server.resourcemanager.MockRM.<init>(MockRM.java:109)
at org.apache.hadoop.yarn.server.resourcemanager.scheduler.fair.TestFairScheduler.setUp(TestFairScheduler.java:122)
REGRESSION: org.apache.hadoop.yarn.server.resourcemanager.scheduler.fair.TestFairScheduler.testAclSubmitApplication
Error Message:
org/apache/hadoop/yarn/server/applicationhistoryservice/ApplicationHistoryWriter
Stack Trace:
java.lang.NoClassDefFoundError: org/apache/hadoop/yarn/server/applicationhistoryservice/ApplicationHistoryWriter
at java.net.URLClassLoader$1.run(URLClassLoader.java:366)
at java.net.URLClassLoader$1.run(URLClassLoader.java:355)
at java.security.AccessController.doPrivileged(Native Method)
at java.net.URLClassLoader.findClass(URLClassLoader.java:354)
at java.lang.ClassLoader.loadClass(ClassLoader.java:425)
at sun.misc.Launcher$AppClassLoader.loadClass(Launcher.java:308)
at java.lang.ClassLoader.loadClass(ClassLoader.java:358)
at org.apache.hadoop.yarn.server.resourcemanager.ResourceManager.createRMApplicationHistoryWriter(ResourceManager.java:364)
at org.apache.hadoop.yarn.server.resourcemanager.ResourceManager.serviceInit(ResourceManager.java:262)
at org.apache.hadoop.service.AbstractService.init(AbstractService.java:163)
at org.apache.hadoop.yarn.server.resourcemanager.MockRM.<init>(MockRM.java:120)
at org.apache.hadoop.yarn.server.resourcemanager.MockRM.<init>(MockRM.java:113)
at org.apache.hadoop.yarn.server.resourcemanager.MockRM.<init>(MockRM.java:109)
at org.apache.hadoop.yarn.server.resourcemanager.scheduler.fair.TestFairScheduler.setUp(TestFairScheduler.java:122)
REGRESSION: org.apache.hadoop.yarn.server.resourcemanager.scheduler.fair.TestFairScheduler.testFairShareWithMaxResources
Error Message:
org/apache/hadoop/yarn/server/applicationhistoryservice/ApplicationHistoryWriter
Stack Trace:
java.lang.NoClassDefFoundError: org/apache/hadoop/yarn/server/applicationhistoryservice/ApplicationHistoryWriter
at java.net.URLClassLoader$1.run(URLClassLoader.java:366)
at java.net.URLClassLoader$1.run(URLClassLoader.java:355)
at java.security.AccessController.doPrivileged(Native Method)
at java.net.URLClassLoader.findClass(URLClassLoader.java:354)
at java.lang.ClassLoader.loadClass(ClassLoader.java:425)
at sun.misc.Launcher$AppClassLoader.loadClass(Launcher.java:308)
at java.lang.ClassLoader.loadClass(ClassLoader.java:358)
at org.apache.hadoop.yarn.server.resourcemanager.ResourceManager.createRMApplicationHistoryWriter(ResourceManager.java:364)
at org.apache.hadoop.yarn.server.resourcemanager.ResourceManager.serviceInit(ResourceManager.java:262)
at org.apache.hadoop.service.AbstractService.init(AbstractService.java:163)
at org.apache.hadoop.yarn.server.resourcemanager.MockRM.<init>(MockRM.java:120)
at org.apache.hadoop.yarn.server.resourcemanager.MockRM.<init>(MockRM.java:113)
at org.apache.hadoop.yarn.server.resourcemanager.MockRM.<init>(MockRM.java:109)
at org.apache.hadoop.yarn.server.resourcemanager.scheduler.fair.TestFairScheduler.setUp(TestFairScheduler.java:122)
REGRESSION: org.apache.hadoop.yarn.server.resourcemanager.scheduler.fair.TestFairScheduler.testAssignToQueue
Error Message:
org/apache/hadoop/yarn/server/applicationhistoryservice/ApplicationHistoryWriter
Stack Trace:
java.lang.NoClassDefFoundError: org/apache/hadoop/yarn/server/applicationhistoryservice/ApplicationHistoryWriter
at java.net.URLClassLoader$1.run(URLClassLoader.java:366)
at java.net.URLClassLoader$1.run(URLClassLoader.java:355)
at java.security.AccessController.doPrivileged(Native Method)
at java.net.URLClassLoader.findClass(URLClassLoader.java:354)
at java.lang.ClassLoader.loadClass(ClassLoader.java:425)
at sun.misc.Launcher$AppClassLoader.loadClass(Launcher.java:308)
at java.lang.ClassLoader.loadClass(ClassLoader.java:358)
at org.apache.hadoop.yarn.server.resourcemanager.ResourceManager.createRMApplicationHistoryWriter(ResourceManager.java:364)
at org.apache.hadoop.yarn.server.resourcemanager.ResourceManager.serviceInit(ResourceManager.java:262)
at org.apache.hadoop.service.AbstractService.init(AbstractService.java:163)
at org.apache.hadoop.yarn.server.resourcemanager.MockRM.<init>(MockRM.java:120)
at org.apache.hadoop.yarn.server.resourcemanager.MockRM.<init>(MockRM.java:113)
at org.apache.hadoop.yarn.server.resourcemanager.MockRM.<init>(MockRM.java:109)
at org.apache.hadoop.yarn.server.resourcemanager.scheduler.fair.TestFairScheduler.setUp(TestFairScheduler.java:122)
REGRESSION: org.apache.hadoop.yarn.server.resourcemanager.scheduler.fair.TestFairScheduler.testQueuePlacementWithPolicy
Error Message:
org/apache/hadoop/yarn/server/applicationhistoryservice/ApplicationHistoryWriter
Stack Trace:
java.lang.NoClassDefFoundError: org/apache/hadoop/yarn/server/applicationhistoryservice/ApplicationHistoryWriter
at java.net.URLClassLoader$1.run(URLClassLoader.java:366)
at java.net.URLClassLoader$1.run(URLClassLoader.java:355)
at java.security.AccessController.doPrivileged(Native Method)
at java.net.URLClassLoader.findClass(URLClassLoader.java:354)
at java.lang.ClassLoader.loadClass(ClassLoader.java:425)
at sun.misc.Launcher$AppClassLoader.loadClass(Launcher.java:308)
at java.lang.ClassLoader.loadClass(ClassLoader.java:358)
at org.apache.hadoop.yarn.server.resourcemanager.ResourceManager.createRMApplicationHistoryWriter(ResourceManager.java:364)
at org.apache.hadoop.yarn.server.resourcemanager.ResourceManager.serviceInit(ResourceManager.java:262)
at org.apache.hadoop.service.AbstractService.init(AbstractService.java:163)
at org.apache.hadoop.yarn.server.resourcemanager.MockRM.<init>(MockRM.java:120)
at org.apache.hadoop.yarn.server.resourcemanager.MockRM.<init>(MockRM.java:113)
at org.apache.hadoop.yarn.server.resourcemanager.MockRM.<init>(MockRM.java:109)
at org.apache.hadoop.yarn.server.resourcemanager.scheduler.fair.TestFairScheduler.setUp(TestFairScheduler.java:122)
REGRESSION: org.apache.hadoop.yarn.server.resourcemanager.scheduler.fair.TestFairScheduler.testFairShareWithZeroWeightNoneZeroMinRes
Error Message:
org/apache/hadoop/yarn/server/applicationhistoryservice/ApplicationHistoryWriter
Stack Trace:
java.lang.NoClassDefFoundError: org/apache/hadoop/yarn/server/applicationhistoryservice/ApplicationHistoryWriter
at java.net.URLClassLoader$1.run(URLClassLoader.java:366)
at java.net.URLClassLoader$1.run(URLClassLoader.java:355)
at java.security.AccessController.doPrivileged(Native Method)
at java.net.URLClassLoader.findClass(URLClassLoader.java:354)
at java.lang.ClassLoader.loadClass(ClassLoader.java:425)
at sun.misc.Launcher$AppClassLoader.loadClass(Launcher.java:308)
at java.lang.ClassLoader.loadClass(ClassLoader.java:358)
at org.apache.hadoop.yarn.server.resourcemanager.ResourceManager.createRMApplicationHistoryWriter(ResourceManager.java:364)
at org.apache.hadoop.yarn.server.resourcemanager.ResourceManager.serviceInit(ResourceManager.java:262)
at org.apache.hadoop.service.AbstractService.init(AbstractService.java:163)
at org.apache.hadoop.yarn.server.resourcemanager.MockRM.<init>(MockRM.java:120)
at org.apache.hadoop.yarn.server.resourcemanager.MockRM.<init>(MockRM.java:113)
at org.apache.hadoop.yarn.server.resourcemanager.MockRM.<init>(MockRM.java:109)
at org.apache.hadoop.yarn.server.resourcemanager.scheduler.fair.TestFairScheduler.setUp(TestFairScheduler.java:122)
REGRESSION: org.apache.hadoop.yarn.server.resourcemanager.scheduler.fair.TestFairScheduler.testUserAsDefaultQueueWithLeadingTrailingSpaceUserName
Error Message:
org/apache/hadoop/yarn/server/applicationhistoryservice/ApplicationHistoryWriter
Stack Trace:
java.lang.NoClassDefFoundError: org/apache/hadoop/yarn/server/applicationhistoryservice/ApplicationHistoryWriter
at java.net.URLClassLoader$1.run(URLClassLoader.java:366)
at java.net.URLClassLoader$1.run(URLClassLoader.java:355)
at java.security.AccessController.doPrivileged(Native Method)
at java.net.URLClassLoader.findClass(URLClassLoader.java:354)
at java.lang.ClassLoader.loadClass(ClassLoader.java:425)
at sun.misc.Launcher$AppClassLoader.loadClass(Launcher.java:308)
at java.lang.ClassLoader.loadClass(ClassLoader.java:358)
at org.apache.hadoop.yarn.server.resourcemanager.ResourceManager.createRMApplicationHistoryWriter(ResourceManager.java:364)
at org.apache.hadoop.yarn.server.resourcemanager.ResourceManager.serviceInit(ResourceManager.java:262)
at org.apache.hadoop.service.AbstractService.init(AbstractService.java:163)
at org.apache.hadoop.yarn.server.resourcemanager.MockRM.<init>(MockRM.java:120)
at org.apache.hadoop.yarn.server.resourcemanager.MockRM.<init>(MockRM.java:113)
at org.apache.hadoop.yarn.server.resourcemanager.MockRM.<init>(MockRM.java:109)
at org.apache.hadoop.yarn.server.resourcemanager.scheduler.fair.TestFairScheduler.setUp(TestFairScheduler.java:122)
REGRESSION: org.apache.hadoop.yarn.server.resourcemanager.scheduler.fair.TestFairScheduler.testSimpleContainerReservation
Error Message:
org/apache/hadoop/yarn/server/applicationhistoryservice/ApplicationHistoryWriter
Stack Trace:
java.lang.NoClassDefFoundError: org/apache/hadoop/yarn/server/applicationhistoryservice/ApplicationHistoryWriter
at java.net.URLClassLoader$1.run(URLClassLoader.java:366)
at java.net.URLClassLoader$1.run(URLClassLoader.java:355)
at java.security.AccessController.doPrivileged(Native Method)
at java.net.URLClassLoader.findClass(URLClassLoader.java:354)
at java.lang.ClassLoader.loadClass(ClassLoader.java:425)
at sun.misc.Launcher$AppClassLoader.loadClass(Launcher.java:308)
at java.lang.ClassLoader.loadClass(ClassLoader.java:358)
at org.apache.hadoop.yarn.server.resourcemanager.ResourceManager.createRMApplicationHistoryWriter(ResourceManager.java:364)
at org.apache.hadoop.yarn.server.resourcemanager.ResourceManager.serviceInit(ResourceManager.java:262)
at org.apache.hadoop.service.AbstractService.init(AbstractService.java:163)
at org.apache.hadoop.yarn.server.resourcemanager.MockRM.<init>(MockRM.java:120)
at org.apache.hadoop.yarn.server.resourcemanager.MockRM.<init>(MockRM.java:113)
at org.apache.hadoop.yarn.server.resourcemanager.MockRM.<init>(MockRM.java:109)
at org.apache.hadoop.yarn.server.resourcemanager.scheduler.fair.TestFairScheduler.setUp(TestFairScheduler.java:122)
REGRESSION: org.apache.hadoop.yarn.server.resourcemanager.scheduler.fair.TestFairScheduler.testDRFHierarchicalQueues
Error Message:
org/apache/hadoop/yarn/server/applicationhistoryservice/ApplicationHistoryWriter
Stack Trace:
java.lang.NoClassDefFoundError: org/apache/hadoop/yarn/server/applicationhistoryservice/ApplicationHistoryWriter
at java.net.URLClassLoader$1.run(URLClassLoader.java:366)
at java.net.URLClassLoader$1.run(URLClassLoader.java:355)
at java.security.AccessController.doPrivileged(Native Method)
at java.net.URLClassLoader.findClass(URLClassLoader.java:354)
at java.lang.ClassLoader.loadClass(ClassLoader.java:425)
at sun.misc.Launcher$AppClassLoader.loadClass(Launcher.java:308)
at java.lang.ClassLoader.loadClass(ClassLoader.java:358)
at org.apache.hadoop.yarn.server.resourcemanager.ResourceManager.createRMApplicationHistoryWriter(ResourceManager.java:364)
at org.apache.hadoop.yarn.server.resourcemanager.ResourceManager.serviceInit(ResourceManager.java:262)
at org.apache.hadoop.service.AbstractService.init(AbstractService.java:163)
at org.apache.hadoop.yarn.server.resourcemanager.MockRM.<init>(MockRM.java:120)
at org.apache.hadoop.yarn.server.resourcemanager.MockRM.<init>(MockRM.java:113)
at org.apache.hadoop.yarn.server.resourcemanager.MockRM.<init>(MockRM.java:109)
at org.apache.hadoop.yarn.server.resourcemanager.scheduler.fair.TestFairScheduler.setUp(TestFairScheduler.java:122)
REGRESSION: org.apache.hadoop.yarn.server.resourcemanager.scheduler.fair.TestFairScheduler.testMaxRunningAppsHierarchicalQueues
Error Message:
org/apache/hadoop/yarn/server/applicationhistoryservice/ApplicationHistoryWriter
Stack Trace:
java.lang.NoClassDefFoundError: org/apache/hadoop/yarn/server/applicationhistoryservice/ApplicationHistoryWriter
at java.net.URLClassLoader$1.run(URLClassLoader.java:366)
at java.net.URLClassLoader$1.run(URLClassLoader.java:355)
at java.security.AccessController.doPrivileged(Native Method)
at java.net.URLClassLoader.findClass(URLClassLoader.java:354)
at java.lang.ClassLoader.loadClass(ClassLoader.java:425)
at sun.misc.Launcher$AppClassLoader.loadClass(Launcher.java:308)
at java.lang.ClassLoader.loadClass(ClassLoader.java:358)
at org.apache.hadoop.yarn.server.resourcemanager.ResourceManager.createRMApplicationHistoryWriter(ResourceManager.java:364)
at org.apache.hadoop.yarn.server.resourcemanager.ResourceManager.serviceInit(ResourceManager.java:262)
at org.apache.hadoop.service.AbstractService.init(AbstractService.java:163)
at org.apache.hadoop.yarn.server.resourcemanager.MockRM.<init>(MockRM.java:120)
at org.apache.hadoop.yarn.server.resourcemanager.MockRM.<init>(MockRM.java:113)
at org.apache.hadoop.yarn.server.resourcemanager.MockRM.<init>(MockRM.java:109)
at org.apache.hadoop.yarn.server.resourcemanager.scheduler.fair.TestFairScheduler.setUp(TestFairScheduler.java:122)
REGRESSION: org.apache.hadoop.yarn.server.resourcemanager.scheduler.fair.TestFairScheduler.testPreemptionDecision
Error Message:
org/apache/hadoop/yarn/server/applicationhistoryservice/ApplicationHistoryWriter
Stack Trace:
java.lang.NoClassDefFoundError: org/apache/hadoop/yarn/server/applicationhistoryservice/ApplicationHistoryWriter
at java.net.URLClassLoader$1.run(URLClassLoader.java:366)
at java.net.URLClassLoader$1.run(URLClassLoader.java:355)
at java.security.AccessController.doPrivileged(Native Method)
at java.net.URLClassLoader.findClass(URLClassLoader.java:354)
at java.lang.ClassLoader.loadClass(ClassLoader.java:425)
at sun.misc.Launcher$AppClassLoader.loadClass(Launcher.java:308)
at java.lang.ClassLoader.loadClass(ClassLoader.java:358)
at org.apache.hadoop.yarn.server.resourcemanager.ResourceManager.createRMApplicationHistoryWriter(ResourceManager.java:364)
at org.apache.hadoop.yarn.server.resourcemanager.ResourceManager.serviceInit(ResourceManager.java:262)
at org.apache.hadoop.service.AbstractService.init(AbstractService.java:163)
at org.apache.hadoop.yarn.server.resourcemanager.MockRM.<init>(MockRM.java:120)
at org.apache.hadoop.yarn.server.resourcemanager.MockRM.<init>(MockRM.java:113)
at org.apache.hadoop.yarn.server.resourcemanager.MockRM.<init>(MockRM.java:109)
at org.apache.hadoop.yarn.server.resourcemanager.scheduler.fair.TestFairScheduler.setUp(TestFairScheduler.java:122)
REGRESSION: org.apache.hadoop.yarn.server.resourcemanager.scheduler.fair.TestFairScheduler.testStrictLocality
Error Message:
org/apache/hadoop/yarn/server/applicationhistoryservice/ApplicationHistoryWriter
Stack Trace:
java.lang.NoClassDefFoundError: org/apache/hadoop/yarn/server/applicationhistoryservice/ApplicationHistoryWriter
at java.net.URLClassLoader$1.run(URLClassLoader.java:366)
at java.net.URLClassLoader$1.run(URLClassLoader.java:355)
at java.security.AccessController.doPrivileged(Native Method)
at java.net.URLClassLoader.findClass(URLClassLoader.java:354)
at java.lang.ClassLoader.loadClass(ClassLoader.java:425)
at sun.misc.Launcher$AppClassLoader.loadClass(Launcher.java:308)
at java.lang.ClassLoader.loadClass(ClassLoader.java:358)
at org.apache.hadoop.yarn.server.resourcemanager.ResourceManager.createRMApplicationHistoryWriter(ResourceManager.java:364)
at org.apache.hadoop.yarn.server.resourcemanager.ResourceManager.serviceInit(ResourceManager.java:262)
at org.apache.hadoop.service.AbstractService.init(AbstractService.java:163)
at org.apache.hadoop.yarn.server.resourcemanager.MockRM.<init>(MockRM.java:120)
at org.apache.hadoop.yarn.server.resourcemanager.MockRM.<init>(MockRM.java:113)
at org.apache.hadoop.yarn.server.resourcemanager.MockRM.<init>(MockRM.java:109)
at org.apache.hadoop.yarn.server.resourcemanager.scheduler.fair.TestFairScheduler.setUp(TestFairScheduler.java:122)
REGRESSION: org.apache.hadoop.yarn.server.resourcemanager.scheduler.fair.TestFairScheduler.testLoadConfigurationOnInitialize
Error Message:
org/apache/hadoop/yarn/server/applicationhistoryservice/ApplicationHistoryWriter
Stack Trace:
java.lang.NoClassDefFoundError: org/apache/hadoop/yarn/server/applicationhistoryservice/ApplicationHistoryWriter
at java.net.URLClassLoader$1.run(URLClassLoader.java:366)
at java.net.URLClassLoader$1.run(URLClassLoader.java:355)
at java.security.AccessController.doPrivileged(Native Method)
at java.net.URLClassLoader.findClass(URLClassLoader.java:354)
at java.lang.ClassLoader.loadClass(ClassLoader.java:425)
at sun.misc.Launcher$AppClassLoader.loadClass(Launcher.java:308)
at java.lang.ClassLoader.loadClass(ClassLoader.java:358)
at org.apache.hadoop.yarn.server.resourcemanager.ResourceManager.createRMApplicationHistoryWriter(ResourceManager.java:364)
at org.apache.hadoop.yarn.server.resourcemanager.ResourceManager.serviceInit(ResourceManager.java:262)
at org.apache.hadoop.service.AbstractService.init(AbstractService.java:163)
at org.apache.hadoop.yarn.server.resourcemanager.MockRM.<init>(MockRM.java:120)
at org.apache.hadoop.yarn.server.resourcemanager.MockRM.<init>(MockRM.java:113)
at org.apache.hadoop.yarn.server.resourcemanager.MockRM.<init>(MockRM.java:109)
at org.apache.hadoop.yarn.server.resourcemanager.scheduler.fair.TestFairScheduler.setUp(TestFairScheduler.java:122)
REGRESSION: org.apache.hadoop.yarn.server.resourcemanager.scheduler.fair.TestFairScheduler.testRemoveNodeUpdatesRootQueueMetrics
Error Message:
org/apache/hadoop/yarn/server/applicationhistoryservice/ApplicationHistoryWriter
Stack Trace:
java.lang.NoClassDefFoundError: org/apache/hadoop/yarn/server/applicationhistoryservice/ApplicationHistoryWriter
at java.net.URLClassLoader$1.run(URLClassLoader.java:366)
at java.net.URLClassLoader$1.run(URLClassLoader.java:355)
at java.security.AccessController.doPrivileged(Native Method)
at java.net.URLClassLoader.findClass(URLClassLoader.java:354)
at java.lang.ClassLoader.loadClass(ClassLoader.java:425)
at sun.misc.Launcher$AppClassLoader.loadClass(Launcher.java:308)
at java.lang.ClassLoader.loadClass(ClassLoader.java:358)
at org.apache.hadoop.yarn.server.resourcemanager.ResourceManager.createRMApplicationHistoryWriter(ResourceManager.java:364)
at org.apache.hadoop.yarn.server.resourcemanager.ResourceManager.serviceInit(ResourceManager.java:262)
at org.apache.hadoop.service.AbstractService.init(AbstractService.java:163)
at org.apache.hadoop.yarn.server.resourcemanager.MockRM.<init>(MockRM.java:120)
at org.apache.hadoop.yarn.server.resourcemanager.MockRM.<init>(MockRM.java:113)
at org.apache.hadoop.yarn.server.resourcemanager.MockRM.<init>(MockRM.java:109)
at org.apache.hadoop.yarn.server.resourcemanager.scheduler.fair.TestFairScheduler.setUp(TestFairScheduler.java:122)
REGRESSION: org.apache.hadoop.yarn.server.resourcemanager.scheduler.fair.TestFairScheduler.testContinuousScheduling
Error Message:
org/apache/hadoop/yarn/server/applicationhistoryservice/ApplicationHistoryWriter
Stack Trace:
java.lang.NoClassDefFoundError: org/apache/hadoop/yarn/server/applicationhistoryservice/ApplicationHistoryWriter
at java.net.URLClassLoader$1.run(URLClassLoader.java:366)
at java.net.URLClassLoader$1.run(URLClassLoader.java:355)
at java.security.AccessController.doPrivileged(Native Method)
at java.net.URLClassLoader.findClass(URLClassLoader.java:354)
at java.lang.ClassLoader.loadClass(ClassLoader.java:425)
at sun.misc.Launcher$AppClassLoader.loadClass(Launcher.java:308)
at java.lang.ClassLoader.loadClass(ClassLoader.java:358)
at org.apache.hadoop.yarn.server.resourcemanager.ResourceManager.createRMApplicationHistoryWriter(ResourceManager.java:364)
at org.apache.hadoop.yarn.server.resourcemanager.ResourceManager.serviceInit(ResourceManager.java:262)
at org.apache.hadoop.service.AbstractService.init(AbstractService.java:163)
at org.apache.hadoop.yarn.server.resourcemanager.MockRM.<init>(MockRM.java:120)
at org.apache.hadoop.yarn.server.resourcemanager.MockRM.<init>(MockRM.java:113)
at org.apache.hadoop.yarn.server.resourcemanager.MockRM.<init>(MockRM.java:109)
at org.apache.hadoop.yarn.server.resourcemanager.scheduler.fair.TestFairScheduler.setUp(TestFairScheduler.java:122)
REGRESSION: org.apache.hadoop.yarn.server.resourcemanager.scheduler.fair.TestFairScheduler.testHierarchicalQueueAllocationFileParsing
Error Message:
org/apache/hadoop/yarn/server/applicationhistoryservice/ApplicationHistoryWriter
Stack Trace:
java.lang.NoClassDefFoundError: org/apache/hadoop/yarn/server/applicationhistoryservice/ApplicationHistoryWriter
at java.net.URLClassLoader$1.run(URLClassLoader.java:366)
at java.net.URLClassLoader$1.run(URLClassLoader.java:355)
at java.security.AccessController.doPrivileged(Native Method)
at java.net.URLClassLoader.findClass(URLClassLoader.java:354)
at java.lang.ClassLoader.loadClass(ClassLoader.java:425)
at sun.misc.Launcher$AppClassLoader.loadClass(Launcher.java:308)
at java.lang.ClassLoader.loadClass(ClassLoader.java:358)
at org.apache.hadoop.yarn.server.resourcemanager.ResourceManager.createRMApplicationHistoryWriter(ResourceManager.java:364)
at org.apache.hadoop.yarn.server.resourcemanager.ResourceManager.serviceInit(ResourceManager.java:262)
at org.apache.hadoop.service.AbstractService.init(AbstractService.java:163)
at org.apache.hadoop.yarn.server.resourcemanager.MockRM.<init>(MockRM.java:120)
at org.apache.hadoop.yarn.server.resourcemanager.MockRM.<init>(MockRM.java:113)
at org.apache.hadoop.yarn.server.resourcemanager.MockRM.<init>(MockRM.java:109)
at org.apache.hadoop.yarn.server.resourcemanager.scheduler.fair.TestFairScheduler.setUp(TestFairScheduler.java:122)
REGRESSION: org.apache.hadoop.yarn.server.resourcemanager.scheduler.fair.TestFairScheduler.testMaxAssign
Error Message:
org/apache/hadoop/yarn/server/applicationhistoryservice/ApplicationHistoryWriter
Stack Trace:
java.lang.NoClassDefFoundError: org/apache/hadoop/yarn/server/applicationhistoryservice/ApplicationHistoryWriter
at java.net.URLClassLoader$1.run(URLClassLoader.java:366)
at java.net.URLClassLoader$1.run(URLClassLoader.java:355)
at java.security.AccessController.doPrivileged(Native Method)
at java.net.URLClassLoader.findClass(URLClassLoader.java:354)
at java.lang.ClassLoader.loadClass(ClassLoader.java:425)
at sun.misc.Launcher$AppClassLoader.loadClass(Launcher.java:308)
at java.lang.ClassLoader.loadClass(ClassLoader.java:358)
at org.apache.hadoop.yarn.server.resourcemanager.ResourceManager.createRMApplicationHistoryWriter(ResourceManager.java:364)
at org.apache.hadoop.yarn.server.resourcemanager.ResourceManager.serviceInit(ResourceManager.java:262)
at org.apache.hadoop.service.AbstractService.init(AbstractService.java:163)
at org.apache.hadoop.yarn.server.resourcemanager.MockRM.<init>(MockRM.java:120)
at org.apache.hadoop.yarn.server.resourcemanager.MockRM.<init>(MockRM.java:113)
at org.apache.hadoop.yarn.server.resourcemanager.MockRM.<init>(MockRM.java:109)
at org.apache.hadoop.yarn.server.resourcemanager.scheduler.fair.TestFairScheduler.setUp(TestFairScheduler.java:122)
REGRESSION: org.apache.hadoop.yarn.server.resourcemanager.scheduler.fair.TestFairScheduler.testThreadLifeCycle
Error Message:
org/apache/hadoop/yarn/server/applicationhistoryservice/ApplicationHistoryWriter
Stack Trace:
java.lang.NoClassDefFoundError: org/apache/hadoop/yarn/server/applicationhistoryservice/ApplicationHistoryWriter
at java.net.URLClassLoader$1.run(URLClassLoader.java:366)
at java.net.URLClassLoader$1.run(URLClassLoader.java:355)
at java.security.AccessController.doPrivileged(Native Method)
at java.net.URLClassLoader.findClass(URLClassLoader.java:354)
at java.lang.ClassLoader.loadClass(ClassLoader.java:425)
at sun.misc.Launcher$AppClassLoader.loadClass(Launcher.java:308)
at java.lang.ClassLoader.loadClass(ClassLoader.java:358)
at org.apache.hadoop.yarn.server.resourcemanager.ResourceManager.createRMApplicationHistoryWriter(ResourceManager.java:364)
at org.apache.hadoop.yarn.server.resourcemanager.ResourceManager.serviceInit(ResourceManager.java:262)
at org.apache.hadoop.service.AbstractService.init(AbstractService.java:163)
at org.apache.hadoop.yarn.server.resourcemanager.MockRM.<init>(MockRM.java:120)
at org.apache.hadoop.yarn.server.resourcemanager.MockRM.<init>(MockRM.java:113)
at org.apache.hadoop.yarn.server.resourcemanager.MockRM.<init>(MockRM.java:109)
at org.apache.hadoop.yarn.server.resourcemanager.scheduler.fair.TestFairScheduler.setUp(TestFairScheduler.java:122)
REGRESSION: org.apache.hadoop.yarn.server.resourcemanager.scheduler.fair.TestFairScheduler.testAssignToNonLeafQueueReturnsNull
Error Message:
org/apache/hadoop/yarn/server/applicationhistoryservice/ApplicationHistoryWriter
Stack Trace:
java.lang.NoClassDefFoundError: org/apache/hadoop/yarn/server/applicationhistoryservice/ApplicationHistoryWriter
at java.net.URLClassLoader$1.run(URLClassLoader.java:366)
at java.net.URLClassLoader$1.run(URLClassLoader.java:355)
at java.security.AccessController.doPrivileged(Native Method)
at java.net.URLClassLoader.findClass(URLClassLoader.java:354)
at java.lang.ClassLoader.loadClass(ClassLoader.java:425)
at sun.misc.Launcher$AppClassLoader.loadClass(Launcher.java:308)
at java.lang.ClassLoader.loadClass(ClassLoader.java:358)
at org.apache.hadoop.yarn.server.resourcemanager.ResourceManager.createRMApplicationHistoryWriter(ResourceManager.java:364)
at org.apache.hadoop.yarn.server.resourcemanager.ResourceManager.serviceInit(ResourceManager.java:262)
at org.apache.hadoop.service.AbstractService.init(AbstractService.java:163)
at org.apache.hadoop.yarn.server.resourcemanager.MockRM.<init>(MockRM.java:120)
at org.apache.hadoop.yarn.server.resourcemanager.MockRM.<init>(MockRM.java:113)
at org.apache.hadoop.yarn.server.resourcemanager.MockRM.<init>(MockRM.java:109)
at org.apache.hadoop.yarn.server.resourcemanager.scheduler.fair.TestFairScheduler.setUp(TestFairScheduler.java:122)
REGRESSION: org.apache.hadoop.yarn.server.resourcemanager.scheduler.fair.TestFairScheduler.testContainerReservationAttemptExceedingQueueMax
Error Message:
org/apache/hadoop/yarn/server/applicationhistoryservice/ApplicationHistoryWriter
Stack Trace:
java.lang.NoClassDefFoundError: org/apache/hadoop/yarn/server/applicationhistoryservice/ApplicationHistoryWriter
at java.net.URLClassLoader$1.run(URLClassLoader.java:366)
at java.net.URLClassLoader$1.run(URLClassLoader.java:355)
at java.security.AccessController.doPrivileged(Native Method)
at java.net.URLClassLoader.findClass(URLClassLoader.java:354)
at java.lang.ClassLoader.loadClass(ClassLoader.java:425)
at sun.misc.Launcher$AppClassLoader.loadClass(Launcher.java:308)
at java.lang.ClassLoader.loadClass(ClassLoader.java:358)
at org.apache.hadoop.yarn.server.resourcemanager.ResourceManager.createRMApplicationHistoryWriter(ResourceManager.java:364)
at org.apache.hadoop.yarn.server.resourcemanager.ResourceManager.serviceInit(ResourceManager.java:262)
at org.apache.hadoop.service.AbstractService.init(AbstractService.java:163)
at org.apache.hadoop.yarn.server.resourcemanager.MockRM.<init>(MockRM.java:120)
at org.apache.hadoop.yarn.server.resourcemanager.MockRM.<init>(MockRM.java:113)
at org.apache.hadoop.yarn.server.resourcemanager.MockRM.<init>(MockRM.java:109)
at org.apache.hadoop.yarn.server.resourcemanager.scheduler.fair.TestFairScheduler.setUp(TestFairScheduler.java:122)
REGRESSION: org.apache.hadoop.yarn.server.resourcemanager.scheduler.fair.TestFairScheduler.testHierarchicalQueuesSimilarParents
Error Message:
org/apache/hadoop/yarn/server/applicationhistoryservice/ApplicationHistoryWriter
Stack Trace:
java.lang.NoClassDefFoundError: org/apache/hadoop/yarn/server/applicationhistoryservice/ApplicationHistoryWriter
at java.net.URLClassLoader$1.run(URLClassLoader.java:366)
at java.net.URLClassLoader$1.run(URLClassLoader.java:355)
at java.security.AccessController.doPrivileged(Native Method)
at java.net.URLClassLoader.findClass(URLClassLoader.java:354)
at java.lang.ClassLoader.loadClass(ClassLoader.java:425)
at sun.misc.Launcher$AppClassLoader.loadClass(Launcher.java:308)
at java.lang.ClassLoader.loadClass(ClassLoader.java:358)
at org.apache.hadoop.yarn.server.resourcemanager.ResourceManager.createRMApplicationHistoryWriter(ResourceManager.java:364)
at org.apache.hadoop.yarn.server.resourcemanager.ResourceManager.serviceInit(ResourceManager.java:262)
at org.apache.hadoop.service.AbstractService.init(AbstractService.java:163)
at org.apache.hadoop.yarn.server.resourcemanager.MockRM.<init>(MockRM.java:120)
at org.apache.hadoop.yarn.server.resourcemanager.MockRM.<init>(MockRM.java:113)
at org.apache.hadoop.yarn.server.resourcemanager.MockRM.<init>(MockRM.java:109)
at org.apache.hadoop.yarn.server.resourcemanager.scheduler.fair.TestFairScheduler.setUp(TestFairScheduler.java:122)
REGRESSION: org.apache.hadoop.yarn.server.resourcemanager.scheduler.fair.TestFairScheduler.testQueueDemandCalculation
Error Message:
org/apache/hadoop/yarn/server/applicationhistoryservice/ApplicationHistoryWriter
Stack Trace:
java.lang.NoClassDefFoundError: org/apache/hadoop/yarn/server/applicationhistoryservice/ApplicationHistoryWriter
at java.net.URLClassLoader$1.run(URLClassLoader.java:366)
at java.net.URLClassLoader$1.run(URLClassLoader.java:355)
at java.security.AccessController.doPrivileged(Native Method)
at java.net.URLClassLoader.findClass(URLClassLoader.java:354)
at java.lang.ClassLoader.loadClass(ClassLoader.java:425)
at sun.misc.Launcher$AppClassLoader.loadClass(Launcher.java:308)
at java.lang.ClassLoader.loadClass(ClassLoader.java:358)
at org.apache.hadoop.yarn.server.resourcemanager.ResourceManager.createRMApplicationHistoryWriter(ResourceManager.java:364)
at org.apache.hadoop.yarn.server.resourcemanager.ResourceManager.serviceInit(ResourceManager.java:262)
at org.apache.hadoop.service.AbstractService.init(AbstractService.java:163)
at org.apache.hadoop.yarn.server.resourcemanager.MockRM.<init>(MockRM.java:120)
at org.apache.hadoop.yarn.server.resourcemanager.MockRM.<init>(MockRM.java:113)
at org.apache.hadoop.yarn.server.resourcemanager.MockRM.<init>(MockRM.java:109)
at org.apache.hadoop.yarn.server.resourcemanager.scheduler.fair.TestFairScheduler.setUp(TestFairScheduler.java:122)
REGRESSION: org.apache.hadoop.yarn.server.resourcemanager.scheduler.fair.TestFairScheduler.testAssignContainer
Error Message:
org/apache/hadoop/yarn/server/applicationhistoryservice/ApplicationHistoryWriter
Stack Trace:
java.lang.NoClassDefFoundError: org/apache/hadoop/yarn/server/applicationhistoryservice/ApplicationHistoryWriter
at java.net.URLClassLoader$1.run(URLClassLoader.java:366)
at java.net.URLClassLoader$1.run(URLClassLoader.java:355)
at java.security.AccessController.doPrivileged(Native Method)
at java.net.URLClassLoader.findClass(URLClassLoader.java:354)
at java.lang.ClassLoader.loadClass(ClassLoader.java:425)
at sun.misc.Launcher$AppClassLoader.loadClass(Launcher.java:308)
at java.lang.ClassLoader.loadClass(ClassLoader.java:358)
at org.apache.hadoop.yarn.server.resourcemanager.ResourceManager.createRMApplicationHistoryWriter(ResourceManager.java:364)
at org.apache.hadoop.yarn.server.resourcemanager.ResourceManager.serviceInit(ResourceManager.java:262)
at org.apache.hadoop.service.AbstractService.init(AbstractService.java:163)
at org.apache.hadoop.yarn.server.resourcemanager.MockRM.<init>(MockRM.java:120)
at org.apache.hadoop.yarn.server.resourcemanager.MockRM.<init>(MockRM.java:113)
at org.apache.hadoop.yarn.server.resourcemanager.MockRM.<init>(MockRM.java:109)
at org.apache.hadoop.yarn.server.resourcemanager.scheduler.fair.TestFairScheduler.setUp(TestFairScheduler.java:122)
REGRESSION: org.apache.hadoop.yarn.server.resourcemanager.scheduler.fair.TestFairScheduler.testNestedUserQueue
Error Message:
org/apache/hadoop/yarn/server/applicationhistoryservice/ApplicationHistoryWriter
Stack Trace:
java.lang.NoClassDefFoundError: org/apache/hadoop/yarn/server/applicationhistoryservice/ApplicationHistoryWriter
at java.net.URLClassLoader$1.run(URLClassLoader.java:366)
at java.net.URLClassLoader$1.run(URLClassLoader.java:355)
at java.security.AccessController.doPrivileged(Native Method)
at java.net.URLClassLoader.findClass(URLClassLoader.java:354)
at java.lang.ClassLoader.loadClass(ClassLoader.java:425)
at sun.misc.Launcher$AppClassLoader.loadClass(Launcher.java:308)
at java.lang.ClassLoader.loadClass(ClassLoader.java:358)
at org.apache.hadoop.yarn.server.resourcemanager.ResourceManager.createRMApplicationHistoryWriter(ResourceManager.java:364)
at org.apache.hadoop.yarn.server.resourcemanager.ResourceManager.serviceInit(ResourceManager.java:262)
at org.apache.hadoop.service.AbstractService.init(AbstractService.java:163)
at org.apache.hadoop.yarn.server.resourcemanager.MockRM.<init>(MockRM.java:120)
at org.apache.hadoop.yarn.server.resourcemanager.MockRM.<init>(MockRM.java:113)
at org.apache.hadoop.yarn.server.resourcemanager.MockRM.<init>(MockRM.java:109)
at org.apache.hadoop.yarn.server.resourcemanager.scheduler.fair.TestFairScheduler.setUp(TestFairScheduler.java:122)
REGRESSION: org.apache.hadoop.yarn.server.resourcemanager.scheduler.fair.TestFairScheduler.testFairShareWithNoneZeroWeightNoneZeroMinRes
Error Message:
org/apache/hadoop/yarn/server/applicationhistoryservice/ApplicationHistoryWriter
Stack Trace:
java.lang.NoClassDefFoundError: org/apache/hadoop/yarn/server/applicationhistoryservice/ApplicationHistoryWriter
at java.net.URLClassLoader$1.run(URLClassLoader.java:366)
at java.net.URLClassLoader$1.run(URLClassLoader.java:355)
at java.security.AccessController.doPrivileged(Native Method)
at java.net.URLClassLoader.findClass(URLClassLoader.java:354)
at java.lang.ClassLoader.loadClass(ClassLoader.java:425)
at sun.misc.Launcher$AppClassLoader.loadClass(Launcher.java:308)
at java.lang.ClassLoader.loadClass(ClassLoader.java:358)
at org.apache.hadoop.yarn.server.resourcemanager.ResourceManager.createRMApplicationHistoryWriter(ResourceManager.java:364)
at org.apache.hadoop.yarn.server.resourcemanager.ResourceManager.serviceInit(ResourceManager.java:262)
at org.apache.hadoop.service.AbstractService.init(AbstractService.java:163)
at org.apache.hadoop.yarn.server.resourcemanager.MockRM.<init>(MockRM.java:120)
at org.apache.hadoop.yarn.server.resourcemanager.MockRM.<init>(MockRM.java:113)
at org.apache.hadoop.yarn.server.resourcemanager.MockRM.<init>(MockRM.java:109)
at org.apache.hadoop.yarn.server.resourcemanager.scheduler.fair.TestFairScheduler.setUp(TestFairScheduler.java:122)
REGRESSION: org.apache.hadoop.yarn.server.resourcemanager.scheduler.fair.TestFairScheduler.testPerfMetricsInited
Error Message:
org/apache/hadoop/yarn/server/applicationhistoryservice/ApplicationHistoryWriter
Stack Trace:
java.lang.NoClassDefFoundError: org/apache/hadoop/yarn/server/applicationhistoryservice/ApplicationHistoryWriter
at java.net.URLClassLoader$1.run(URLClassLoader.java:366)
at java.net.URLClassLoader$1.run(URLClassLoader.java:355)
at java.security.AccessController.doPrivileged(Native Method)
at java.net.URLClassLoader.findClass(URLClassLoader.java:354)
at java.lang.ClassLoader.loadClass(ClassLoader.java:425)
at sun.misc.Launcher$AppClassLoader.loadClass(Launcher.java:308)
at java.lang.ClassLoader.loadClass(ClassLoader.java:358)
at org.apache.hadoop.yarn.server.resourcemanager.ResourceManager.createRMApplicationHistoryWriter(ResourceManager.java:364)
at org.apache.hadoop.yarn.server.resourcemanager.ResourceManager.serviceInit(ResourceManager.java:262)
at org.apache.hadoop.service.AbstractService.init(AbstractService.java:163)
at org.apache.hadoop.yarn.server.resourcemanager.MockRM.<init>(MockRM.java:120)
at org.apache.hadoop.yarn.server.resourcemanager.MockRM.<init>(MockRM.java:113)
at org.apache.hadoop.yarn.server.resourcemanager.MockRM.<init>(MockRM.java:109)
at org.apache.hadoop.yarn.server.resourcemanager.scheduler.fair.TestFairScheduler.setUp(TestFairScheduler.java:122)
REGRESSION: org.apache.hadoop.yarn.server.resourcemanager.scheduler.fair.TestFairScheduler.testMoveToNonexistentQueue
Error Message:
org/apache/hadoop/yarn/server/applicationhistoryservice/ApplicationHistoryWriter
Stack Trace:
java.lang.NoClassDefFoundError: org/apache/hadoop/yarn/server/applicationhistoryservice/ApplicationHistoryWriter
at java.net.URLClassLoader$1.run(URLClassLoader.java:366)
at java.net.URLClassLoader$1.run(URLClassLoader.java:355)
at java.security.AccessController.doPrivileged(Native Method)
at java.net.URLClassLoader.findClass(URLClassLoader.java:354)
at java.lang.ClassLoader.loadClass(ClassLoader.java:425)
at sun.misc.Launcher$AppClassLoader.loadClass(Launcher.java:308)
at java.lang.ClassLoader.loadClass(ClassLoader.java:358)
at org.apache.hadoop.yarn.server.resourcemanager.ResourceManager.createRMApplicationHistoryWriter(ResourceManager.java:364)
at org.apache.hadoop.yarn.server.resourcemanager.ResourceManager.serviceInit(ResourceManager.java:262)
at org.apache.hadoop.service.AbstractService.init(AbstractService.java:163)
at org.apache.hadoop.yarn.server.resourcemanager.MockRM.<init>(MockRM.java:120)
at org.apache.hadoop.yarn.server.resourcemanager.MockRM.<init>(MockRM.java:113)
at org.apache.hadoop.yarn.server.resourcemanager.MockRM.<init>(MockRM.java:109)
at org.apache.hadoop.yarn.server.resourcemanager.scheduler.fair.TestFairScheduler.setUp(TestFairScheduler.java:122)
REGRESSION: org.apache.hadoop.yarn.server.resourcemanager.scheduler.fair.TestFairScheduler.testNotAllowSubmitApplication
Error Message:
org/apache/hadoop/yarn/server/applicationhistoryservice/ApplicationHistoryWriter
Stack Trace:
java.lang.NoClassDefFoundError: org/apache/hadoop/yarn/server/applicationhistoryservice/ApplicationHistoryWriter
at java.net.URLClassLoader$1.run(URLClassLoader.java:366)
at java.net.URLClassLoader$1.run(URLClassLoader.java:355)
at java.security.AccessController.doPrivileged(Native Method)
at java.net.URLClassLoader.findClass(URLClassLoader.java:354)
at java.lang.ClassLoader.loadClass(ClassLoader.java:425)
at sun.misc.Launcher$AppClassLoader.loadClass(Launcher.java:308)
at java.lang.ClassLoader.loadClass(ClassLoader.java:358)
at org.apache.hadoop.yarn.server.resourcemanager.ResourceManager.createRMApplicationHistoryWriter(ResourceManager.java:364)
at org.apache.hadoop.yarn.server.resourcemanager.ResourceManager.serviceInit(ResourceManager.java:262)
at org.apache.hadoop.service.AbstractService.init(AbstractService.java:163)
at org.apache.hadoop.yarn.server.resourcemanager.MockRM.<init>(MockRM.java:120)
at org.apache.hadoop.yarn.server.resourcemanager.MockRM.<init>(MockRM.java:113)
at org.apache.hadoop.yarn.server.resourcemanager.MockRM.<init>(MockRM.java:109)
at org.apache.hadoop.yarn.server.resourcemanager.scheduler.fair.TestFairScheduler.setUp(TestFairScheduler.java:122)
REGRESSION: org.apache.hadoop.yarn.server.resourcemanager.scheduler.fair.TestFairScheduler.testHostPortNodeName
Error Message:
org/apache/hadoop/yarn/server/applicationhistoryservice/ApplicationHistoryWriter
Stack Trace:
java.lang.NoClassDefFoundError: org/apache/hadoop/yarn/server/applicationhistoryservice/ApplicationHistoryWriter
at java.net.URLClassLoader$1.run(URLClassLoader.java:366)
at java.net.URLClassLoader$1.run(URLClassLoader.java:355)
at java.security.AccessController.doPrivileged(Native Method)
at java.net.URLClassLoader.findClass(URLClassLoader.java:354)
at java.lang.ClassLoader.loadClass(ClassLoader.java:425)
at sun.misc.Launcher$AppClassLoader.loadClass(Launcher.java:308)
at java.lang.ClassLoader.loadClass(ClassLoader.java:358)
at org.apache.hadoop.yarn.server.resourcemanager.ResourceManager.createRMApplicationHistoryWriter(ResourceManager.java:364)
at org.apache.hadoop.yarn.server.resourcemanager.ResourceManager.serviceInit(ResourceManager.java:262)
at org.apache.hadoop.service.AbstractService.init(AbstractService.java:163)
at org.apache.hadoop.yarn.server.resourcemanager.MockRM.<init>(MockRM.java:120)
at org.apache.hadoop.yarn.server.resourcemanager.MockRM.<init>(MockRM.java:113)
at org.apache.hadoop.yarn.server.resourcemanager.MockRM.<init>(MockRM.java:109)
at org.apache.hadoop.yarn.server.resourcemanager.scheduler.fair.TestFairScheduler.setUp(TestFairScheduler.java:122)
REGRESSION: org.apache.hadoop.yarn.server.resourcemanager.scheduler.fair.TestFairScheduler.testBlacklistNodes
Error Message:
org/apache/hadoop/yarn/server/applicationhistoryservice/ApplicationHistoryWriter
Stack Trace:
java.lang.NoClassDefFoundError: org/apache/hadoop/yarn/server/applicationhistoryservice/ApplicationHistoryWriter
at java.net.URLClassLoader$1.run(URLClassLoader.java:366)
at java.net.URLClassLoader$1.run(URLClassLoader.java:355)
at java.security.AccessController.doPrivileged(Native Method)
at java.net.URLClassLoader.findClass(URLClassLoader.java:354)
at java.lang.ClassLoader.loadClass(ClassLoader.java:425)
at sun.misc.Launcher$AppClassLoader.loadClass(Launcher.java:308)
at java.lang.ClassLoader.loadClass(ClassLoader.java:358)
at org.apache.hadoop.yarn.server.resourcemanager.ResourceManager.createRMApplicationHistoryWriter(ResourceManager.java:364)
at org.apache.hadoop.yarn.server.resourcemanager.ResourceManager.serviceInit(ResourceManager.java:262)
at org.apache.hadoop.service.AbstractService.init(AbstractService.java:163)
at org.apache.hadoop.yarn.server.resourcemanager.MockRM.<init>(MockRM.java:120)
at org.apache.hadoop.yarn.server.resourcemanager.MockRM.<init>(MockRM.java:113)
at org.apache.hadoop.yarn.server.resourcemanager.MockRM.<init>(MockRM.java:109)
at org.apache.hadoop.yarn.server.resourcemanager.scheduler.fair.TestFairScheduler.setUp(TestFairScheduler.java:122)
REGRESSION: org.apache.hadoop.yarn.server.resourcemanager.scheduler.fair.TestFairScheduler.testSimpleHierarchicalFairShareCalculation
Error Message:
org/apache/hadoop/yarn/server/applicationhistoryservice/ApplicationHistoryWriter
Stack Trace:
java.lang.NoClassDefFoundError: org/apache/hadoop/yarn/server/applicationhistoryservice/ApplicationHistoryWriter
at java.net.URLClassLoader$1.run(URLClassLoader.java:366)
at java.net.URLClassLoader$1.run(URLClassLoader.java:355)
at java.security.AccessController.doPrivileged(Native Method)
at java.net.URLClassLoader.findClass(URLClassLoader.java:354)
at java.lang.ClassLoader.loadClass(ClassLoader.java:425)
at sun.misc.Launcher$AppClassLoader.loadClass(Launcher.java:308)
at java.lang.ClassLoader.loadClass(ClassLoader.java:358)
at org.apache.hadoop.yarn.server.resourcemanager.ResourceManager.createRMApplicationHistoryWriter(ResourceManager.java:364)
at org.apache.hadoop.yarn.server.resourcemanager.ResourceManager.serviceInit(ResourceManager.java:262)
at org.apache.hadoop.service.AbstractService.init(AbstractService.java:163)
at org.apache.hadoop.yarn.server.resourcemanager.MockRM.<init>(MockRM.java:120)
at org.apache.hadoop.yarn.server.resourcemanager.MockRM.<init>(MockRM.java:113)
at org.apache.hadoop.yarn.server.resourcemanager.MockRM.<init>(MockRM.java:109)
at org.apache.hadoop.yarn.server.resourcemanager.scheduler.fair.TestFairScheduler.setUp(TestFairScheduler.java:122)
REGRESSION: org.apache.hadoop.yarn.server.resourcemanager.scheduler.fair.TestFairScheduler.testPreemptionIsNotDelayedToNextRound
Error Message:
org/apache/hadoop/yarn/server/applicationhistoryservice/ApplicationHistoryWriter
Stack Trace:
java.lang.NoClassDefFoundError: org/apache/hadoop/yarn/server/applicationhistoryservice/ApplicationHistoryWriter
at java.net.URLClassLoader$1.run(URLClassLoader.java:366)
at java.net.URLClassLoader$1.run(URLClassLoader.java:355)
at java.security.AccessController.doPrivileged(Native Method)
at java.net.URLClassLoader.findClass(URLClassLoader.java:354)
at java.lang.ClassLoader.loadClass(ClassLoader.java:425)
at sun.misc.Launcher$AppClassLoader.loadClass(Launcher.java:308)
at java.lang.ClassLoader.loadClass(ClassLoader.java:358)
at org.apache.hadoop.yarn.server.resourcemanager.ResourceManager.createRMApplicationHistoryWriter(ResourceManager.java:364)
at org.apache.hadoop.yarn.server.resourcemanager.ResourceManager.serviceInit(ResourceManager.java:262)
at org.apache.hadoop.service.AbstractService.init(AbstractService.java:163)
at org.apache.hadoop.yarn.server.resourcemanager.MockRM.<init>(MockRM.java:120)
at org.apache.hadoop.yarn.server.resourcemanager.MockRM.<init>(MockRM.java:113)
at org.apache.hadoop.yarn.server.resourcemanager.MockRM.<init>(MockRM.java:109)
at org.apache.hadoop.yarn.server.resourcemanager.scheduler.fair.TestFairScheduler.setUp(TestFairScheduler.java:122)
REGRESSION: org.apache.hadoop.yarn.server.resourcemanager.scheduler.fair.TestFairScheduler.testAddAndRemoveAppFromFairScheduler
Error Message:
org/apache/hadoop/yarn/server/applicationhistoryservice/ApplicationHistoryWriter
Stack Trace:
java.lang.NoClassDefFoundError: org/apache/hadoop/yarn/server/applicationhistoryservice/ApplicationHistoryWriter
at java.net.URLClassLoader$1.run(URLClassLoader.java:366)
at java.net.URLClassLoader$1.run(URLClassLoader.java:355)
at java.security.AccessController.doPrivileged(Native Method)
at java.net.URLClassLoader.findClass(URLClassLoader.java:354)
at java.lang.ClassLoader.loadClass(ClassLoader.java:425)
at sun.misc.Launcher$AppClassLoader.loadClass(Launcher.java:308)
at java.lang.ClassLoader.loadClass(ClassLoader.java:358)
at org.apache.hadoop.yarn.server.resourcemanager.ResourceManager.createRMApplicationHistoryWriter(ResourceManager.java:364)
at org.apache.hadoop.yarn.server.resourcemanager.ResourceManager.serviceInit(ResourceManager.java:262)
at org.apache.hadoop.service.AbstractService.init(AbstractService.java:163)
at org.apache.hadoop.yarn.server.resourcemanager.MockRM.<init>(MockRM.java:120)
at org.apache.hadoop.yarn.server.resourcemanager.MockRM.<init>(MockRM.java:113)
at org.apache.hadoop.yarn.server.resourcemanager.MockRM.<init>(MockRM.java:109)
at org.apache.hadoop.yarn.server.resourcemanager.scheduler.fair.TestFairScheduler.setUp(TestFairScheduler.java:122)
REGRESSION: org.apache.hadoop.yarn.server.resourcemanager.scheduler.fair.TestFairScheduler.testFairShareAndWeightsInNestedUserQueueRule
Error Message:
org/apache/hadoop/yarn/server/applicationhistoryservice/ApplicationHistoryWriter
Stack Trace:
java.lang.NoClassDefFoundError: org/apache/hadoop/yarn/server/applicationhistoryservice/ApplicationHistoryWriter
at java.net.URLClassLoader$1.run(URLClassLoader.java:366)
at java.net.URLClassLoader$1.run(URLClassLoader.java:355)
at java.security.AccessController.doPrivileged(Native Method)
at java.net.URLClassLoader.findClass(URLClassLoader.java:354)
at java.lang.ClassLoader.loadClass(ClassLoader.java:425)
at sun.misc.Launcher$AppClassLoader.loadClass(Launcher.java:308)
at java.lang.ClassLoader.loadClass(ClassLoader.java:358)
at org.apache.hadoop.yarn.server.resourcemanager.ResourceManager.createRMApplicationHistoryWriter(ResourceManager.java:364)
at org.apache.hadoop.yarn.server.resourcemanager.ResourceManager.serviceInit(ResourceManager.java:262)
at org.apache.hadoop.service.AbstractService.init(AbstractService.java:163)
at org.apache.hadoop.yarn.server.resourcemanager.MockRM.<init>(MockRM.java:120)
at org.apache.hadoop.yarn.server.resourcemanager.MockRM.<init>(MockRM.java:113)
at org.apache.hadoop.yarn.server.resourcemanager.MockRM.<init>(MockRM.java:109)
at org.apache.hadoop.yarn.server.resourcemanager.scheduler.fair.TestFairScheduler.setUp(TestFairScheduler.java:122)
REGRESSION: org.apache.hadoop.yarn.server.resourcemanager.scheduler.fair.TestFairScheduler.testSimpleContainerAllocation
Error Message:
org/apache/hadoop/yarn/server/applicationhistoryservice/ApplicationHistoryWriter
Stack Trace:
java.lang.NoClassDefFoundError: org/apache/hadoop/yarn/server/applicationhistoryservice/ApplicationHistoryWriter
at java.net.URLClassLoader$1.run(URLClassLoader.java:366)
at java.net.URLClassLoader$1.run(URLClassLoader.java:355)
at java.security.AccessController.doPrivileged(Native Method)
at java.net.URLClassLoader.findClass(URLClassLoader.java:354)
at java.lang.ClassLoader.loadClass(ClassLoader.java:425)
at sun.misc.Launcher$AppClassLoader.loadClass(Launcher.java:308)
at java.lang.ClassLoader.loadClass(ClassLoader.java:358)
at org.apache.hadoop.yarn.server.resourcemanager.ResourceManager.createRMApplicationHistoryWriter(ResourceManager.java:364)
at org.apache.hadoop.yarn.server.resourcemanager.ResourceManager.serviceInit(ResourceManager.java:262)
at org.apache.hadoop.service.AbstractService.init(AbstractService.java:163)
at org.apache.hadoop.yarn.server.resourcemanager.MockRM.<init>(MockRM.java:120)
at org.apache.hadoop.yarn.server.resourcemanager.MockRM.<init>(MockRM.java:113)
at org.apache.hadoop.yarn.server.resourcemanager.MockRM.<init>(MockRM.java:109)
at org.apache.hadoop.yarn.server.resourcemanager.scheduler.fair.TestFairScheduler.setUp(TestFairScheduler.java:122)
REGRESSION: org.apache.hadoop.yarn.server.resourcemanager.scheduler.fair.TestFairScheduler.testMultipleContainersWaitingForReservation
Error Message:
org/apache/hadoop/yarn/server/applicationhistoryservice/ApplicationHistoryWriter
Stack Trace:
java.lang.NoClassDefFoundError: org/apache/hadoop/yarn/server/applicationhistoryservice/ApplicationHistoryWriter
at java.net.URLClassLoader$1.run(URLClassLoader.java:366)
at java.net.URLClassLoader$1.run(URLClassLoader.java:355)
at java.security.AccessController.doPrivileged(Native Method)
at java.net.URLClassLoader.findClass(URLClassLoader.java:354)
at java.lang.ClassLoader.loadClass(ClassLoader.java:425)
at sun.misc.Launcher$AppClassLoader.loadClass(Launcher.java:308)
at java.lang.ClassLoader.loadClass(ClassLoader.java:358)
at org.apache.hadoop.yarn.server.resourcemanager.ResourceManager.createRMApplicationHistoryWriter(ResourceManager.java:364)
at org.apache.hadoop.yarn.server.resourcemanager.ResourceManager.serviceInit(ResourceManager.java:262)
at org.apache.hadoop.service.AbstractService.init(AbstractService.java:163)
at org.apache.hadoop.yarn.server.resourcemanager.MockRM.<init>(MockRM.java:120)
at org.apache.hadoop.yarn.server.resourcemanager.MockRM.<init>(MockRM.java:113)
at org.apache.hadoop.yarn.server.resourcemanager.MockRM.<init>(MockRM.java:109)
at org.apache.hadoop.yarn.server.resourcemanager.scheduler.fair.TestFairScheduler.setUp(TestFairScheduler.java:122)
REGRESSION: org.apache.hadoop.yarn.server.resourcemanager.scheduler.fair.TestFairScheduler.testBasicDRFAssignment
Error Message:
org/apache/hadoop/yarn/server/applicationhistoryservice/ApplicationHistoryWriter
Stack Trace:
java.lang.NoClassDefFoundError: org/apache/hadoop/yarn/server/applicationhistoryservice/ApplicationHistoryWriter
at java.net.URLClassLoader$1.run(URLClassLoader.java:366)
at java.net.URLClassLoader$1.run(URLClassLoader.java:355)
at java.security.AccessController.doPrivileged(Native Method)
at java.net.URLClassLoader.findClass(URLClassLoader.java:354)
at java.lang.ClassLoader.loadClass(ClassLoader.java:425)
at sun.misc.Launcher$AppClassLoader.loadClass(Launcher.java:308)
at java.lang.ClassLoader.loadClass(ClassLoader.java:358)
at org.apache.hadoop.yarn.server.resourcemanager.ResourceManager.createRMApplicationHistoryWriter(ResourceManager.java:364)
at org.apache.hadoop.yarn.server.resourcemanager.ResourceManager.serviceInit(ResourceManager.java:262)
at org.apache.hadoop.service.AbstractService.init(AbstractService.java:163)
at org.apache.hadoop.yarn.server.resourcemanager.MockRM.<init>(MockRM.java:120)
at org.apache.hadoop.yarn.server.resourcemanager.MockRM.<init>(MockRM.java:113)
at org.apache.hadoop.yarn.server.resourcemanager.MockRM.<init>(MockRM.java:109)
at org.apache.hadoop.yarn.server.resourcemanager.scheduler.fair.TestFairScheduler.setUp(TestFairScheduler.java:122)
REGRESSION: org.apache.hadoop.yarn.server.resourcemanager.scheduler.fair.TestFairScheduler.testQueueNameWithTrailingSpace
Error Message:
org/apache/hadoop/yarn/server/applicationhistoryservice/ApplicationHistoryWriter
Stack Trace:
java.lang.NoClassDefFoundError: org/apache/hadoop/yarn/server/applicationhistoryservice/ApplicationHistoryWriter
at java.net.URLClassLoader$1.run(URLClassLoader.java:366)
at java.net.URLClassLoader$1.run(URLClassLoader.java:355)
at java.security.AccessController.doPrivileged(Native Method)
at java.net.URLClassLoader.findClass(URLClassLoader.java:354)
at java.lang.ClassLoader.loadClass(ClassLoader.java:425)
at sun.misc.Launcher$AppClassLoader.loadClass(Launcher.java:308)
at java.lang.ClassLoader.loadClass(ClassLoader.java:358)
at org.apache.hadoop.yarn.server.resourcemanager.ResourceManager.createRMApplicationHistoryWriter(ResourceManager.java:364)
at org.apache.hadoop.yarn.server.resourcemanager.ResourceManager.serviceInit(ResourceManager.java:262)
at org.apache.hadoop.service.AbstractService.init(AbstractService.java:163)
at org.apache.hadoop.yarn.server.resourcemanager.MockRM.<init>(MockRM.java:120)
at org.apache.hadoop.yarn.server.resourcemanager.MockRM.<init>(MockRM.java:113)
at org.apache.hadoop.yarn.server.resourcemanager.MockRM.<init>(MockRM.java:109)
at org.apache.hadoop.yarn.server.resourcemanager.scheduler.fair.TestFairScheduler.setUp(TestFairScheduler.java:122)
REGRESSION: org.apache.hadoop.yarn.server.resourcemanager.scheduler.fair.TestFairScheduler.testMoveWouldViolateMaxAppsConstraints
Error Message:
org/apache/hadoop/yarn/server/applicationhistoryservice/ApplicationHistoryWriter
Stack Trace:
java.lang.NoClassDefFoundError: org/apache/hadoop/yarn/server/applicationhistoryservice/ApplicationHistoryWriter
at java.net.URLClassLoader$1.run(URLClassLoader.java:366)
at java.net.URLClassLoader$1.run(URLClassLoader.java:355)
at java.security.AccessController.doPrivileged(Native Method)
at java.net.URLClassLoader.findClass(URLClassLoader.java:354)
at java.lang.ClassLoader.loadClass(ClassLoader.java:425)
at sun.misc.Launcher$AppClassLoader.loadClass(Launcher.java:308)
at java.lang.ClassLoader.loadClass(ClassLoader.java:358)
at org.apache.hadoop.yarn.server.resourcemanager.ResourceManager.createRMApplicationHistoryWriter(ResourceManager.java:364)
at org.apache.hadoop.yarn.server.resourcemanager.ResourceManager.serviceInit(ResourceManager.java:262)
at org.apache.hadoop.service.AbstractService.init(AbstractService.java:163)
at org.apache.hadoop.yarn.server.resourcemanager.MockRM.<init>(MockRM.java:120)
at org.apache.hadoop.yarn.server.resourcemanager.MockRM.<init>(MockRM.java:113)
at org.apache.hadoop.yarn.server.resourcemanager.MockRM.<init>(MockRM.java:109)
at org.apache.hadoop.yarn.server.resourcemanager.scheduler.fair.TestFairScheduler.setUp(TestFairScheduler.java:122)
REGRESSION: org.apache.hadoop.yarn.server.resourcemanager.scheduler.fair.TestFairScheduler.testQueueMaxAMShareWithContainerReservation
Error Message:
org/apache/hadoop/yarn/server/applicationhistoryservice/ApplicationHistoryWriter
Stack Trace:
java.lang.NoClassDefFoundError: org/apache/hadoop/yarn/server/applicationhistoryservice/ApplicationHistoryWriter
at java.net.URLClassLoader$1.run(URLClassLoader.java:366)
at java.net.URLClassLoader$1.run(URLClassLoader.java:355)
at java.security.AccessController.doPrivileged(Native Method)
at java.net.URLClassLoader.findClass(URLClassLoader.java:354)
at java.lang.ClassLoader.loadClass(ClassLoader.java:425)
at sun.misc.Launcher$AppClassLoader.loadClass(Launcher.java:308)
at java.lang.ClassLoader.loadClass(ClassLoader.java:358)
at org.apache.hadoop.yarn.server.resourcemanager.ResourceManager.createRMApplicationHistoryWriter(ResourceManager.java:364)
at org.apache.hadoop.yarn.server.resourcemanager.ResourceManager.serviceInit(ResourceManager.java:262)
at org.apache.hadoop.service.AbstractService.init(AbstractService.java:163)
at org.apache.hadoop.yarn.server.resourcemanager.MockRM.<init>(MockRM.java:120)
at org.apache.hadoop.yarn.server.resourcemanager.MockRM.<init>(MockRM.java:113)
at org.apache.hadoop.yarn.server.resourcemanager.MockRM.<init>(MockRM.java:109)
at org.apache.hadoop.yarn.server.resourcemanager.scheduler.fair.TestFairScheduler.setUp(TestFairScheduler.java:122)
REGRESSION: org.apache.hadoop.yarn.server.resourcemanager.scheduler.fair.TestFairScheduler.testGetAppsInQueue
Error Message:
org/apache/hadoop/yarn/server/applicationhistoryservice/ApplicationHistoryWriter
Stack Trace:
java.lang.NoClassDefFoundError: org/apache/hadoop/yarn/server/applicationhistoryservice/ApplicationHistoryWriter
at java.net.URLClassLoader$1.run(URLClassLoader.java:366)
at java.net.URLClassLoader$1.run(URLClassLoader.java:355)
at java.security.AccessController.doPrivileged(Native Method)
at java.net.URLClassLoader.findClass(URLClassLoader.java:354)
at java.lang.ClassLoader.loadClass(ClassLoader.java:425)
at sun.misc.Launcher$AppClassLoader.loadClass(Launcher.java:308)
at java.lang.ClassLoader.loadClass(ClassLoader.java:358)
at org.apache.hadoop.yarn.server.resourcemanager.ResourceManager.createRMApplicationHistoryWriter(ResourceManager.java:364)
at org.apache.hadoop.yarn.server.resourcemanager.ResourceManager.serviceInit(ResourceManager.java:262)
at org.apache.hadoop.service.AbstractService.init(AbstractService.java:163)
at org.apache.hadoop.yarn.server.resourcemanager.MockRM.<init>(MockRM.java:120)
at org.apache.hadoop.yarn.server.resourcemanager.MockRM.<init>(MockRM.java:113)
at org.apache.hadoop.yarn.server.resourcemanager.MockRM.<init>(MockRM.java:109)
at org.apache.hadoop.yarn.server.resourcemanager.scheduler.fair.TestFairScheduler.setUp(TestFairScheduler.java:122)
REGRESSION: org.apache.hadoop.yarn.server.resourcemanager.scheduler.fair.TestFairScheduler.testMoveWouldViolateMaxResourcesConstraints
Error Message:
org/apache/hadoop/yarn/server/applicationhistoryservice/ApplicationHistoryWriter
Stack Trace:
java.lang.NoClassDefFoundError: org/apache/hadoop/yarn/server/applicationhistoryservice/ApplicationHistoryWriter
at java.net.URLClassLoader$1.run(URLClassLoader.java:366)
at java.net.URLClassLoader$1.run(URLClassLoader.java:355)
at java.security.AccessController.doPrivileged(Native Method)
at java.net.URLClassLoader.findClass(URLClassLoader.java:354)
at java.lang.ClassLoader.loadClass(ClassLoader.java:425)
at sun.misc.Launcher$AppClassLoader.loadClass(Launcher.java:308)
at java.lang.ClassLoader.loadClass(ClassLoader.java:358)
at org.apache.hadoop.yarn.server.resourcemanager.ResourceManager.createRMApplicationHistoryWriter(ResourceManager.java:364)
at org.apache.hadoop.yarn.server.resourcemanager.ResourceManager.serviceInit(ResourceManager.java:262)
at org.apache.hadoop.service.AbstractService.init(AbstractService.java:163)
at org.apache.hadoop.yarn.server.resourcemanager.MockRM.<init>(MockRM.java:120)
at org.apache.hadoop.yarn.server.resourcemanager.MockRM.<init>(MockRM.java:113)
at org.apache.hadoop.yarn.server.resourcemanager.MockRM.<init>(MockRM.java:109)
at org.apache.hadoop.yarn.server.resourcemanager.scheduler.fair.TestFairScheduler.setUp(TestFairScheduler.java:122)
REGRESSION: org.apache.hadoop.yarn.server.resourcemanager.scheduler.fair.TestFairScheduler.testNoMoreCpuOnNode
Error Message:
org/apache/hadoop/yarn/server/applicationhistoryservice/ApplicationHistoryWriter
Stack Trace:
java.lang.NoClassDefFoundError: org/apache/hadoop/yarn/server/applicationhistoryservice/ApplicationHistoryWriter
at java.net.URLClassLoader$1.run(URLClassLoader.java:366)
at java.net.URLClassLoader$1.run(URLClassLoader.java:355)
at java.security.AccessController.doPrivileged(Native Method)
at java.net.URLClassLoader.findClass(URLClassLoader.java:354)
at java.lang.ClassLoader.loadClass(ClassLoader.java:425)
at sun.misc.Launcher$AppClassLoader.loadClass(Launcher.java:308)
at java.lang.ClassLoader.loadClass(ClassLoader.java:358)
at org.apache.hadoop.yarn.server.resourcemanager.ResourceManager.createRMApplicationHistoryWriter(ResourceManager.java:364)
at org.apache.hadoop.yarn.server.resourcemanager.ResourceManager.serviceInit(ResourceManager.java:262)
at org.apache.hadoop.service.AbstractService.init(AbstractService.java:163)
at org.apache.hadoop.yarn.server.resourcemanager.MockRM.<init>(MockRM.java:120)
at org.apache.hadoop.yarn.server.resourcemanager.MockRM.<init>(MockRM.java:113)
at org.apache.hadoop.yarn.server.resourcemanager.MockRM.<init>(MockRM.java:109)
at org.apache.hadoop.yarn.server.resourcemanager.scheduler.fair.TestFairScheduler.setUp(TestFairScheduler.java:122)
REGRESSION: org.apache.hadoop.yarn.server.resourcemanager.scheduler.fair.TestFairScheduler.testIncreaseUserMaxRunningAppsOnTheFly
Error Message:
org/apache/hadoop/yarn/server/applicationhistoryservice/ApplicationHistoryWriter
Stack Trace:
java.lang.NoClassDefFoundError: org/apache/hadoop/yarn/server/applicationhistoryservice/ApplicationHistoryWriter
at java.net.URLClassLoader$1.run(URLClassLoader.java:366)
at java.net.URLClassLoader$1.run(URLClassLoader.java:355)
at java.security.AccessController.doPrivileged(Native Method)
at java.net.URLClassLoader.findClass(URLClassLoader.java:354)
at java.lang.ClassLoader.loadClass(ClassLoader.java:425)
at sun.misc.Launcher$AppClassLoader.loadClass(Launcher.java:308)
at java.lang.ClassLoader.loadClass(ClassLoader.java:358)
at org.apache.hadoop.yarn.server.resourcemanager.ResourceManager.createRMApplicationHistoryWriter(ResourceManager.java:364)
at org.apache.hadoop.yarn.server.resourcemanager.ResourceManager.serviceInit(ResourceManager.java:262)
at org.apache.hadoop.service.AbstractService.init(AbstractService.java:163)
at org.apache.hadoop.yarn.server.resourcemanager.MockRM.<init>(MockRM.java:120)
at org.apache.hadoop.yarn.server.resourcemanager.MockRM.<init>(MockRM.java:113)
at org.apache.hadoop.yarn.server.resourcemanager.MockRM.<init>(MockRM.java:109)
at org.apache.hadoop.yarn.server.resourcemanager.scheduler.fair.TestFairScheduler.setUp(TestFairScheduler.java:122)
REGRESSION: org.apache.hadoop.yarn.server.resourcemanager.scheduler.fair.TestFairScheduler.testChoiceOfPreemptedContainers
Error Message:
org/apache/hadoop/yarn/server/applicationhistoryservice/ApplicationHistoryWriter
Stack Trace:
java.lang.NoClassDefFoundError: org/apache/hadoop/yarn/server/applicationhistoryservice/ApplicationHistoryWriter
at java.net.URLClassLoader$1.run(URLClassLoader.java:366)
at java.net.URLClassLoader$1.run(URLClassLoader.java:355)
at java.security.AccessController.doPrivileged(Native Method)
at java.net.URLClassLoader.findClass(URLClassLoader.java:354)
at java.lang.ClassLoader.loadClass(ClassLoader.java:425)
at sun.misc.Launcher$AppClassLoader.loadClass(Launcher.java:308)
at java.lang.ClassLoader.loadClass(ClassLoader.java:358)
at org.apache.hadoop.yarn.server.resourcemanager.ResourceManager.createRMApplicationHistoryWriter(ResourceManager.java:364)
at org.apache.hadoop.yarn.server.resourcemanager.ResourceManager.serviceInit(ResourceManager.java:262)
at org.apache.hadoop.service.AbstractService.init(AbstractService.java:163)
at org.apache.hadoop.yarn.server.resourcemanager.MockRM.<init>(MockRM.java:120)
at org.apache.hadoop.yarn.server.resourcemanager.MockRM.<init>(MockRM.java:113)
at org.apache.hadoop.yarn.server.resourcemanager.MockRM.<init>(MockRM.java:109)
at org.apache.hadoop.yarn.server.resourcemanager.scheduler.fair.TestFairScheduler.setUp(TestFairScheduler.java:122)
REGRESSION: org.apache.hadoop.yarn.server.resourcemanager.scheduler.fair.TestFairScheduler.testSchedulingOnRemovedNode
Error Message:
org/apache/hadoop/yarn/server/applicationhistoryservice/ApplicationHistoryWriter
Stack Trace:
java.lang.NoClassDefFoundError: org/apache/hadoop/yarn/server/applicationhistoryservice/ApplicationHistoryWriter
at java.net.URLClassLoader$1.run(URLClassLoader.java:366)
at java.net.URLClassLoader$1.run(URLClassLoader.java:355)
at java.security.AccessController.doPrivileged(Native Method)
at java.net.URLClassLoader.findClass(URLClassLoader.java:354)
at java.lang.ClassLoader.loadClass(ClassLoader.java:425)
at sun.misc.Launcher$AppClassLoader.loadClass(Launcher.java:308)
at java.lang.ClassLoader.loadClass(ClassLoader.java:358)
at org.apache.hadoop.yarn.server.resourcemanager.ResourceManager.createRMApplicationHistoryWriter(ResourceManager.java:364)
at org.apache.hadoop.yarn.server.resourcemanager.ResourceManager.serviceInit(ResourceManager.java:262)
at org.apache.hadoop.service.AbstractService.init(AbstractService.java:163)
at org.apache.hadoop.yarn.server.resourcemanager.MockRM.<init>(MockRM.java:120)
at org.apache.hadoop.yarn.server.resourcemanager.MockRM.<init>(MockRM.java:113)
at org.apache.hadoop.yarn.server.resourcemanager.MockRM.<init>(MockRM.java:109)
at org.apache.hadoop.yarn.server.resourcemanager.scheduler.fair.TestFairScheduler.setUp(TestFairScheduler.java:122)
REGRESSION: org.apache.hadoop.yarn.server.resourcemanager.scheduler.fair.TestFairScheduler.testMaxAssignWithZeroMemoryContainers
Error Message:
org/apache/hadoop/yarn/server/applicationhistoryservice/ApplicationHistoryWriter
Stack Trace:
java.lang.NoClassDefFoundError: org/apache/hadoop/yarn/server/applicationhistoryservice/ApplicationHistoryWriter
at java.net.URLClassLoader$1.run(URLClassLoader.java:366)
at java.net.URLClassLoader$1.run(URLClassLoader.java:355)
at java.security.AccessController.doPrivileged(Native Method)
at java.net.URLClassLoader.findClass(URLClassLoader.java:354)
at java.lang.ClassLoader.loadClass(ClassLoader.java:425)
at sun.misc.Launcher$AppClassLoader.loadClass(Launcher.java:308)
at java.lang.ClassLoader.loadClass(ClassLoader.java:358)
at org.apache.hadoop.yarn.server.resourcemanager.ResourceManager.createRMApplicationHistoryWriter(ResourceManager.java:364)
at org.apache.hadoop.yarn.server.resourcemanager.ResourceManager.serviceInit(ResourceManager.java:262)
at org.apache.hadoop.service.AbstractService.init(AbstractService.java:163)
at org.apache.hadoop.yarn.server.resourcemanager.MockRM.<init>(MockRM.java:120)
at org.apache.hadoop.yarn.server.resourcemanager.MockRM.<init>(MockRM.java:113)
at org.apache.hadoop.yarn.server.resourcemanager.MockRM.<init>(MockRM.java:109)
at org.apache.hadoop.yarn.server.resourcemanager.scheduler.fair.TestFairScheduler.setUp(TestFairScheduler.java:122)
REGRESSION: org.apache.hadoop.yarn.server.resourcemanager.scheduler.fair.TestFairScheduler.testDecreaseQueueMaxRunningAppsOnTheFly
Error Message:
org/apache/hadoop/yarn/server/applicationhistoryservice/ApplicationHistoryWriter
Stack Trace:
java.lang.NoClassDefFoundError: org/apache/hadoop/yarn/server/applicationhistoryservice/ApplicationHistoryWriter
at java.net.URLClassLoader$1.run(URLClassLoader.java:366)
at java.net.URLClassLoader$1.run(URLClassLoader.java:355)
at java.security.AccessController.doPrivileged(Native Method)
at java.net.URLClassLoader.findClass(URLClassLoader.java:354)
at java.lang.ClassLoader.loadClass(ClassLoader.java:425)
at sun.misc.Launcher$AppClassLoader.loadClass(Launcher.java:308)
at java.lang.ClassLoader.loadClass(ClassLoader.java:358)
at org.apache.hadoop.yarn.server.resourcemanager.ResourceManager.createRMApplicationHistoryWriter(ResourceManager.java:364)
at org.apache.hadoop.yarn.server.resourcemanager.ResourceManager.serviceInit(ResourceManager.java:262)
at org.apache.hadoop.service.AbstractService.init(AbstractService.java:163)
at org.apache.hadoop.yarn.server.resourcemanager.MockRM.<init>(MockRM.java:120)
at org.apache.hadoop.yarn.server.resourcemanager.MockRM.<init>(MockRM.java:113)
at org.apache.hadoop.yarn.server.resourcemanager.MockRM.<init>(MockRM.java:109)
at org.apache.hadoop.yarn.server.resourcemanager.scheduler.fair.TestFairScheduler.setUp(TestFairScheduler.java:122)
REGRESSION: org.apache.hadoop.yarn.server.resourcemanager.scheduler.fair.TestFairScheduler.testSchedulerRootQueueMetrics
Error Message:
org/apache/hadoop/yarn/server/applicationhistoryservice/ApplicationHistoryWriter
Stack Trace:
java.lang.NoClassDefFoundError: org/apache/hadoop/yarn/server/applicationhistoryservice/ApplicationHistoryWriter
at java.net.URLClassLoader$1.run(URLClassLoader.java:366)
at java.net.URLClassLoader$1.run(URLClassLoader.java:355)
at java.security.AccessController.doPrivileged(Native Method)
at java.net.URLClassLoader.findClass(URLClassLoader.java:354)
at java.lang.ClassLoader.loadClass(ClassLoader.java:425)
at sun.misc.Launcher$AppClassLoader.loadClass(Launcher.java:308)
at java.lang.ClassLoader.loadClass(ClassLoader.java:358)
at org.apache.hadoop.yarn.server.resourcemanager.ResourceManager.createRMApplicationHistoryWriter(ResourceManager.java:364)
at org.apache.hadoop.yarn.server.resourcemanager.ResourceManager.serviceInit(ResourceManager.java:262)
at org.apache.hadoop.service.AbstractService.init(AbstractService.java:163)
at org.apache.hadoop.yarn.server.resourcemanager.MockRM.<init>(MockRM.java:120)
at org.apache.hadoop.yarn.server.resourcemanager.MockRM.<init>(MockRM.java:113)
at org.apache.hadoop.yarn.server.resourcemanager.MockRM.<init>(MockRM.java:109)
at org.apache.hadoop.yarn.server.resourcemanager.scheduler.fair.TestFairScheduler.setUp(TestFairScheduler.java:122)
REGRESSION: org.apache.hadoop.yarn.server.resourcemanager.scheduler.fair.TestFairScheduler.testQueueMaxAMShareDefault
Error Message:
org/apache/hadoop/yarn/server/applicationhistoryservice/ApplicationHistoryWriter
Stack Trace:
java.lang.NoClassDefFoundError: org/apache/hadoop/yarn/server/applicationhistoryservice/ApplicationHistoryWriter
at java.net.URLClassLoader$1.run(URLClassLoader.java:366)
at java.net.URLClassLoader$1.run(URLClassLoader.java:355)
at java.security.AccessController.doPrivileged(Native Method)
at java.net.URLClassLoader.findClass(URLClassLoader.java:354)
at java.lang.ClassLoader.loadClass(ClassLoader.java:425)
at sun.misc.Launcher$AppClassLoader.loadClass(Launcher.java:308)
at java.lang.ClassLoader.loadClass(ClassLoader.java:358)
at org.apache.hadoop.yarn.server.resourcemanager.ResourceManager.createRMApplicationHistoryWriter(ResourceManager.java:364)
at org.apache.hadoop.yarn.server.resourcemanager.ResourceManager.serviceInit(ResourceManager.java:262)
at org.apache.hadoop.service.AbstractService.init(AbstractService.java:163)
at org.apache.hadoop.yarn.server.resourcemanager.MockRM.<init>(MockRM.java:120)
at org.apache.hadoop.yarn.server.resourcemanager.MockRM.<init>(MockRM.java:113)
at org.apache.hadoop.yarn.server.resourcemanager.MockRM.<init>(MockRM.java:109)
at org.apache.hadoop.yarn.server.resourcemanager.scheduler.fair.TestFairScheduler.setUp(TestFairScheduler.java:122)
REGRESSION: org.apache.hadoop.yarn.server.resourcemanager.scheduler.fair.TestFairScheduler.testQueueuNameWithPeriods
Error Message:
org/apache/hadoop/yarn/server/applicationhistoryservice/ApplicationHistoryWriter
Stack Trace:
java.lang.NoClassDefFoundError: org/apache/hadoop/yarn/server/applicationhistoryservice/ApplicationHistoryWriter
at java.net.URLClassLoader$1.run(URLClassLoader.java:366)
at java.net.URLClassLoader$1.run(URLClassLoader.java:355)
at java.security.AccessController.doPrivileged(Native Method)
at java.net.URLClassLoader.findClass(URLClassLoader.java:354)
at java.lang.ClassLoader.loadClass(ClassLoader.java:425)
at sun.misc.Launcher$AppClassLoader.loadClass(Launcher.java:308)
at java.lang.ClassLoader.loadClass(ClassLoader.java:358)
at org.apache.hadoop.yarn.server.resourcemanager.ResourceManager.createRMApplicationHistoryWriter(ResourceManager.java:364)
at org.apache.hadoop.yarn.server.resourcemanager.ResourceManager.serviceInit(ResourceManager.java:262)
at org.apache.hadoop.service.AbstractService.init(AbstractService.java:163)
at org.apache.hadoop.yarn.server.resourcemanager.MockRM.<init>(MockRM.java:120)
at org.apache.hadoop.yarn.server.resourcemanager.MockRM.<init>(MockRM.java:113)
at org.apache.hadoop.yarn.server.resourcemanager.MockRM.<init>(MockRM.java:109)
at org.apache.hadoop.yarn.server.resourcemanager.scheduler.fair.TestFairScheduler.setUp(TestFairScheduler.java:122)
REGRESSION: org.apache.hadoop.yarn.server.resourcemanager.scheduler.fair.TestFairScheduler.testContainerReservationNotExceedingQueueMax
Error Message:
org/apache/hadoop/yarn/server/applicationhistoryservice/ApplicationHistoryWriter
Stack Trace:
java.lang.NoClassDefFoundError: org/apache/hadoop/yarn/server/applicationhistoryservice/ApplicationHistoryWriter
at java.net.URLClassLoader$1.run(URLClassLoader.java:366)
at java.net.URLClassLoader$1.run(URLClassLoader.java:355)
at java.security.AccessController.doPrivileged(Native Method)
at java.net.URLClassLoader.findClass(URLClassLoader.java:354)
at java.lang.ClassLoader.loadClass(ClassLoader.java:425)
at sun.misc.Launcher$AppClassLoader.loadClass(Launcher.java:308)
at java.lang.ClassLoader.loadClass(ClassLoader.java:358)
at org.apache.hadoop.yarn.server.resourcemanager.ResourceManager.createRMApplicationHistoryWriter(ResourceManager.java:364)
at org.apache.hadoop.yarn.server.resourcemanager.ResourceManager.serviceInit(ResourceManager.java:262)
at org.apache.hadoop.service.AbstractService.init(AbstractService.java:163)
at org.apache.hadoop.yarn.server.resourcemanager.MockRM.<init>(MockRM.java:120)
at org.apache.hadoop.yarn.server.resourcemanager.MockRM.<init>(MockRM.java:113)
at org.apache.hadoop.yarn.server.resourcemanager.MockRM.<init>(MockRM.java:109)
at org.apache.hadoop.yarn.server.resourcemanager.scheduler.fair.TestFairScheduler.setUp(TestFairScheduler.java:122)
REGRESSION: org.apache.hadoop.yarn.server.resourcemanager.scheduler.fair.TestFairScheduler.testConfigureRootQueue
Error Message:
org/apache/hadoop/yarn/server/applicationhistoryservice/ApplicationHistoryWriter
Stack Trace:
java.lang.NoClassDefFoundError: org/apache/hadoop/yarn/server/applicationhistoryservice/ApplicationHistoryWriter
at java.net.URLClassLoader$1.run(URLClassLoader.java:366)
at java.net.URLClassLoader$1.run(URLClassLoader.java:355)
at java.security.AccessController.doPrivileged(Native Method)
at java.net.URLClassLoader.findClass(URLClassLoader.java:354)
at java.lang.ClassLoader.loadClass(ClassLoader.java:425)
at sun.misc.Launcher$AppClassLoader.loadClass(Launcher.java:308)
at java.lang.ClassLoader.loadClass(ClassLoader.java:358)
at org.apache.hadoop.yarn.server.resourcemanager.ResourceManager.createRMApplicationHistoryWriter(ResourceManager.java:364)
at org.apache.hadoop.yarn.server.resourcemanager.ResourceManager.serviceInit(ResourceManager.java:262)
at org.apache.hadoop.service.AbstractService.init(AbstractService.java:163)
at org.apache.hadoop.yarn.server.resourcemanager.MockRM.<init>(MockRM.java:120)
at org.apache.hadoop.yarn.server.resourcemanager.MockRM.<init>(MockRM.java:113)
at org.apache.hadoop.yarn.server.resourcemanager.MockRM.<init>(MockRM.java:109)
at org.apache.hadoop.yarn.server.resourcemanager.scheduler.fair.TestFairScheduler.setUp(TestFairScheduler.java:122)
REGRESSION: org.apache.hadoop.yarn.server.resourcemanager.scheduler.fair.TestFairScheduler.testFifoWithinQueue
Error Message:
org/apache/hadoop/yarn/server/applicationhistoryservice/ApplicationHistoryWriter
Stack Trace:
java.lang.NoClassDefFoundError: org/apache/hadoop/yarn/server/applicationhistoryservice/ApplicationHistoryWriter
at java.net.URLClassLoader$1.run(URLClassLoader.java:366)
at java.net.URLClassLoader$1.run(URLClassLoader.java:355)
at java.security.AccessController.doPrivileged(Native Method)
at java.net.URLClassLoader.findClass(URLClassLoader.java:354)
at java.lang.ClassLoader.loadClass(ClassLoader.java:425)
at sun.misc.Launcher$AppClassLoader.loadClass(Launcher.java:308)
at java.lang.ClassLoader.loadClass(ClassLoader.java:358)
at org.apache.hadoop.yarn.server.resourcemanager.ResourceManager.createRMApplicationHistoryWriter(ResourceManager.java:364)
at org.apache.hadoop.yarn.server.resourcemanager.ResourceManager.serviceInit(ResourceManager.java:262)
at org.apache.hadoop.service.AbstractService.init(AbstractService.java:163)
at org.apache.hadoop.yarn.server.resourcemanager.MockRM.<init>(MockRM.java:120)
at org.apache.hadoop.yarn.server.resourcemanager.MockRM.<init>(MockRM.java:113)
at org.apache.hadoop.yarn.server.resourcemanager.MockRM.<init>(MockRM.java:109)
at org.apache.hadoop.yarn.server.resourcemanager.scheduler.fair.TestFairScheduler.setUp(TestFairScheduler.java:122)
REGRESSION: org.apache.hadoop.yarn.server.resourcemanager.scheduler.fair.TestFairScheduler.testAggregateCapacityTracking
Error Message:
org/apache/hadoop/yarn/server/applicationhistoryservice/ApplicationHistoryWriter
Stack Trace:
java.lang.NoClassDefFoundError: org/apache/hadoop/yarn/server/applicationhistoryservice/ApplicationHistoryWriter
at java.net.URLClassLoader$1.run(URLClassLoader.java:366)
at java.net.URLClassLoader$1.run(URLClassLoader.java:355)
at java.security.AccessController.doPrivileged(Native Method)
at java.net.URLClassLoader.findClass(URLClassLoader.java:354)
at java.lang.ClassLoader.loadClass(ClassLoader.java:425)
at sun.misc.Launcher$AppClassLoader.loadClass(Launcher.java:308)
at java.lang.ClassLoader.loadClass(ClassLoader.java:358)
at org.apache.hadoop.yarn.server.resourcemanager.ResourceManager.createRMApplicationHistoryWriter(ResourceManager.java:364)
at org.apache.hadoop.yarn.server.resourcemanager.ResourceManager.serviceInit(ResourceManager.java:262)
at org.apache.hadoop.service.AbstractService.init(AbstractService.java:163)
at org.apache.hadoop.yarn.server.resourcemanager.MockRM.<init>(MockRM.java:120)
at org.apache.hadoop.yarn.server.resourcemanager.MockRM.<init>(MockRM.java:113)
at org.apache.hadoop.yarn.server.resourcemanager.MockRM.<init>(MockRM.java:109)
at org.apache.hadoop.yarn.server.resourcemanager.scheduler.fair.TestFairScheduler.setUp(TestFairScheduler.java:122)
REGRESSION: org.apache.hadoop.yarn.server.resourcemanager.scheduler.fair.TestFairScheduler.testLowestCommonAncestorForNonRootParent
Error Message:
org/apache/hadoop/yarn/server/applicationhistoryservice/ApplicationHistoryWriter
Stack Trace:
java.lang.NoClassDefFoundError: org/apache/hadoop/yarn/server/applicationhistoryservice/ApplicationHistoryWriter
at java.net.URLClassLoader$1.run(URLClassLoader.java:366)
at java.net.URLClassLoader$1.run(URLClassLoader.java:355)
at java.security.AccessController.doPrivileged(Native Method)
at java.net.URLClassLoader.findClass(URLClassLoader.java:354)
at java.lang.ClassLoader.loadClass(ClassLoader.java:425)
at sun.misc.Launcher$AppClassLoader.loadClass(Launcher.java:308)
at java.lang.ClassLoader.loadClass(ClassLoader.java:358)
at org.apache.hadoop.yarn.server.resourcemanager.ResourceManager.createRMApplicationHistoryWriter(ResourceManager.java:364)
at org.apache.hadoop.yarn.server.resourcemanager.ResourceManager.serviceInit(ResourceManager.java:262)
at org.apache.hadoop.service.AbstractService.init(AbstractService.java:163)
at org.apache.hadoop.yarn.server.resourcemanager.MockRM.<init>(MockRM.java:120)
at org.apache.hadoop.yarn.server.resourcemanager.MockRM.<init>(MockRM.java:113)
at org.apache.hadoop.yarn.server.resourcemanager.MockRM.<init>(MockRM.java:109)
at org.apache.hadoop.yarn.server.resourcemanager.scheduler.fair.TestFairScheduler.setUp(TestFairScheduler.java:122)
REGRESSION: org.apache.hadoop.yarn.server.resourcemanager.scheduler.fair.TestFairScheduler.testPreemptionDecisionWithVariousTimeout
Error Message:
org/apache/hadoop/yarn/server/applicationhistoryservice/ApplicationHistoryWriter
Stack Trace:
java.lang.NoClassDefFoundError: org/apache/hadoop/yarn/server/applicationhistoryservice/ApplicationHistoryWriter
at java.net.URLClassLoader$1.run(URLClassLoader.java:366)
at java.net.URLClassLoader$1.run(URLClassLoader.java:355)
at java.security.AccessController.doPrivileged(Native Method)
at java.net.URLClassLoader.findClass(URLClassLoader.java:354)
at java.lang.ClassLoader.loadClass(ClassLoader.java:425)
at sun.misc.Launcher$AppClassLoader.loadClass(Launcher.java:308)
at java.lang.ClassLoader.loadClass(ClassLoader.java:358)
at org.apache.hadoop.yarn.server.resourcemanager.ResourceManager.createRMApplicationHistoryWriter(ResourceManager.java:364)
at org.apache.hadoop.yarn.server.resourcemanager.ResourceManager.serviceInit(ResourceManager.java:262)
at org.apache.hadoop.service.AbstractService.init(AbstractService.java:163)
at org.apache.hadoop.yarn.server.resourcemanager.MockRM.<init>(MockRM.java:120)
at org.apache.hadoop.yarn.server.resourcemanager.MockRM.<init>(MockRM.java:113)
at org.apache.hadoop.yarn.server.resourcemanager.MockRM.<init>(MockRM.java:109)
at org.apache.hadoop.yarn.server.resourcemanager.scheduler.fair.TestFairScheduler.setUp(TestFairScheduler.java:122)
REGRESSION: org.apache.hadoop.yarn.server.resourcemanager.scheduler.fair.TestFairScheduler.testBasicDRFWithQueues
Error Message:
org/apache/hadoop/yarn/server/applicationhistoryservice/ApplicationHistoryWriter
Stack Trace:
java.lang.NoClassDefFoundError: org/apache/hadoop/yarn/server/applicationhistoryservice/ApplicationHistoryWriter
at java.net.URLClassLoader$1.run(URLClassLoader.java:366)
at java.net.URLClassLoader$1.run(URLClassLoader.java:355)
at java.security.AccessController.doPrivileged(Native Method)
at java.net.URLClassLoader.findClass(URLClassLoader.java:354)
at java.lang.ClassLoader.loadClass(ClassLoader.java:425)
at sun.misc.Launcher$AppClassLoader.loadClass(Launcher.java:308)
at java.lang.ClassLoader.loadClass(ClassLoader.java:358)
at org.apache.hadoop.yarn.server.resourcemanager.ResourceManager.createRMApplicationHistoryWriter(ResourceManager.java:364)
at org.apache.hadoop.yarn.server.resourcemanager.ResourceManager.serviceInit(ResourceManager.java:262)
at org.apache.hadoop.service.AbstractService.init(AbstractService.java:163)
at org.apache.hadoop.yarn.server.resourcemanager.MockRM.<init>(MockRM.java:120)
at org.apache.hadoop.yarn.server.resourcemanager.MockRM.<init>(MockRM.java:113)
at org.apache.hadoop.yarn.server.resourcemanager.MockRM.<init>(MockRM.java:109)
at org.apache.hadoop.yarn.server.resourcemanager.scheduler.fair.TestFairScheduler.setUp(TestFairScheduler.java:122)
REGRESSION: org.apache.hadoop.yarn.server.resourcemanager.scheduler.fair.TestFairScheduler.testReservationsStrictLocality
Error Message:
org/apache/hadoop/yarn/server/applicationhistoryservice/ApplicationHistoryWriter
Stack Trace:
java.lang.NoClassDefFoundError: org/apache/hadoop/yarn/server/applicationhistoryservice/ApplicationHistoryWriter
at java.net.URLClassLoader$1.run(URLClassLoader.java:366)
at java.net.URLClassLoader$1.run(URLClassLoader.java:355)
at java.security.AccessController.doPrivileged(Native Method)
at java.net.URLClassLoader.findClass(URLClassLoader.java:354)
at java.lang.ClassLoader.loadClass(ClassLoader.java:425)
at sun.misc.Launcher$AppClassLoader.loadClass(Launcher.java:308)
at java.lang.ClassLoader.loadClass(ClassLoader.java:358)
at org.apache.hadoop.yarn.server.resourcemanager.ResourceManager.createRMApplicationHistoryWriter(ResourceManager.java:364)
at org.apache.hadoop.yarn.server.resourcemanager.ResourceManager.serviceInit(ResourceManager.java:262)
at org.apache.hadoop.service.AbstractService.init(AbstractService.java:163)
at org.apache.hadoop.yarn.server.resourcemanager.MockRM.<init>(MockRM.java:120)
at org.apache.hadoop.yarn.server.resourcemanager.MockRM.<init>(MockRM.java:113)
at org.apache.hadoop.yarn.server.resourcemanager.MockRM.<init>(MockRM.java:109)
at org.apache.hadoop.yarn.server.resourcemanager.scheduler.fair.TestFairScheduler.setUp(TestFairScheduler.java:122)
REGRESSION: org.apache.hadoop.yarn.server.resourcemanager.scheduler.fair.TestFairScheduler.testIncreaseQueueMaxRunningAppsOnTheFly
Error Message:
org/apache/hadoop/yarn/server/applicationhistoryservice/ApplicationHistoryWriter
Stack Trace:
java.lang.NoClassDefFoundError: org/apache/hadoop/yarn/server/applicationhistoryservice/ApplicationHistoryWriter
at java.net.URLClassLoader$1.run(URLClassLoader.java:366)
at java.net.URLClassLoader$1.run(URLClassLoader.java:355)
at java.security.AccessController.doPrivileged(Native Method)
at java.net.URLClassLoader.findClass(URLClassLoader.java:354)
at java.lang.ClassLoader.loadClass(ClassLoader.java:425)
at sun.misc.Launcher$AppClassLoader.loadClass(Launcher.java:308)
at java.lang.ClassLoader.loadClass(ClassLoader.java:358)
at org.apache.hadoop.yarn.server.resourcemanager.ResourceManager.createRMApplicationHistoryWriter(ResourceManager.java:364)
at org.apache.hadoop.yarn.server.resourcemanager.ResourceManager.serviceInit(ResourceManager.java:262)
at org.apache.hadoop.service.AbstractService.init(AbstractService.java:163)
at org.apache.hadoop.yarn.server.resourcemanager.MockRM.<init>(MockRM.java:120)
at org.apache.hadoop.yarn.server.resourcemanager.MockRM.<init>(MockRM.java:113)
at org.apache.hadoop.yarn.server.resourcemanager.MockRM.<init>(MockRM.java:109)
at org.apache.hadoop.yarn.server.resourcemanager.scheduler.fair.TestFairScheduler.setUp(TestFairScheduler.java:122)
REGRESSION: org.apache.hadoop.yarn.server.resourcemanager.scheduler.fair.TestFairSchedulerEventLog.testCreateEventLog
Error Message:
org/apache/hadoop/yarn/server/security/BaseContainerTokenSecretManager
Stack Trace:
java.lang.NoClassDefFoundError: org/apache/hadoop/yarn/server/security/BaseContainerTokenSecretManager
at java.net.URLClassLoader$1.run(URLClassLoader.java:366)
at java.net.URLClassLoader$1.run(URLClassLoader.java:355)
at java.security.AccessController.doPrivileged(Native Method)
at java.net.URLClassLoader.findClass(URLClassLoader.java:354)
at java.lang.ClassLoader.loadClass(ClassLoader.java:425)
at sun.misc.Launcher$AppClassLoader.loadClass(Launcher.java:308)
at java.lang.ClassLoader.loadClass(ClassLoader.java:358)
at java.lang.ClassLoader.defineClass1(Native Method)
at java.lang.ClassLoader.defineClass(ClassLoader.java:800)
at java.security.SecureClassLoader.defineClass(SecureClassLoader.java:142)
at java.net.URLClassLoader.defineClass(URLClassLoader.java:449)
at java.net.URLClassLoader.access$100(URLClassLoader.java:71)
at java.net.URLClassLoader$1.run(URLClassLoader.java:361)
at java.net.URLClassLoader$1.run(URLClassLoader.java:355)
at java.security.AccessController.doPrivileged(Native Method)
at java.net.URLClassLoader.findClass(URLClassLoader.java:354)
at java.lang.ClassLoader.loadClass(ClassLoader.java:425)
at sun.misc.Launcher$AppClassLoader.loadClass(Launcher.java:308)
at java.lang.ClassLoader.loadClass(ClassLoader.java:358)
at org.apache.hadoop.yarn.server.resourcemanager.RMSecretManagerService.createContainerTokenSecretManager(RMSecretManagerService.java:109)
at org.apache.hadoop.yarn.server.resourcemanager.RMSecretManagerService.<init>(RMSecretManagerService.java:57)
at org.apache.hadoop.yarn.server.resourcemanager.ResourceManager.createRMSecretManagerService(ResourceManager.java:1111)
at org.apache.hadoop.yarn.server.resourcemanager.ResourceManager$RMActiveServices.serviceInit(ResourceManager.java:423)
at org.apache.hadoop.service.AbstractService.init(AbstractService.java:163)
at org.apache.hadoop.yarn.server.resourcemanager.ResourceManager.createAndInitActiveServices(ResourceManager.java:963)
at org.apache.hadoop.yarn.server.resourcemanager.ResourceManager.serviceInit(ResourceManager.java:256)
at org.apache.hadoop.service.AbstractService.init(AbstractService.java:163)
at org.apache.hadoop.yarn.server.resourcemanager.MockRM.<init>(MockRM.java:120)
at org.apache.hadoop.yarn.server.resourcemanager.MockRM.<init>(MockRM.java:113)
at org.apache.hadoop.yarn.server.resourcemanager.MockRM.<init>(MockRM.java:109)
at org.apache.hadoop.yarn.server.resourcemanager.scheduler.fair.TestFairSchedulerEventLog.setUp(TestFairSchedulerEventLog.java:52)
REGRESSION: org.apache.hadoop.yarn.server.resourcemanager.scheduler.fair.TestFairSchedulerEventLog.testCreateEventLog
Error Message:
null
Stack Trace:
java.lang.NullPointerException: null
at org.apache.hadoop.yarn.server.resourcemanager.scheduler.fair.TestFairSchedulerEventLog.tearDown(TestFairSchedulerEventLog.java:72)
REGRESSION: org.apache.hadoop.yarn.server.resourcemanager.scheduler.fair.TestFairSchedulerQueueACLs.testApplicationACLs
Error Message:
org/apache/hadoop/yarn/security/ContainerTokenIdentifier
Stack Trace:
java.lang.NoClassDefFoundError: org/apache/hadoop/yarn/security/ContainerTokenIdentifier
at org.apache.hadoop.yarn.server.resourcemanager.RMSecretManagerService.createContainerTokenSecretManager(RMSecretManagerService.java:109)
at org.apache.hadoop.yarn.server.resourcemanager.RMSecretManagerService.<init>(RMSecretManagerService.java:57)
at org.apache.hadoop.yarn.server.resourcemanager.ResourceManager.createRMSecretManagerService(ResourceManager.java:1111)
at org.apache.hadoop.yarn.server.resourcemanager.ResourceManager$RMActiveServices.serviceInit(ResourceManager.java:423)
at org.apache.hadoop.service.AbstractService.init(AbstractService.java:163)
at org.apache.hadoop.yarn.server.resourcemanager.ResourceManager.createAndInitActiveServices(ResourceManager.java:963)
at org.apache.hadoop.yarn.server.resourcemanager.ResourceManager.serviceInit(ResourceManager.java:256)
at org.apache.hadoop.service.AbstractService.init(AbstractService.java:163)
at org.apache.hadoop.yarn.server.resourcemanager.MockRM.<init>(MockRM.java:120)
at org.apache.hadoop.yarn.server.resourcemanager.MockRM.<init>(MockRM.java:113)
at org.apache.hadoop.yarn.server.resourcemanager.MockRM.<init>(MockRM.java:109)
at org.apache.hadoop.yarn.server.resourcemanager.QueueACLsTestBase$1.<init>(QueueACLsTestBase.java:85)
at org.apache.hadoop.yarn.server.resourcemanager.QueueACLsTestBase.setup(QueueACLsTestBase.java:85)
at sun.reflect.NativeMethodAccessorImpl.invoke0(Native Method)
at sun.reflect.NativeMethodAccessorImpl.invoke(NativeMethodAccessorImpl.java:57)
at sun.reflect.DelegatingMethodAccessorImpl.invoke(DelegatingMethodAccessorImpl.java:43)
at java.lang.reflect.Method.invoke(Method.java:606)
at org.junit.runners.model.FrameworkMethod$1.runReflectiveCall(FrameworkMethod.java:47)
at org.junit.internal.runners.model.ReflectiveCallable.run(ReflectiveCallable.java:12)
at org.junit.runners.model.FrameworkMethod.invokeExplosively(FrameworkMethod.java:44)
at org.junit.internal.runners.statements.RunBefores.evaluate(RunBefores.java:24)
at org.junit.internal.runners.statements.RunAfters.evaluate(RunAfters.java:27)
at org.junit.runners.ParentRunner.runLeaf(ParentRunner.java:271)
at org.junit.runners.BlockJUnit4ClassRunner.runChild(BlockJUnit4ClassRunner.java:70)
at org.junit.runners.BlockJUnit4ClassRunner.runChild(BlockJUnit4ClassRunner.java:50)
at org.junit.runners.ParentRunner$3.run(ParentRunner.java:238)
at org.junit.runners.ParentRunner$1.schedule(ParentRunner.java:63)
at org.junit.runners.ParentRunner.runChildren(ParentRunner.java:236)
at org.junit.runners.ParentRunner.access$000(ParentRunner.java:53)
at org.junit.runners.ParentRunner$2.evaluate(ParentRunner.java:229)
at org.junit.runners.ParentRunner.run(ParentRunner.java:309)
at org.apache.maven.surefire.junit4.JUnit4Provider.execute(JUnit4Provider.java:264)
at org.apache.maven.surefire.junit4.JUnit4Provider.executeTestSet(JUnit4Provider.java:153)
at org.apache.maven.surefire.junit4.JUnit4Provider.invoke(JUnit4Provider.java:124)
at org.apache.maven.surefire.booter.ForkedBooter.invokeProviderInSameClassLoader(ForkedBooter.java:200)
at org.apache.maven.surefire.booter.ForkedBooter.runSuitesInProcess(ForkedBooter.java:153)
at org.apache.maven.surefire.booter.ForkedBooter.main(ForkedBooter.java:103)
Caused by: java.lang.ClassNotFoundException: org.apache.hadoop.yarn.security.ContainerTokenIdentifier
at java.net.URLClassLoader$1.run(URLClassLoader.java:366)
at java.net.URLClassLoader$1.run(URLClassLoader.java:355)
at java.security.AccessController.doPrivileged(Native Method)
at java.net.URLClassLoader.findClass(URLClassLoader.java:354)
at java.lang.ClassLoader.loadClass(ClassLoader.java:425)
at sun.misc.Launcher$AppClassLoader.loadClass(Launcher.java:308)
at java.lang.ClassLoader.loadClass(ClassLoader.java:358)
at org.apache.hadoop.yarn.server.resourcemanager.RMSecretManagerService.createContainerTokenSecretManager(RMSecretManagerService.java:109)
at org.apache.hadoop.yarn.server.resourcemanager.RMSecretManagerService.<init>(RMSecretManagerService.java:57)
at org.apache.hadoop.yarn.server.resourcemanager.ResourceManager.createRMSecretManagerService(ResourceManager.java:1111)
at org.apache.hadoop.yarn.server.resourcemanager.ResourceManager$RMActiveServices.serviceInit(ResourceManager.java:423)
at org.apache.hadoop.service.AbstractService.init(AbstractService.java:163)
at org.apache.hadoop.yarn.server.resourcemanager.ResourceManager.createAndInitActiveServices(ResourceManager.java:963)
at org.apache.hadoop.yarn.server.resourcemanager.ResourceManager.serviceInit(ResourceManager.java:256)
at org.apache.hadoop.service.AbstractService.init(AbstractService.java:163)
at org.apache.hadoop.yarn.server.resourcemanager.MockRM.<init>(MockRM.java:120)
at org.apache.hadoop.yarn.server.resourcemanager.MockRM.<init>(MockRM.java:113)
at org.apache.hadoop.yarn.server.resourcemanager.MockRM.<init>(MockRM.java:109)
at org.apache.hadoop.yarn.server.resourcemanager.QueueACLsTestBase$1.<init>(QueueACLsTestBase.java:85)
at org.apache.hadoop.yarn.server.resourcemanager.QueueACLsTestBase.setup(QueueACLsTestBase.java:85)
at sun.reflect.NativeMethodAccessorImpl.invoke0(Native Method)
at sun.reflect.NativeMethodAccessorImpl.invoke(NativeMethodAccessorImpl.java:57)
at sun.reflect.DelegatingMethodAccessorImpl.invoke(DelegatingMethodAccessorImpl.java:43)
at java.lang.reflect.Method.invoke(Method.java:606)
at org.junit.runners.model.FrameworkMethod$1.runReflectiveCall(FrameworkMethod.java:47)
at org.junit.internal.runners.model.ReflectiveCallable.run(ReflectiveCallable.java:12)
at org.junit.runners.model.FrameworkMethod.invokeExplosively(FrameworkMethod.java:44)
at org.junit.internal.runners.statements.RunBefores.evaluate(RunBefores.java:24)
at org.junit.internal.runners.statements.RunAfters.evaluate(RunAfters.java:27)
at org.junit.runners.ParentRunner.runLeaf(ParentRunner.java:271)
at org.junit.runners.BlockJUnit4ClassRunner.runChild(BlockJUnit4ClassRunner.java:70)
at org.junit.runners.BlockJUnit4ClassRunner.runChild(BlockJUnit4ClassRunner.java:50)
at org.junit.runners.ParentRunner$3.run(ParentRunner.java:238)
at org.junit.runners.ParentRunner$1.schedule(ParentRunner.java:63)
at org.junit.runners.ParentRunner.runChildren(ParentRunner.java:236)
at org.junit.runners.ParentRunner.access$000(ParentRunner.java:53)
at org.junit.runners.ParentRunner$2.evaluate(ParentRunner.java:229)
at org.junit.runners.ParentRunner.run(ParentRunner.java:309)
at org.apache.maven.surefire.junit4.JUnit4Provider.execute(JUnit4Provider.java:264)
at org.apache.maven.surefire.junit4.JUnit4Provider.executeTestSet(JUnit4Provider.java:153)
at org.apache.maven.surefire.junit4.JUnit4Provider.invoke(JUnit4Provider.java:124)
at org.apache.maven.surefire.booter.ForkedBooter.invokeProviderInSameClassLoader(ForkedBooter.java:200)
at org.apache.maven.surefire.booter.ForkedBooter.runSuitesInProcess(ForkedBooter.java:153)
at org.apache.maven.surefire.booter.ForkedBooter.main(ForkedBooter.java:103)
Failed: YARN-3970 PreCommit Build #8934
Posted by Apache Jenkins Server <je...@builds.apache.org>.
Jira: https://issues.apache.org/jira/browse/YARN-3970
Build: https://builds.apache.org/job/PreCommit-YARN-Build/8934/
###################################################################################
########################## LAST 60 LINES OF THE CONSOLE ###########################
[...truncated 290 lines...]
| -1 | checkstyle | 0m 52s | The applied patch generated 5 new
| | | | checkstyle issues (total was 164,
| | | | now 169).
| +1 | whitespace | 0m 2s | The patch has no lines that end in
| | | | whitespace.
| +1 | install | 1m 31s | mvn install still works.
| +1 | eclipse:eclipse | 0m 33s | The patch built with
| | | | eclipse:eclipse.
| +1 | findbugs | 1m 31s | The patch does not introduce any
| | | | new Findbugs (version 3.0.0)
| | | | warnings.
| +1 | yarn tests | 54m 18s | Tests passed in
| | | | hadoop-yarn-server-resourcemanager.
| | | 94m 18s |
|| Subsystem || Report/Notes ||
============================================================================
| Patch URL | http://issues.apache.org/jira/secure/attachment/12753002/YARN-3970.20150828-1.patch |
| Optional Tests | javadoc javac unit findbugs checkstyle |
| git revision | trunk / beb65c9 |
| Release Audit | /home/jenkins/jenkins-slave/workspace/PreCommit-YARN-Build/patchprocess/patchReleaseAuditProblems.txt |
| checkstyle | /home/jenkins/jenkins-slave/workspace/PreCommit-YARN-Build/patchprocess/diffcheckstylehadoop-yarn-server-resourcemanager.txt |
| hadoop-yarn-server-resourcemanager test log | /home/jenkins/jenkins-slave/workspace/PreCommit-YARN-Build/patchprocess/testrun_hadoop-yarn-server-resourcemanager.txt |
| Test Results | https://builds.apache.org/job/PreCommit-YARN-Build/8934/testReport/ |
| Java | 1.7.0_55 |
| uname | Linux asf906.gq1.ygridcore.net 3.13.0-36-lowlatency #63-Ubuntu SMP PREEMPT Wed Sep 3 21:56:12 UTC 2014 x86_64 x86_64 x86_64 GNU/Linux |
============================================================================
============================================================================
Adding comment to JIRA
============================================================================
============================================================================
Comment added.
cd549da27ad35865a748ed015324defdf808f011 logged out
============================================================================
============================================================================
Finished build.
============================================================================
============================================================================
Build step 'Execute shell' marked build as failure
Archiving artifacts
Sending artifact delta relative to PreCommit-YARN-Build #8916
Archived 31 artifacts
Archive block size is 32768
Received 88 blocks and 10014527 bytes
Compression is 22.4%
Took 2.5 sec
[description-setter] Could not determine description.
Recording test results
Email was triggered for: Failure
Sending email for trigger: Failure
###################################################################################
############################## FAILED TESTS (if any) ##############################
All tests passed
Failed: YARN-1556 PreCommit Build #8933
Posted by Apache Jenkins Server <je...@builds.apache.org>.
Jira: https://issues.apache.org/jira/browse/YARN-1556
Build: https://builds.apache.org/job/PreCommit-YARN-Build/8933/
###################################################################################
########################## LAST 60 LINES OF THE CONSOLE ###########################
[...truncated 285 lines...]
| | | | warnings.
| +1 | checkstyle | 0m 51s | There were no new checkstyle
| | | | issues.
| -1 | whitespace | 0m 0s | The patch has 1 line(s) that end in
| | | | whitespace. Use git apply
| | | | --whitespace=fix.
| +1 | install | 1m 32s | mvn install still works.
| +1 | eclipse:eclipse | 0m 33s | The patch built with
| | | | eclipse:eclipse.
| +1 | findbugs | 1m 27s | The patch does not introduce any
| | | | new Findbugs (version 3.0.0)
| | | | warnings.
| +1 | yarn tests | 53m 33s | Tests passed in
| | | | hadoop-yarn-server-resourcemanager.
| | | 92m 44s |
|| Subsystem || Report/Notes ||
============================================================================
| Patch URL | http://issues.apache.org/jira/secure/attachment/12752960/YARN-1556.patch |
| Optional Tests | javadoc javac unit findbugs checkstyle |
| git revision | trunk / e166c03 |
| whitespace | /home/jenkins/jenkins-slave/workspace/PreCommit-YARN-Build/patchprocess/whitespace.txt |
| hadoop-yarn-server-resourcemanager test log | /home/jenkins/jenkins-slave/workspace/PreCommit-YARN-Build/patchprocess/testrun_hadoop-yarn-server-resourcemanager.txt |
| Test Results | https://builds.apache.org/job/PreCommit-YARN-Build/8933/testReport/ |
| Java | 1.7.0_55 |
| uname | Linux asf905.gq1.ygridcore.net 3.13.0-36-lowlatency #63-Ubuntu SMP PREEMPT Wed Sep 3 21:56:12 UTC 2014 x86_64 x86_64 x86_64 GNU/Linux |
============================================================================
============================================================================
Adding comment to JIRA
============================================================================
============================================================================
Comment added.
ad82d548dfcf9c0f3cb98326d7c0fe63cf7186fb logged out
============================================================================
============================================================================
Finished build.
============================================================================
============================================================================
Build step 'Execute shell' marked build as failure
Archiving artifacts
Sending artifact delta relative to PreCommit-YARN-Build #8916
Archived 29 artifacts
Archive block size is 32768
Received 103 blocks and 9974765 bytes
Compression is 25.3%
Took 2.1 sec
[description-setter] Could not determine description.
Recording test results
Email was triggered for: Failure
Sending email for trigger: Failure
###################################################################################
############################## FAILED TESTS (if any) ##############################
All tests passed
Failed: YARN-4087 PreCommit Build #8932
Posted by Apache Jenkins Server <je...@builds.apache.org>.
Jira: https://issues.apache.org/jira/browse/YARN-4087
Build: https://builds.apache.org/job/PreCommit-YARN-Build/8932/
###################################################################################
########################## LAST 60 LINES OF THE CONSOLE ###########################
[...truncated 300 lines...]
| | | | the total number of release audit
| | | | warnings.
| +1 | checkstyle | 2m 0s | There were no new checkstyle
| | | | issues.
| +1 | whitespace | 0m 0s | The patch has no lines that end in
| | | | whitespace.
| +1 | install | 1m 29s | mvn install still works.
| +1 | eclipse:eclipse | 0m 34s | The patch built with
| | | | eclipse:eclipse.
| +1 | findbugs | 3m 12s | The patch does not introduce any
| | | | new Findbugs (version 3.0.0)
| | | | warnings.
| +1 | yarn tests | 0m 23s | Tests passed in hadoop-yarn-api.
| +1 | yarn tests | 1m 59s | Tests passed in hadoop-yarn-common.
| | | 46m 22s |
|| Subsystem || Report/Notes ||
============================================================================
| Patch URL | http://issues.apache.org/jira/secure/attachment/12752862/YARN-4087.2.patch |
| Optional Tests | javadoc javac unit findbugs checkstyle |
| git revision | trunk / a9c8ea7 |
| hadoop-yarn-api test log | /home/jenkins/jenkins-slave/workspace/PreCommit-YARN-Build/patchprocess/testrun_hadoop-yarn-api.txt |
| hadoop-yarn-common test log | /home/jenkins/jenkins-slave/workspace/PreCommit-YARN-Build/patchprocess/testrun_hadoop-yarn-common.txt |
| Test Results | https://builds.apache.org/job/PreCommit-YARN-Build/8932/testReport/ |
| Java | 1.7.0_55 |
| uname | Linux asf907.gq1.ygridcore.net 3.13.0-36-lowlatency #63-Ubuntu SMP PREEMPT Wed Sep 3 21:56:12 UTC 2014 x86_64 x86_64 x86_64 GNU/Linux |
============================================================================
============================================================================
Adding comment to JIRA
============================================================================
============================================================================
Comment added.
5c4c9d00a0fa61b49de9d35b8db241907579aeb7 logged out
============================================================================
============================================================================
Finished build.
============================================================================
============================================================================
Build step 'Execute shell' marked build as failure
Archiving artifacts
Sending artifact delta relative to PreCommit-YARN-Build #8916
Archived 43 artifacts
Archive block size is 32768
Received 44 blocks and 29070412 bytes
Compression is 4.7%
Took 6.4 sec
[description-setter] Could not determine description.
Recording test results
Email was triggered for: Failure
Sending email for trigger: Failure
###################################################################################
############################## FAILED TESTS (if any) ##############################
All tests passed
Failed: YARN-3920 PreCommit Build #8931
Posted by Apache Jenkins Server <je...@builds.apache.org>.
Jira: https://issues.apache.org/jira/browse/YARN-3920
Build: https://builds.apache.org/job/PreCommit-YARN-Build/8931/
###################################################################################
########################## LAST 60 LINES OF THE CONSOLE ###########################
[...truncated 308 lines...]
| | | | --whitespace=fix.
| +1 | install | 1m 35s | mvn install still works.
| +1 | eclipse:eclipse | 0m 33s | The patch built with
| | | | eclipse:eclipse.
| +1 | findbugs | 1m 33s | The patch does not introduce any
| | | | new Findbugs (version 3.0.0)
| | | | warnings.
| -1 | yarn tests | 53m 43s | Tests failed in
| | | | hadoop-yarn-server-resourcemanager.
| | | 92m 44s |
Reason | Tests
Failed unit tests | hadoop.yarn.server.resourcemanager.webapp.TestRMWebServicesAppsModification
|| Subsystem || Report/Notes ||
============================================================================
| Patch URL | http://issues.apache.org/jira/secure/attachment/12752847/YARN-3920.004.patch |
| Optional Tests | javadoc javac unit findbugs checkstyle |
| git revision | trunk / a9c8ea7 |
| checkstyle | /home/jenkins/jenkins-slave/workspace/PreCommit-YARN-Build/patchprocess/diffcheckstylehadoop-yarn-server-resourcemanager.txt |
| whitespace | /home/jenkins/jenkins-slave/workspace/PreCommit-YARN-Build/patchprocess/whitespace.txt |
| hadoop-yarn-server-resourcemanager test log | /home/jenkins/jenkins-slave/workspace/PreCommit-YARN-Build/patchprocess/testrun_hadoop-yarn-server-resourcemanager.txt |
| Test Results | https://builds.apache.org/job/PreCommit-YARN-Build/8931/testReport/ |
| Java | 1.7.0_55 |
| uname | Linux asf905.gq1.ygridcore.net 3.13.0-36-lowlatency #63-Ubuntu SMP PREEMPT Wed Sep 3 21:56:12 UTC 2014 x86_64 x86_64 x86_64 GNU/Linux |
============================================================================
============================================================================
Adding comment to JIRA
============================================================================
============================================================================
Comment added.
d844463315ad062bc4133d7915823d3d005cde87 logged out
============================================================================
============================================================================
Finished build.
============================================================================
============================================================================
Build step 'Execute shell' marked build as failure
Archiving artifacts
Sending artifact delta relative to PreCommit-YARN-Build #8916
Archived 28 artifacts
Archive block size is 32768
Received 77 blocks and 9065572 bytes
Compression is 21.8%
Took 2.2 sec
[description-setter] Could not determine description.
Recording test results
Email was triggered for: Failure
Sending email for trigger: Failure
###################################################################################
############################## FAILED TESTS (if any) ##############################
14 tests failed.
REGRESSION: org.apache.hadoop.yarn.server.resourcemanager.webapp.TestRMWebServicesAppsModification.testSingleAppKillInvalidId[2]
Error Message:
java.net.BindException: Address already in use
Stack Trace:
com.sun.jersey.test.framework.spi.container.TestContainerException: java.net.BindException: Address already in use
at sun.nio.ch.Net.bind0(Native Method)
at sun.nio.ch.Net.bind(Net.java:444)
at sun.nio.ch.Net.bind(Net.java:436)
at sun.nio.ch.ServerSocketChannelImpl.bind(ServerSocketChannelImpl.java:214)
at sun.nio.ch.ServerSocketAdaptor.bind(ServerSocketAdaptor.java:74)
at org.glassfish.grizzly.nio.transport.TCPNIOTransport.bind(TCPNIOTransport.java:413)
at org.glassfish.grizzly.nio.transport.TCPNIOTransport.bind(TCPNIOTransport.java:384)
at org.glassfish.grizzly.nio.transport.TCPNIOTransport.bind(TCPNIOTransport.java:375)
at org.glassfish.grizzly.http.server.NetworkListener.start(NetworkListener.java:549)
at org.glassfish.grizzly.http.server.HttpServer.start(HttpServer.java:255)
at com.sun.jersey.api.container.grizzly2.GrizzlyServerFactory.createHttpServer(GrizzlyServerFactory.java:326)
at com.sun.jersey.api.container.grizzly2.GrizzlyServerFactory.createHttpServer(GrizzlyServerFactory.java:343)
at com.sun.jersey.test.framework.spi.container.grizzly2.web.GrizzlyWebTestContainerFactory$GrizzlyWebTestContainer.instantiateGrizzlyWebServer(GrizzlyWebTestContainerFactory.java:219)
at com.sun.jersey.test.framework.spi.container.grizzly2.web.GrizzlyWebTestContainerFactory$GrizzlyWebTestContainer.<init>(GrizzlyWebTestContainerFactory.java:129)
at com.sun.jersey.test.framework.spi.container.grizzly2.web.GrizzlyWebTestContainerFactory$GrizzlyWebTestContainer.<init>(GrizzlyWebTestContainerFactory.java:86)
at com.sun.jersey.test.framework.spi.container.grizzly2.web.GrizzlyWebTestContainerFactory.create(GrizzlyWebTestContainerFactory.java:79)
at com.sun.jersey.test.framework.JerseyTest.getContainer(JerseyTest.java:342)
at com.sun.jersey.test.framework.JerseyTest.<init>(JerseyTest.java:217)
at org.apache.hadoop.yarn.webapp.JerseyTestBase.<init>(JerseyTestBase.java:27)
at org.apache.hadoop.yarn.server.resourcemanager.webapp.TestRMWebServicesAppsModification.<init>(TestRMWebServicesAppsModification.java:277)
REGRESSION: org.apache.hadoop.yarn.server.resourcemanager.webapp.TestRMWebServicesAppsModification.testSingleAppState[2]
Error Message:
java.net.BindException: Address already in use
Stack Trace:
com.sun.jersey.test.framework.spi.container.TestContainerException: java.net.BindException: Address already in use
at sun.nio.ch.Net.bind0(Native Method)
at sun.nio.ch.Net.bind(Net.java:444)
at sun.nio.ch.Net.bind(Net.java:436)
at sun.nio.ch.ServerSocketChannelImpl.bind(ServerSocketChannelImpl.java:214)
at sun.nio.ch.ServerSocketAdaptor.bind(ServerSocketAdaptor.java:74)
at org.glassfish.grizzly.nio.transport.TCPNIOTransport.bind(TCPNIOTransport.java:413)
at org.glassfish.grizzly.nio.transport.TCPNIOTransport.bind(TCPNIOTransport.java:384)
at org.glassfish.grizzly.nio.transport.TCPNIOTransport.bind(TCPNIOTransport.java:375)
at org.glassfish.grizzly.http.server.NetworkListener.start(NetworkListener.java:549)
at org.glassfish.grizzly.http.server.HttpServer.start(HttpServer.java:255)
at com.sun.jersey.api.container.grizzly2.GrizzlyServerFactory.createHttpServer(GrizzlyServerFactory.java:326)
at com.sun.jersey.api.container.grizzly2.GrizzlyServerFactory.createHttpServer(GrizzlyServerFactory.java:343)
at com.sun.jersey.test.framework.spi.container.grizzly2.web.GrizzlyWebTestContainerFactory$GrizzlyWebTestContainer.instantiateGrizzlyWebServer(GrizzlyWebTestContainerFactory.java:219)
at com.sun.jersey.test.framework.spi.container.grizzly2.web.GrizzlyWebTestContainerFactory$GrizzlyWebTestContainer.<init>(GrizzlyWebTestContainerFactory.java:129)
at com.sun.jersey.test.framework.spi.container.grizzly2.web.GrizzlyWebTestContainerFactory$GrizzlyWebTestContainer.<init>(GrizzlyWebTestContainerFactory.java:86)
at com.sun.jersey.test.framework.spi.container.grizzly2.web.GrizzlyWebTestContainerFactory.create(GrizzlyWebTestContainerFactory.java:79)
at com.sun.jersey.test.framework.JerseyTest.getContainer(JerseyTest.java:342)
at com.sun.jersey.test.framework.JerseyTest.<init>(JerseyTest.java:217)
at org.apache.hadoop.yarn.webapp.JerseyTestBase.<init>(JerseyTestBase.java:27)
at org.apache.hadoop.yarn.server.resourcemanager.webapp.TestRMWebServicesAppsModification.<init>(TestRMWebServicesAppsModification.java:277)
REGRESSION: org.apache.hadoop.yarn.server.resourcemanager.webapp.TestRMWebServicesAppsModification.testGetNewApplicationAndSubmit[2]
Error Message:
java.net.BindException: Address already in use
Stack Trace:
com.sun.jersey.test.framework.spi.container.TestContainerException: java.net.BindException: Address already in use
at sun.nio.ch.Net.bind0(Native Method)
at sun.nio.ch.Net.bind(Net.java:444)
at sun.nio.ch.Net.bind(Net.java:436)
at sun.nio.ch.ServerSocketChannelImpl.bind(ServerSocketChannelImpl.java:214)
at sun.nio.ch.ServerSocketAdaptor.bind(ServerSocketAdaptor.java:74)
at org.glassfish.grizzly.nio.transport.TCPNIOTransport.bind(TCPNIOTransport.java:413)
at org.glassfish.grizzly.nio.transport.TCPNIOTransport.bind(TCPNIOTransport.java:384)
at org.glassfish.grizzly.nio.transport.TCPNIOTransport.bind(TCPNIOTransport.java:375)
at org.glassfish.grizzly.http.server.NetworkListener.start(NetworkListener.java:549)
at org.glassfish.grizzly.http.server.HttpServer.start(HttpServer.java:255)
at com.sun.jersey.api.container.grizzly2.GrizzlyServerFactory.createHttpServer(GrizzlyServerFactory.java:326)
at com.sun.jersey.api.container.grizzly2.GrizzlyServerFactory.createHttpServer(GrizzlyServerFactory.java:343)
at com.sun.jersey.test.framework.spi.container.grizzly2.web.GrizzlyWebTestContainerFactory$GrizzlyWebTestContainer.instantiateGrizzlyWebServer(GrizzlyWebTestContainerFactory.java:219)
at com.sun.jersey.test.framework.spi.container.grizzly2.web.GrizzlyWebTestContainerFactory$GrizzlyWebTestContainer.<init>(GrizzlyWebTestContainerFactory.java:129)
at com.sun.jersey.test.framework.spi.container.grizzly2.web.GrizzlyWebTestContainerFactory$GrizzlyWebTestContainer.<init>(GrizzlyWebTestContainerFactory.java:86)
at com.sun.jersey.test.framework.spi.container.grizzly2.web.GrizzlyWebTestContainerFactory.create(GrizzlyWebTestContainerFactory.java:79)
at com.sun.jersey.test.framework.JerseyTest.getContainer(JerseyTest.java:342)
at com.sun.jersey.test.framework.JerseyTest.<init>(JerseyTest.java:217)
at org.apache.hadoop.yarn.webapp.JerseyTestBase.<init>(JerseyTestBase.java:27)
at org.apache.hadoop.yarn.server.resourcemanager.webapp.TestRMWebServicesAppsModification.<init>(TestRMWebServicesAppsModification.java:277)
REGRESSION: org.apache.hadoop.yarn.server.resourcemanager.webapp.TestRMWebServicesAppsModification.testAppSubmitBadJsonAndXML[2]
Error Message:
java.net.BindException: Address already in use
Stack Trace:
com.sun.jersey.test.framework.spi.container.TestContainerException: java.net.BindException: Address already in use
at sun.nio.ch.Net.bind0(Native Method)
at sun.nio.ch.Net.bind(Net.java:444)
at sun.nio.ch.Net.bind(Net.java:436)
at sun.nio.ch.ServerSocketChannelImpl.bind(ServerSocketChannelImpl.java:214)
at sun.nio.ch.ServerSocketAdaptor.bind(ServerSocketAdaptor.java:74)
at org.glassfish.grizzly.nio.transport.TCPNIOTransport.bind(TCPNIOTransport.java:413)
at org.glassfish.grizzly.nio.transport.TCPNIOTransport.bind(TCPNIOTransport.java:384)
at org.glassfish.grizzly.nio.transport.TCPNIOTransport.bind(TCPNIOTransport.java:375)
at org.glassfish.grizzly.http.server.NetworkListener.start(NetworkListener.java:549)
at org.glassfish.grizzly.http.server.HttpServer.start(HttpServer.java:255)
at com.sun.jersey.api.container.grizzly2.GrizzlyServerFactory.createHttpServer(GrizzlyServerFactory.java:326)
at com.sun.jersey.api.container.grizzly2.GrizzlyServerFactory.createHttpServer(GrizzlyServerFactory.java:343)
at com.sun.jersey.test.framework.spi.container.grizzly2.web.GrizzlyWebTestContainerFactory$GrizzlyWebTestContainer.instantiateGrizzlyWebServer(GrizzlyWebTestContainerFactory.java:219)
at com.sun.jersey.test.framework.spi.container.grizzly2.web.GrizzlyWebTestContainerFactory$GrizzlyWebTestContainer.<init>(GrizzlyWebTestContainerFactory.java:129)
at com.sun.jersey.test.framework.spi.container.grizzly2.web.GrizzlyWebTestContainerFactory$GrizzlyWebTestContainer.<init>(GrizzlyWebTestContainerFactory.java:86)
at com.sun.jersey.test.framework.spi.container.grizzly2.web.GrizzlyWebTestContainerFactory.create(GrizzlyWebTestContainerFactory.java:79)
at com.sun.jersey.test.framework.JerseyTest.getContainer(JerseyTest.java:342)
at com.sun.jersey.test.framework.JerseyTest.<init>(JerseyTest.java:217)
at org.apache.hadoop.yarn.webapp.JerseyTestBase.<init>(JerseyTestBase.java:27)
at org.apache.hadoop.yarn.server.resourcemanager.webapp.TestRMWebServicesAppsModification.<init>(TestRMWebServicesAppsModification.java:277)
REGRESSION: org.apache.hadoop.yarn.server.resourcemanager.webapp.TestRMWebServicesAppsModification.testGetAppQueue[3]
Error Message:
java.net.BindException: Address already in use
Stack Trace:
com.sun.jersey.test.framework.spi.container.TestContainerException: java.net.BindException: Address already in use
at sun.nio.ch.Net.bind0(Native Method)
at sun.nio.ch.Net.bind(Net.java:444)
at sun.nio.ch.Net.bind(Net.java:436)
at sun.nio.ch.ServerSocketChannelImpl.bind(ServerSocketChannelImpl.java:214)
at sun.nio.ch.ServerSocketAdaptor.bind(ServerSocketAdaptor.java:74)
at org.glassfish.grizzly.nio.transport.TCPNIOTransport.bind(TCPNIOTransport.java:413)
at org.glassfish.grizzly.nio.transport.TCPNIOTransport.bind(TCPNIOTransport.java:384)
at org.glassfish.grizzly.nio.transport.TCPNIOTransport.bind(TCPNIOTransport.java:375)
at org.glassfish.grizzly.http.server.NetworkListener.start(NetworkListener.java:549)
at org.glassfish.grizzly.http.server.HttpServer.start(HttpServer.java:255)
at com.sun.jersey.api.container.grizzly2.GrizzlyServerFactory.createHttpServer(GrizzlyServerFactory.java:326)
at com.sun.jersey.api.container.grizzly2.GrizzlyServerFactory.createHttpServer(GrizzlyServerFactory.java:343)
at com.sun.jersey.test.framework.spi.container.grizzly2.web.GrizzlyWebTestContainerFactory$GrizzlyWebTestContainer.instantiateGrizzlyWebServer(GrizzlyWebTestContainerFactory.java:219)
at com.sun.jersey.test.framework.spi.container.grizzly2.web.GrizzlyWebTestContainerFactory$GrizzlyWebTestContainer.<init>(GrizzlyWebTestContainerFactory.java:129)
at com.sun.jersey.test.framework.spi.container.grizzly2.web.GrizzlyWebTestContainerFactory$GrizzlyWebTestContainer.<init>(GrizzlyWebTestContainerFactory.java:86)
at com.sun.jersey.test.framework.spi.container.grizzly2.web.GrizzlyWebTestContainerFactory.create(GrizzlyWebTestContainerFactory.java:79)
at com.sun.jersey.test.framework.JerseyTest.getContainer(JerseyTest.java:342)
at com.sun.jersey.test.framework.JerseyTest.<init>(JerseyTest.java:217)
at org.apache.hadoop.yarn.webapp.JerseyTestBase.<init>(JerseyTestBase.java:27)
at org.apache.hadoop.yarn.server.resourcemanager.webapp.TestRMWebServicesAppsModification.<init>(TestRMWebServicesAppsModification.java:277)
REGRESSION: org.apache.hadoop.yarn.server.resourcemanager.webapp.TestRMWebServicesAppsModification.testAppMove[3]
Error Message:
java.net.BindException: Address already in use
Stack Trace:
com.sun.jersey.test.framework.spi.container.TestContainerException: java.net.BindException: Address already in use
at sun.nio.ch.Net.bind0(Native Method)
at sun.nio.ch.Net.bind(Net.java:444)
at sun.nio.ch.Net.bind(Net.java:436)
at sun.nio.ch.ServerSocketChannelImpl.bind(ServerSocketChannelImpl.java:214)
at sun.nio.ch.ServerSocketAdaptor.bind(ServerSocketAdaptor.java:74)
at org.glassfish.grizzly.nio.transport.TCPNIOTransport.bind(TCPNIOTransport.java:413)
at org.glassfish.grizzly.nio.transport.TCPNIOTransport.bind(TCPNIOTransport.java:384)
at org.glassfish.grizzly.nio.transport.TCPNIOTransport.bind(TCPNIOTransport.java:375)
at org.glassfish.grizzly.http.server.NetworkListener.start(NetworkListener.java:549)
at org.glassfish.grizzly.http.server.HttpServer.start(HttpServer.java:255)
at com.sun.jersey.api.container.grizzly2.GrizzlyServerFactory.createHttpServer(GrizzlyServerFactory.java:326)
at com.sun.jersey.api.container.grizzly2.GrizzlyServerFactory.createHttpServer(GrizzlyServerFactory.java:343)
at com.sun.jersey.test.framework.spi.container.grizzly2.web.GrizzlyWebTestContainerFactory$GrizzlyWebTestContainer.instantiateGrizzlyWebServer(GrizzlyWebTestContainerFactory.java:219)
at com.sun.jersey.test.framework.spi.container.grizzly2.web.GrizzlyWebTestContainerFactory$GrizzlyWebTestContainer.<init>(GrizzlyWebTestContainerFactory.java:129)
at com.sun.jersey.test.framework.spi.container.grizzly2.web.GrizzlyWebTestContainerFactory$GrizzlyWebTestContainer.<init>(GrizzlyWebTestContainerFactory.java:86)
at com.sun.jersey.test.framework.spi.container.grizzly2.web.GrizzlyWebTestContainerFactory.create(GrizzlyWebTestContainerFactory.java:79)
at com.sun.jersey.test.framework.JerseyTest.getContainer(JerseyTest.java:342)
at com.sun.jersey.test.framework.JerseyTest.<init>(JerseyTest.java:217)
at org.apache.hadoop.yarn.webapp.JerseyTestBase.<init>(JerseyTestBase.java:27)
at org.apache.hadoop.yarn.server.resourcemanager.webapp.TestRMWebServicesAppsModification.<init>(TestRMWebServicesAppsModification.java:277)
REGRESSION: org.apache.hadoop.yarn.server.resourcemanager.webapp.TestRMWebServicesAppsModification.testSingleAppKill[3]
Error Message:
java.net.BindException: Address already in use
Stack Trace:
com.sun.jersey.test.framework.spi.container.TestContainerException: java.net.BindException: Address already in use
at sun.nio.ch.Net.bind0(Native Method)
at sun.nio.ch.Net.bind(Net.java:444)
at sun.nio.ch.Net.bind(Net.java:436)
at sun.nio.ch.ServerSocketChannelImpl.bind(ServerSocketChannelImpl.java:214)
at sun.nio.ch.ServerSocketAdaptor.bind(ServerSocketAdaptor.java:74)
at org.glassfish.grizzly.nio.transport.TCPNIOTransport.bind(TCPNIOTransport.java:413)
at org.glassfish.grizzly.nio.transport.TCPNIOTransport.bind(TCPNIOTransport.java:384)
at org.glassfish.grizzly.nio.transport.TCPNIOTransport.bind(TCPNIOTransport.java:375)
at org.glassfish.grizzly.http.server.NetworkListener.start(NetworkListener.java:549)
at org.glassfish.grizzly.http.server.HttpServer.start(HttpServer.java:255)
at com.sun.jersey.api.container.grizzly2.GrizzlyServerFactory.createHttpServer(GrizzlyServerFactory.java:326)
at com.sun.jersey.api.container.grizzly2.GrizzlyServerFactory.createHttpServer(GrizzlyServerFactory.java:343)
at com.sun.jersey.test.framework.spi.container.grizzly2.web.GrizzlyWebTestContainerFactory$GrizzlyWebTestContainer.instantiateGrizzlyWebServer(GrizzlyWebTestContainerFactory.java:219)
at com.sun.jersey.test.framework.spi.container.grizzly2.web.GrizzlyWebTestContainerFactory$GrizzlyWebTestContainer.<init>(GrizzlyWebTestContainerFactory.java:129)
at com.sun.jersey.test.framework.spi.container.grizzly2.web.GrizzlyWebTestContainerFactory$GrizzlyWebTestContainer.<init>(GrizzlyWebTestContainerFactory.java:86)
at com.sun.jersey.test.framework.spi.container.grizzly2.web.GrizzlyWebTestContainerFactory.create(GrizzlyWebTestContainerFactory.java:79)
at com.sun.jersey.test.framework.JerseyTest.getContainer(JerseyTest.java:342)
at com.sun.jersey.test.framework.JerseyTest.<init>(JerseyTest.java:217)
at org.apache.hadoop.yarn.webapp.JerseyTestBase.<init>(JerseyTestBase.java:27)
at org.apache.hadoop.yarn.server.resourcemanager.webapp.TestRMWebServicesAppsModification.<init>(TestRMWebServicesAppsModification.java:277)
REGRESSION: org.apache.hadoop.yarn.server.resourcemanager.webapp.TestRMWebServicesAppsModification.testSingleAppKillInvalidState[3]
Error Message:
java.net.BindException: Address already in use
Stack Trace:
com.sun.jersey.test.framework.spi.container.TestContainerException: java.net.BindException: Address already in use
at sun.nio.ch.Net.bind0(Native Method)
at sun.nio.ch.Net.bind(Net.java:444)
at sun.nio.ch.Net.bind(Net.java:436)
at sun.nio.ch.ServerSocketChannelImpl.bind(ServerSocketChannelImpl.java:214)
at sun.nio.ch.ServerSocketAdaptor.bind(ServerSocketAdaptor.java:74)
at org.glassfish.grizzly.nio.transport.TCPNIOTransport.bind(TCPNIOTransport.java:413)
at org.glassfish.grizzly.nio.transport.TCPNIOTransport.bind(TCPNIOTransport.java:384)
at org.glassfish.grizzly.nio.transport.TCPNIOTransport.bind(TCPNIOTransport.java:375)
at org.glassfish.grizzly.http.server.NetworkListener.start(NetworkListener.java:549)
at org.glassfish.grizzly.http.server.HttpServer.start(HttpServer.java:255)
at com.sun.jersey.api.container.grizzly2.GrizzlyServerFactory.createHttpServer(GrizzlyServerFactory.java:326)
at com.sun.jersey.api.container.grizzly2.GrizzlyServerFactory.createHttpServer(GrizzlyServerFactory.java:343)
at com.sun.jersey.test.framework.spi.container.grizzly2.web.GrizzlyWebTestContainerFactory$GrizzlyWebTestContainer.instantiateGrizzlyWebServer(GrizzlyWebTestContainerFactory.java:219)
at com.sun.jersey.test.framework.spi.container.grizzly2.web.GrizzlyWebTestContainerFactory$GrizzlyWebTestContainer.<init>(GrizzlyWebTestContainerFactory.java:129)
at com.sun.jersey.test.framework.spi.container.grizzly2.web.GrizzlyWebTestContainerFactory$GrizzlyWebTestContainer.<init>(GrizzlyWebTestContainerFactory.java:86)
at com.sun.jersey.test.framework.spi.container.grizzly2.web.GrizzlyWebTestContainerFactory.create(GrizzlyWebTestContainerFactory.java:79)
at com.sun.jersey.test.framework.JerseyTest.getContainer(JerseyTest.java:342)
at com.sun.jersey.test.framework.JerseyTest.<init>(JerseyTest.java:217)
at org.apache.hadoop.yarn.webapp.JerseyTestBase.<init>(JerseyTestBase.java:27)
at org.apache.hadoop.yarn.server.resourcemanager.webapp.TestRMWebServicesAppsModification.<init>(TestRMWebServicesAppsModification.java:277)
REGRESSION: org.apache.hadoop.yarn.server.resourcemanager.webapp.TestRMWebServicesAppsModification.testSingleAppKillUnauthorized[3]
Error Message:
java.net.BindException: Address already in use
Stack Trace:
com.sun.jersey.test.framework.spi.container.TestContainerException: java.net.BindException: Address already in use
at sun.nio.ch.Net.bind0(Native Method)
at sun.nio.ch.Net.bind(Net.java:444)
at sun.nio.ch.Net.bind(Net.java:436)
at sun.nio.ch.ServerSocketChannelImpl.bind(ServerSocketChannelImpl.java:214)
at sun.nio.ch.ServerSocketAdaptor.bind(ServerSocketAdaptor.java:74)
at org.glassfish.grizzly.nio.transport.TCPNIOTransport.bind(TCPNIOTransport.java:413)
at org.glassfish.grizzly.nio.transport.TCPNIOTransport.bind(TCPNIOTransport.java:384)
at org.glassfish.grizzly.nio.transport.TCPNIOTransport.bind(TCPNIOTransport.java:375)
at org.glassfish.grizzly.http.server.NetworkListener.start(NetworkListener.java:549)
at org.glassfish.grizzly.http.server.HttpServer.start(HttpServer.java:255)
at com.sun.jersey.api.container.grizzly2.GrizzlyServerFactory.createHttpServer(GrizzlyServerFactory.java:326)
at com.sun.jersey.api.container.grizzly2.GrizzlyServerFactory.createHttpServer(GrizzlyServerFactory.java:343)
at com.sun.jersey.test.framework.spi.container.grizzly2.web.GrizzlyWebTestContainerFactory$GrizzlyWebTestContainer.instantiateGrizzlyWebServer(GrizzlyWebTestContainerFactory.java:219)
at com.sun.jersey.test.framework.spi.container.grizzly2.web.GrizzlyWebTestContainerFactory$GrizzlyWebTestContainer.<init>(GrizzlyWebTestContainerFactory.java:129)
at com.sun.jersey.test.framework.spi.container.grizzly2.web.GrizzlyWebTestContainerFactory$GrizzlyWebTestContainer.<init>(GrizzlyWebTestContainerFactory.java:86)
at com.sun.jersey.test.framework.spi.container.grizzly2.web.GrizzlyWebTestContainerFactory.create(GrizzlyWebTestContainerFactory.java:79)
at com.sun.jersey.test.framework.JerseyTest.getContainer(JerseyTest.java:342)
at com.sun.jersey.test.framework.JerseyTest.<init>(JerseyTest.java:217)
at org.apache.hadoop.yarn.webapp.JerseyTestBase.<init>(JerseyTestBase.java:27)
at org.apache.hadoop.yarn.server.resourcemanager.webapp.TestRMWebServicesAppsModification.<init>(TestRMWebServicesAppsModification.java:277)
REGRESSION: org.apache.hadoop.yarn.server.resourcemanager.webapp.TestRMWebServicesAppsModification.testGetNewApplication[3]
Error Message:
java.net.BindException: Address already in use
Stack Trace:
com.sun.jersey.test.framework.spi.container.TestContainerException: java.net.BindException: Address already in use
at sun.nio.ch.Net.bind0(Native Method)
at sun.nio.ch.Net.bind(Net.java:444)
at sun.nio.ch.Net.bind(Net.java:436)
at sun.nio.ch.ServerSocketChannelImpl.bind(ServerSocketChannelImpl.java:214)
at sun.nio.ch.ServerSocketAdaptor.bind(ServerSocketAdaptor.java:74)
at org.glassfish.grizzly.nio.transport.TCPNIOTransport.bind(TCPNIOTransport.java:413)
at org.glassfish.grizzly.nio.transport.TCPNIOTransport.bind(TCPNIOTransport.java:384)
at org.glassfish.grizzly.nio.transport.TCPNIOTransport.bind(TCPNIOTransport.java:375)
at org.glassfish.grizzly.http.server.NetworkListener.start(NetworkListener.java:549)
at org.glassfish.grizzly.http.server.HttpServer.start(HttpServer.java:255)
at com.sun.jersey.api.container.grizzly2.GrizzlyServerFactory.createHttpServer(GrizzlyServerFactory.java:326)
at com.sun.jersey.api.container.grizzly2.GrizzlyServerFactory.createHttpServer(GrizzlyServerFactory.java:343)
at com.sun.jersey.test.framework.spi.container.grizzly2.web.GrizzlyWebTestContainerFactory$GrizzlyWebTestContainer.instantiateGrizzlyWebServer(GrizzlyWebTestContainerFactory.java:219)
at com.sun.jersey.test.framework.spi.container.grizzly2.web.GrizzlyWebTestContainerFactory$GrizzlyWebTestContainer.<init>(GrizzlyWebTestContainerFactory.java:129)
at com.sun.jersey.test.framework.spi.container.grizzly2.web.GrizzlyWebTestContainerFactory$GrizzlyWebTestContainer.<init>(GrizzlyWebTestContainerFactory.java:86)
at com.sun.jersey.test.framework.spi.container.grizzly2.web.GrizzlyWebTestContainerFactory.create(GrizzlyWebTestContainerFactory.java:79)
at com.sun.jersey.test.framework.JerseyTest.getContainer(JerseyTest.java:342)
at com.sun.jersey.test.framework.JerseyTest.<init>(JerseyTest.java:217)
at org.apache.hadoop.yarn.webapp.JerseyTestBase.<init>(JerseyTestBase.java:27)
at org.apache.hadoop.yarn.server.resourcemanager.webapp.TestRMWebServicesAppsModification.<init>(TestRMWebServicesAppsModification.java:277)
REGRESSION: org.apache.hadoop.yarn.server.resourcemanager.webapp.TestRMWebServicesAppsModification.testSingleAppKillInvalidId[3]
Error Message:
java.net.BindException: Address already in use
Stack Trace:
com.sun.jersey.test.framework.spi.container.TestContainerException: java.net.BindException: Address already in use
at sun.nio.ch.Net.bind0(Native Method)
at sun.nio.ch.Net.bind(Net.java:444)
at sun.nio.ch.Net.bind(Net.java:436)
at sun.nio.ch.ServerSocketChannelImpl.bind(ServerSocketChannelImpl.java:214)
at sun.nio.ch.ServerSocketAdaptor.bind(ServerSocketAdaptor.java:74)
at org.glassfish.grizzly.nio.transport.TCPNIOTransport.bind(TCPNIOTransport.java:413)
at org.glassfish.grizzly.nio.transport.TCPNIOTransport.bind(TCPNIOTransport.java:384)
at org.glassfish.grizzly.nio.transport.TCPNIOTransport.bind(TCPNIOTransport.java:375)
at org.glassfish.grizzly.http.server.NetworkListener.start(NetworkListener.java:549)
at org.glassfish.grizzly.http.server.HttpServer.start(HttpServer.java:255)
at com.sun.jersey.api.container.grizzly2.GrizzlyServerFactory.createHttpServer(GrizzlyServerFactory.java:326)
at com.sun.jersey.api.container.grizzly2.GrizzlyServerFactory.createHttpServer(GrizzlyServerFactory.java:343)
at com.sun.jersey.test.framework.spi.container.grizzly2.web.GrizzlyWebTestContainerFactory$GrizzlyWebTestContainer.instantiateGrizzlyWebServer(GrizzlyWebTestContainerFactory.java:219)
at com.sun.jersey.test.framework.spi.container.grizzly2.web.GrizzlyWebTestContainerFactory$GrizzlyWebTestContainer.<init>(GrizzlyWebTestContainerFactory.java:129)
at com.sun.jersey.test.framework.spi.container.grizzly2.web.GrizzlyWebTestContainerFactory$GrizzlyWebTestContainer.<init>(GrizzlyWebTestContainerFactory.java:86)
at com.sun.jersey.test.framework.spi.container.grizzly2.web.GrizzlyWebTestContainerFactory.create(GrizzlyWebTestContainerFactory.java:79)
at com.sun.jersey.test.framework.JerseyTest.getContainer(JerseyTest.java:342)
at com.sun.jersey.test.framework.JerseyTest.<init>(JerseyTest.java:217)
at org.apache.hadoop.yarn.webapp.JerseyTestBase.<init>(JerseyTestBase.java:27)
at org.apache.hadoop.yarn.server.resourcemanager.webapp.TestRMWebServicesAppsModification.<init>(TestRMWebServicesAppsModification.java:277)
REGRESSION: org.apache.hadoop.yarn.server.resourcemanager.webapp.TestRMWebServicesAppsModification.testSingleAppState[3]
Error Message:
java.net.BindException: Address already in use
Stack Trace:
com.sun.jersey.test.framework.spi.container.TestContainerException: java.net.BindException: Address already in use
at sun.nio.ch.Net.bind0(Native Method)
at sun.nio.ch.Net.bind(Net.java:444)
at sun.nio.ch.Net.bind(Net.java:436)
at sun.nio.ch.ServerSocketChannelImpl.bind(ServerSocketChannelImpl.java:214)
at sun.nio.ch.ServerSocketAdaptor.bind(ServerSocketAdaptor.java:74)
at org.glassfish.grizzly.nio.transport.TCPNIOTransport.bind(TCPNIOTransport.java:413)
at org.glassfish.grizzly.nio.transport.TCPNIOTransport.bind(TCPNIOTransport.java:384)
at org.glassfish.grizzly.nio.transport.TCPNIOTransport.bind(TCPNIOTransport.java:375)
at org.glassfish.grizzly.http.server.NetworkListener.start(NetworkListener.java:549)
at org.glassfish.grizzly.http.server.HttpServer.start(HttpServer.java:255)
at com.sun.jersey.api.container.grizzly2.GrizzlyServerFactory.createHttpServer(GrizzlyServerFactory.java:326)
at com.sun.jersey.api.container.grizzly2.GrizzlyServerFactory.createHttpServer(GrizzlyServerFactory.java:343)
at com.sun.jersey.test.framework.spi.container.grizzly2.web.GrizzlyWebTestContainerFactory$GrizzlyWebTestContainer.instantiateGrizzlyWebServer(GrizzlyWebTestContainerFactory.java:219)
at com.sun.jersey.test.framework.spi.container.grizzly2.web.GrizzlyWebTestContainerFactory$GrizzlyWebTestContainer.<init>(GrizzlyWebTestContainerFactory.java:129)
at com.sun.jersey.test.framework.spi.container.grizzly2.web.GrizzlyWebTestContainerFactory$GrizzlyWebTestContainer.<init>(GrizzlyWebTestContainerFactory.java:86)
at com.sun.jersey.test.framework.spi.container.grizzly2.web.GrizzlyWebTestContainerFactory.create(GrizzlyWebTestContainerFactory.java:79)
at com.sun.jersey.test.framework.JerseyTest.getContainer(JerseyTest.java:342)
at com.sun.jersey.test.framework.JerseyTest.<init>(JerseyTest.java:217)
at org.apache.hadoop.yarn.webapp.JerseyTestBase.<init>(JerseyTestBase.java:27)
at org.apache.hadoop.yarn.server.resourcemanager.webapp.TestRMWebServicesAppsModification.<init>(TestRMWebServicesAppsModification.java:277)
REGRESSION: org.apache.hadoop.yarn.server.resourcemanager.webapp.TestRMWebServicesAppsModification.testGetNewApplicationAndSubmit[3]
Error Message:
java.net.BindException: Address already in use
Stack Trace:
com.sun.jersey.test.framework.spi.container.TestContainerException: java.net.BindException: Address already in use
at sun.nio.ch.Net.bind0(Native Method)
at sun.nio.ch.Net.bind(Net.java:444)
at sun.nio.ch.Net.bind(Net.java:436)
at sun.nio.ch.ServerSocketChannelImpl.bind(ServerSocketChannelImpl.java:214)
at sun.nio.ch.ServerSocketAdaptor.bind(ServerSocketAdaptor.java:74)
at org.glassfish.grizzly.nio.transport.TCPNIOTransport.bind(TCPNIOTransport.java:413)
at org.glassfish.grizzly.nio.transport.TCPNIOTransport.bind(TCPNIOTransport.java:384)
at org.glassfish.grizzly.nio.transport.TCPNIOTransport.bind(TCPNIOTransport.java:375)
at org.glassfish.grizzly.http.server.NetworkListener.start(NetworkListener.java:549)
at org.glassfish.grizzly.http.server.HttpServer.start(HttpServer.java:255)
at com.sun.jersey.api.container.grizzly2.GrizzlyServerFactory.createHttpServer(GrizzlyServerFactory.java:326)
at com.sun.jersey.api.container.grizzly2.GrizzlyServerFactory.createHttpServer(GrizzlyServerFactory.java:343)
at com.sun.jersey.test.framework.spi.container.grizzly2.web.GrizzlyWebTestContainerFactory$GrizzlyWebTestContainer.instantiateGrizzlyWebServer(GrizzlyWebTestContainerFactory.java:219)
at com.sun.jersey.test.framework.spi.container.grizzly2.web.GrizzlyWebTestContainerFactory$GrizzlyWebTestContainer.<init>(GrizzlyWebTestContainerFactory.java:129)
at com.sun.jersey.test.framework.spi.container.grizzly2.web.GrizzlyWebTestContainerFactory$GrizzlyWebTestContainer.<init>(GrizzlyWebTestContainerFactory.java:86)
at com.sun.jersey.test.framework.spi.container.grizzly2.web.GrizzlyWebTestContainerFactory.create(GrizzlyWebTestContainerFactory.java:79)
at com.sun.jersey.test.framework.JerseyTest.getContainer(JerseyTest.java:342)
at com.sun.jersey.test.framework.JerseyTest.<init>(JerseyTest.java:217)
at org.apache.hadoop.yarn.webapp.JerseyTestBase.<init>(JerseyTestBase.java:27)
at org.apache.hadoop.yarn.server.resourcemanager.webapp.TestRMWebServicesAppsModification.<init>(TestRMWebServicesAppsModification.java:277)
REGRESSION: org.apache.hadoop.yarn.server.resourcemanager.webapp.TestRMWebServicesAppsModification.testAppSubmitBadJsonAndXML[3]
Error Message:
java.net.BindException: Address already in use
Stack Trace:
com.sun.jersey.test.framework.spi.container.TestContainerException: java.net.BindException: Address already in use
at sun.nio.ch.Net.bind0(Native Method)
at sun.nio.ch.Net.bind(Net.java:444)
at sun.nio.ch.Net.bind(Net.java:436)
at sun.nio.ch.ServerSocketChannelImpl.bind(ServerSocketChannelImpl.java:214)
at sun.nio.ch.ServerSocketAdaptor.bind(ServerSocketAdaptor.java:74)
at org.glassfish.grizzly.nio.transport.TCPNIOTransport.bind(TCPNIOTransport.java:413)
at org.glassfish.grizzly.nio.transport.TCPNIOTransport.bind(TCPNIOTransport.java:384)
at org.glassfish.grizzly.nio.transport.TCPNIOTransport.bind(TCPNIOTransport.java:375)
at org.glassfish.grizzly.http.server.NetworkListener.start(NetworkListener.java:549)
at org.glassfish.grizzly.http.server.HttpServer.start(HttpServer.java:255)
at com.sun.jersey.api.container.grizzly2.GrizzlyServerFactory.createHttpServer(GrizzlyServerFactory.java:326)
at com.sun.jersey.api.container.grizzly2.GrizzlyServerFactory.createHttpServer(GrizzlyServerFactory.java:343)
at com.sun.jersey.test.framework.spi.container.grizzly2.web.GrizzlyWebTestContainerFactory$GrizzlyWebTestContainer.instantiateGrizzlyWebServer(GrizzlyWebTestContainerFactory.java:219)
at com.sun.jersey.test.framework.spi.container.grizzly2.web.GrizzlyWebTestContainerFactory$GrizzlyWebTestContainer.<init>(GrizzlyWebTestContainerFactory.java:129)
at com.sun.jersey.test.framework.spi.container.grizzly2.web.GrizzlyWebTestContainerFactory$GrizzlyWebTestContainer.<init>(GrizzlyWebTestContainerFactory.java:86)
at com.sun.jersey.test.framework.spi.container.grizzly2.web.GrizzlyWebTestContainerFactory.create(GrizzlyWebTestContainerFactory.java:79)
at com.sun.jersey.test.framework.JerseyTest.getContainer(JerseyTest.java:342)
at com.sun.jersey.test.framework.JerseyTest.<init>(JerseyTest.java:217)
at org.apache.hadoop.yarn.webapp.JerseyTestBase.<init>(JerseyTestBase.java:27)
at org.apache.hadoop.yarn.server.resourcemanager.webapp.TestRMWebServicesAppsModification.<init>(TestRMWebServicesAppsModification.java:277)
Failed: YARN-3717 PreCommit Build #8930
Posted by Apache Jenkins Server <je...@builds.apache.org>.
Jira: https://issues.apache.org/jira/browse/YARN-3717
Build: https://builds.apache.org/job/PreCommit-YARN-Build/8930/
###################################################################################
########################## LAST 60 LINES OF THE CONSOLE ###########################
[...truncated 474 lines...]
| +1 | yarn tests | 2m 1s | Tests passed in hadoop-yarn-common.
| +1 | yarn tests | 3m 57s | Tests passed in
| | | | hadoop-yarn-server-applicationhistory
| | | | service.
| +1 | yarn tests | 0m 24s | Tests passed in
| | | | hadoop-yarn-server-common.
| +1 | yarn tests | 58m 0s | Tests passed in
| | | | hadoop-yarn-server-resourcemanager.
| | | 131m 34s |
|| Subsystem || Report/Notes ||
============================================================================
| Patch URL | http://issues.apache.org/jira/secure/attachment/12752747/YARN-3717.20150826-1.patch |
| Optional Tests | javadoc javac unit findbugs checkstyle site |
| git revision | trunk / 0bf2854 |
| Pre-patch Findbugs warnings | /home/jenkins/jenkins-slave/workspace/PreCommit-YARN-Build/patchprocess/trunkFindbugsWarningshadoop-yarn-server-common.html |
| checkstyle | /home/jenkins/jenkins-slave/workspace/PreCommit-YARN-Build/patchprocess/diffcheckstylehadoop-yarn-api.txt |
| hadoop-yarn-api test log | /home/jenkins/jenkins-slave/workspace/PreCommit-YARN-Build/patchprocess/testrun_hadoop-yarn-api.txt |
| hadoop-yarn-client test log | /home/jenkins/jenkins-slave/workspace/PreCommit-YARN-Build/patchprocess/testrun_hadoop-yarn-client.txt |
| hadoop-yarn-common test log | /home/jenkins/jenkins-slave/workspace/PreCommit-YARN-Build/patchprocess/testrun_hadoop-yarn-common.txt |
| hadoop-yarn-server-applicationhistoryservice test log | /home/jenkins/jenkins-slave/workspace/PreCommit-YARN-Build/patchprocess/testrun_hadoop-yarn-server-applicationhistoryservice.txt |
| hadoop-yarn-server-common test log | /home/jenkins/jenkins-slave/workspace/PreCommit-YARN-Build/patchprocess/testrun_hadoop-yarn-server-common.txt |
| hadoop-yarn-server-resourcemanager test log | /home/jenkins/jenkins-slave/workspace/PreCommit-YARN-Build/patchprocess/testrun_hadoop-yarn-server-resourcemanager.txt |
| Test Results | https://builds.apache.org/job/PreCommit-YARN-Build/8930/testReport/ |
| Java | 1.7.0_55 |
| uname | Linux asf908.gq1.ygridcore.net 3.13.0-36-lowlatency #63-Ubuntu SMP PREEMPT Wed Sep 3 21:56:12 UTC 2014 x86_64 x86_64 x86_64 GNU/Linux |
============================================================================
============================================================================
Adding comment to JIRA
============================================================================
============================================================================
Comment added.
1498db927e86484db3f1dbafe5eb782fde31994c logged out
============================================================================
============================================================================
Finished build.
============================================================================
============================================================================
Build step 'Execute shell' marked build as failure
Archiving artifacts
Sending artifact delta relative to PreCommit-YARN-Build #8916
Archived 102 artifacts
Archive block size is 32768
Received 285 blocks and 26086998 bytes
Compression is 26.4%
Took 5.4 sec
[description-setter] Could not determine description.
Recording test results
Email was triggered for: Failure
Sending email for trigger: Failure
###################################################################################
############################## FAILED TESTS (if any) ##############################
All tests passed
Failed: YARN-3893 PreCommit Build #8929
Posted by Apache Jenkins Server <je...@builds.apache.org>.
Jira: https://issues.apache.org/jira/browse/YARN-3893
Build: https://builds.apache.org/job/PreCommit-YARN-Build/8929/
###################################################################################
########################## LAST 60 LINES OF THE CONSOLE ###########################
[...truncated 289 lines...]
| +1 | whitespace | 0m 0s | The patch has no lines that end in
| | | | whitespace.
| +1 | install | 1m 30s | mvn install still works.
| +1 | eclipse:eclipse | 0m 33s | The patch built with
| | | | eclipse:eclipse.
| +1 | findbugs | 1m 32s | The patch does not introduce any
| | | | new Findbugs (version 3.0.0)
| | | | warnings.
| -1 | yarn tests | 53m 42s | Tests failed in
| | | | hadoop-yarn-server-resourcemanager.
| | | 92m 44s |
Reason | Tests
Failed unit tests | hadoop.yarn.server.resourcemanager.scheduler.fair.TestAllocationFileLoaderService
| hadoop.yarn.server.resourcemanager.webapp.TestRMWebServicesHttpStaticUserPermissions
|| Subsystem || Report/Notes ||
============================================================================
| Patch URL | http://issues.apache.org/jira/secure/attachment/12752740/0010-YARN-3893.patch |
| Optional Tests | javadoc javac unit findbugs checkstyle |
| git revision | trunk / 0bf2854 |
| hadoop-yarn-server-resourcemanager test log | /home/jenkins/jenkins-slave/workspace/PreCommit-YARN-Build@2/patchprocess/testrun_hadoop-yarn-server-resourcemanager.txt |
| Test Results | https://builds.apache.org/job/PreCommit-YARN-Build/8929/testReport/ |
| Java | 1.7.0_55 |
| uname | Linux asf905.gq1.ygridcore.net 3.13.0-36-lowlatency #63-Ubuntu SMP PREEMPT Wed Sep 3 21:56:12 UTC 2014 x86_64 x86_64 x86_64 GNU/Linux |
============================================================================
============================================================================
Adding comment to JIRA
============================================================================
============================================================================
Comment added.
58ce9f96c47e72e15febe85b4a3c8c060a566e70 logged out
============================================================================
============================================================================
Finished build.
============================================================================
============================================================================
Build step 'Execute shell' marked build as failure
Archiving artifacts
Sending artifact delta relative to PreCommit-YARN-Build #8916
Archived 29 artifacts
Archive block size is 32768
Received 20 blocks and 13099792 bytes
Compression is 4.8%
Took 2.6 sec
[description-setter] Could not determine description.
Recording test results
Email was triggered for: Failure
Sending email for trigger: Failure
###################################################################################
############################## FAILED TESTS (if any) ##############################
2 tests failed.
REGRESSION: org.apache.hadoop.yarn.server.resourcemanager.scheduler.fair.TestAllocationFileLoaderService.testGetAllocationFileFromClasspath
Error Message:
null
Stack Trace:
java.lang.AssertionError: null
at org.junit.Assert.fail(Assert.java:86)
at org.junit.Assert.assertTrue(Assert.java:41)
at org.junit.Assert.assertTrue(Assert.java:52)
at org.apache.hadoop.yarn.server.resourcemanager.scheduler.fair.TestAllocationFileLoaderService.testGetAllocationFileFromClasspath(TestAllocationFileLoaderService.java:54)
FAILED: org.apache.hadoop.yarn.server.resourcemanager.webapp.TestRMWebServicesHttpStaticUserPermissions.org.apache.hadoop.yarn.server.resourcemanager.webapp.TestRMWebServicesHttpStaticUserPermissions
Error Message:
org/apache/hadoop/yarn/exceptions/YarnRuntimeException
Stack Trace:
java.lang.NoClassDefFoundError: org/apache/hadoop/yarn/exceptions/YarnRuntimeException
at java.net.URLClassLoader$1.run(URLClassLoader.java:366)
at java.net.URLClassLoader$1.run(URLClassLoader.java:355)
at java.security.AccessController.doPrivileged(Native Method)
at java.net.URLClassLoader.findClass(URLClassLoader.java:354)
at java.lang.ClassLoader.loadClass(ClassLoader.java:425)
at sun.misc.Launcher$AppClassLoader.loadClass(Launcher.java:308)
at java.lang.ClassLoader.loadClass(ClassLoader.java:358)
at org.apache.hadoop.yarn.server.resourcemanager.webapp.TestRMWebServicesHttpStaticUserPermissions.setupAndStartRM(TestRMWebServicesHttpStaticUserPermissions.java:112)
at org.apache.hadoop.yarn.server.resourcemanager.webapp.TestRMWebServicesHttpStaticUserPermissions.setUp(TestRMWebServicesHttpStaticUserPermissions.java:78)
Failed: YARN-4067 PreCommit Build #8928
Posted by Apache Jenkins Server <je...@builds.apache.org>.
Jira: https://issues.apache.org/jira/browse/YARN-4067
Build: https://builds.apache.org/job/PreCommit-YARN-Build/8928/
###################################################################################
########################## LAST 60 LINES OF THE CONSOLE ###########################
[...truncated 280 lines...]
| +1 | release audit | 0m 24s | The applied patch does not increase
| | | | the total number of release audit
| | | | warnings.
| +1 | checkstyle | 0m 50s | There were no new checkstyle
| | | | issues.
| +1 | whitespace | 0m 0s | The patch has no lines that end in
| | | | whitespace.
| +1 | install | 1m 30s | mvn install still works.
| +1 | eclipse:eclipse | 0m 33s | The patch built with
| | | | eclipse:eclipse.
| +1 | findbugs | 1m 28s | The patch does not introduce any
| | | | new Findbugs (version 3.0.0)
| | | | warnings.
| +1 | yarn tests | 58m 12s | Tests passed in
| | | | hadoop-yarn-server-resourcemanager.
| | | 97m 54s |
|| Subsystem || Report/Notes ||
============================================================================
| Patch URL | http://issues.apache.org/jira/secure/attachment/12751600/YARN-4067.patch |
| Optional Tests | javadoc javac unit findbugs checkstyle |
| git revision | trunk / 0bf2854 |
| hadoop-yarn-server-resourcemanager test log | /home/jenkins/jenkins-slave/workspace/PreCommit-YARN-Build/patchprocess/testrun_hadoop-yarn-server-resourcemanager.txt |
| Test Results | https://builds.apache.org/job/PreCommit-YARN-Build/8928/testReport/ |
| Java | 1.7.0_55 |
| uname | Linux asf908.gq1.ygridcore.net 3.13.0-36-lowlatency #63-Ubuntu SMP PREEMPT Wed Sep 3 21:56:12 UTC 2014 x86_64 x86_64 x86_64 GNU/Linux |
============================================================================
============================================================================
Adding comment to JIRA
============================================================================
============================================================================
Comment added.
550aecc4376cdbec78e25c8501ec2e267dc0a0dd logged out
============================================================================
============================================================================
Finished build.
============================================================================
============================================================================
Build step 'Execute shell' marked build as failure
Archiving artifacts
Sending artifact delta relative to PreCommit-YARN-Build #8916
Archived 29 artifacts
Archive block size is 32768
Received 344 blocks and 2054627 bytes
Compression is 84.6%
Took 0.7 sec
[description-setter] Could not determine description.
Recording test results
Email was triggered for: Failure
Sending email for trigger: Failure
###################################################################################
############################## FAILED TESTS (if any) ##############################
All tests passed