You are viewing a plain text version of this content. The canonical link for it is here.
Posted to builds@beam.apache.org by Apache Jenkins Server <je...@builds.apache.org> on 2022/01/01 12:03:43 UTC

Build failed in Jenkins: beam_PostCommit_Go #9307

See <https://ci-beam.apache.org/job/beam_PostCommit_Go/9307/display/redirect>

Changes:


------------------------------------------
[...truncated 7.63 KB...]
go1.16.12: already downloaded in /home/jenkins/sdk/go1.16.12
GOCMD=/home/jenkins/go/bin/go1.16.12

> Task :model:pipeline:extractIncludeProto
> Task :model:pipeline:extractProto
> Task :model:pipeline:generateProto FROM-CACHE
> Task :model:pipeline:compileJava FROM-CACHE
> Task :model:pipeline:processResources
> Task :model:pipeline:classes
> Task :model:pipeline:jar
> Task :model:fn-execution:extractIncludeProto
> Task :model:fn-execution:extractProto
> Task :model:fn-execution:generateProto FROM-CACHE
> Task :model:fn-execution:compileJava FROM-CACHE
> Task :model:fn-execution:processResources
> Task :model:fn-execution:classes
> Task :model:pipeline:shadowJar FROM-CACHE
> Task :model:fn-execution:shadowJar FROM-CACHE
> Task :model:job-management:extractIncludeProto
> Task :model:job-management:extractProto
> Task :model:job-management:generateProto FROM-CACHE
> Task :model:job-management:compileJava FROM-CACHE
> Task :model:job-management:processResources
> Task :model:job-management:classes
> Task :model:job-management:shadowJar FROM-CACHE
> Task :sdks:java:core:generateAvroProtocol NO-SOURCE
> Task :sdks:java:core:generateAvroJava NO-SOURCE
> Task :sdks:java:core:generateGrammarSource FROM-CACHE
> Task :sdks:java:core:compileJava FROM-CACHE
> Task :sdks:java:core:processResources
> Task :sdks:java:core:classes
> Task :sdks:java:core:shadowJar FROM-CACHE
> Task :sdks:java:fn-execution:compileJava FROM-CACHE
> Task :sdks:java:fn-execution:processResources NO-SOURCE
> Task :sdks:java:fn-execution:classes UP-TO-DATE
> Task :sdks:java:fn-execution:jar
> Task :runners:core-construction-java:compileJava FROM-CACHE
> Task :runners:core-construction-java:processResources NO-SOURCE
> Task :runners:core-construction-java:classes UP-TO-DATE
> Task :runners:core-construction-java:jar
> Task :runners:core-java:compileJava FROM-CACHE
> Task :runners:core-java:processResources NO-SOURCE
> Task :runners:core-java:classes UP-TO-DATE
> Task :runners:core-java:jar
> Task :sdks:java:extensions:google-cloud-platform-core:compileJava FROM-CACHE
> Task :sdks:java:extensions:google-cloud-platform-core:processResources NO-SOURCE
> Task :sdks:java:extensions:google-cloud-platform-core:classes UP-TO-DATE
> Task :sdks:java:extensions:google-cloud-platform-core:jar
> Task :sdks:java:harness:compileJava FROM-CACHE
> Task :sdks:java:harness:processResources NO-SOURCE
> Task :sdks:java:harness:classes UP-TO-DATE
> Task :sdks:java:harness:jar
> Task :runners:java-fn-execution:compileJava FROM-CACHE
> Task :runners:java-fn-execution:processResources NO-SOURCE
> Task :runners:java-fn-execution:classes UP-TO-DATE
> Task :runners:java-fn-execution:jar
> Task :sdks:java:expansion-service:compileJava FROM-CACHE
> Task :sdks:java:expansion-service:processResources NO-SOURCE
> Task :sdks:java:expansion-service:classes UP-TO-DATE
> Task :sdks:java:expansion-service:jar
> Task :sdks:java:extensions:arrow:compileJava FROM-CACHE
> Task :sdks:java:extensions:arrow:processResources NO-SOURCE
> Task :sdks:java:extensions:arrow:classes UP-TO-DATE
> Task :sdks:java:extensions:arrow:jar
> Task :sdks:java:extensions:protobuf:extractIncludeProto
> Task :sdks:java:extensions:protobuf:extractProto
> Task :sdks:java:extensions:protobuf:generateProto NO-SOURCE
> Task :sdks:java:extensions:protobuf:compileJava FROM-CACHE
> Task :sdks:java:extensions:protobuf:processResources NO-SOURCE
> Task :sdks:java:extensions:protobuf:classes UP-TO-DATE
> Task :sdks:java:extensions:protobuf:jar
> Task :sdks:java:io:google-cloud-platform:compileJava FROM-CACHE
> Task :sdks:java:io:google-cloud-platform:processResources NO-SOURCE
> Task :sdks:java:io:google-cloud-platform:classes UP-TO-DATE
> Task :sdks:java:io:google-cloud-platform:jar
> Task :sdks:java:io:kafka:compileJava FROM-CACHE
> Task :sdks:java:io:kafka:processResources NO-SOURCE
> Task :sdks:java:io:kafka:classes UP-TO-DATE
> Task :sdks:java:io:kafka:jar
> Task :runners:google-cloud-dataflow-java:compileJava FROM-CACHE
> Task :runners:google-cloud-dataflow-java:processResources
> Task :runners:google-cloud-dataflow-java:classes
> Task :runners:google-cloud-dataflow-java:jar
> Task :runners:google-cloud-dataflow-java:worker:windmill:extractIncludeProto
> Task :runners:google-cloud-dataflow-java:worker:windmill:extractProto
> Task :runners:google-cloud-dataflow-java:worker:windmill:generateProto FROM-CACHE
> Task :runners:google-cloud-dataflow-java:worker:windmill:compileJava FROM-CACHE
> Task :runners:google-cloud-dataflow-java:worker:windmill:processResources
> Task :runners:google-cloud-dataflow-java:worker:windmill:classes
> Task :runners:google-cloud-dataflow-java:worker:windmill:shadowJar FROM-CACHE
> Task :runners:google-cloud-dataflow-java:worker:compileJava FROM-CACHE
> Task :runners:google-cloud-dataflow-java:worker:processResources
> Task :runners:google-cloud-dataflow-java:worker:classes
> Task :runners:google-cloud-dataflow-java:worker:shadowJar FROM-CACHE
> Task :sdks:go:test:assemble UP-TO-DATE
> Task :sdks:go:test:test UP-TO-DATE
> Task :sdks:go:test:check UP-TO-DATE
> Task :sdks:go:test:build UP-TO-DATE

> Task :goIntegrationTests
$ TESTS=./test/integration/... ./test/regression
$ RUNNER=portable
$ TIMEOUT=2h
$ SIMULTANEOUS=3
$ GCS_LOCATION=gs://temp-storage-for-end-to-end-tests
$ PROJECT=apache-beam-testing
$ DATAFLOW_PROJECT=apache-beam-testing
$ REGION=us-central1
$ trap exit_background_processes SIGINT SIGTERM EXIT
$ key=--runner
$ case --runner in
$ RUNNER=dataflow
$ cd <https://ci-beam.apache.org/job/beam_PostCommit_Go/ws/src>
$ test -d sdks/go/test
$ DATAFLOW_WORKER_JAR=<https://ci-beam.apache.org/job/beam_PostCommit_Go/ws/src/runners/google-cloud-dataflow-java/worker/build/libs/beam-runners-google-cloud-dataflow-java-fn-api-worker-2.36.0-SNAPSHOT.jar>
Using Dataflow worker jar: <https://ci-beam.apache.org/job/beam_PostCommit_Go/ws/src/runners/google-cloud-dataflow-java/worker/build/libs/beam-runners-google-cloud-dataflow-java-fn-api-worker-2.36.0-SNAPSHOT.jar>
$ command -v docker
/usr/bin/docker
$ docker -v
Docker version 18.09.4, build d14af54
$ command -v gcloud
/usr/bin/gcloud
$ gcloud --version
Google Cloud SDK 212.0.0
alpha 2018.08.13
beta 2018.08.13
bq 2.0.34
core 2018.08.13
gsutil 4.33
$ TMPDIR=/tmp/tmp.vTb3gdBCv6
$ gcloud_ver=212.0.0
$ TAG=20220101-120214
$ CONTAINER=us.gcr.io/apache-beam-testing/jenkins/beam_go_sdk
Using container us.gcr.io/apache-beam-testing/jenkins/beam_go_sdk
$ ./gradlew :sdks:go:container:docker -Pdocker-repository-root=us.gcr.io/apache-beam-testing/jenkins -Pdocker-tag=20220101-120214
Configuration on demand is an incubating feature.
> Task :buildSrc:compileJava NO-SOURCE
> Task :buildSrc:compileGroovy UP-TO-DATE
> Task :buildSrc:pluginDescriptors UP-TO-DATE
> Task :buildSrc:processResources UP-TO-DATE
> Task :buildSrc:classes UP-TO-DATE
> Task :buildSrc:jar UP-TO-DATE
> Task :buildSrc:assemble UP-TO-DATE
> Task :buildSrc:spotlessGroovy UP-TO-DATE
> Task :buildSrc:spotlessGroovyCheck UP-TO-DATE
> Task :buildSrc:spotlessGroovyGradle UP-TO-DATE
> Task :buildSrc:spotlessGroovyGradleCheck UP-TO-DATE
> Task :buildSrc:spotlessCheck UP-TO-DATE
> Task :buildSrc:pluginUnderTestMetadata UP-TO-DATE
> Task :buildSrc:compileTestJava NO-SOURCE
> Task :buildSrc:compileTestGroovy NO-SOURCE
> Task :buildSrc:processTestResources NO-SOURCE
> Task :buildSrc:testClasses UP-TO-DATE
> Task :buildSrc:test NO-SOURCE
> Task :buildSrc:validatePlugins UP-TO-DATE
> Task :buildSrc:check UP-TO-DATE
> Task :buildSrc:build UP-TO-DATE

go1.16.12: already downloaded in /home/jenkins/sdk/go1.16.12
> Configure project :sdks:go
System Go installation: /usr/bin/go is go version go1.16.12 linux/amd64; Preparing to use /home/jenkins/go/bin/go1.16.12
GOCMD=/home/jenkins/go/bin/go1.16.12

> Configure project :sdks:go:container
System Go installation: /usr/bin/go is go version go1.16.12 linux/amd64; Preparing to use /home/jenkins/go/bin/go1.16.12
GOCMD=/home/jenkins/go/bin/go1.16.12
go1.16.12: already downloaded in /home/jenkins/sdk/go1.16.12

> Task :sdks:go:goPrepare UP-TO-DATE
> Task :sdks:go:container:copyLicenses
> Task :sdks:go:container:dockerClean UP-TO-DATE

> Task :sdks:go:container:goBuild
/home/jenkins/go/bin/go1.16.12 build -o ./build/target/linux_amd64/boot boot.go

> Task :sdks:go:container:skipPullLicenses
> Task :sdks:go:container:dockerPrepare
> Task :sdks:go:container:docker
The message received from the daemon indicates that the daemon has disappeared.
Build request sent: Build{id=10c1d892-6ca4-4509-bfef-6f132b18c202, currentDir=<https://ci-beam.apache.org/job/beam_PostCommit_Go/ws/src}>
Attempting to read last messages from the daemon log...
Daemon pid: 8545
  log file: /home/jenkins/.gradle/daemon/7.3.2/daemon-8545.out.log
----- Last  20 lines from daemon log file - daemon-8545.out.log -----
2022-01-01T12:02:15.902+0000 [DEBUG] [org.gradle.launcher.daemon.server.exec.ExecuteBuild] The daemon has started executing the build.
2022-01-01T12:02:15.902+0000 [DEBUG] [org.gradle.launcher.daemon.server.exec.ExecuteBuild] Executing build with daemon context: DefaultDaemonContext[uid=3e101579-9598-4bd5-8267-0e4c3e35991f,javaHome=/usr/lib/jvm/java-8-openjdk-amd64,daemonRegistryDir=/home/jenkins/.gradle/daemon,pid=8545,idleTimeout=10800000,priority=NORMAL,daemonOpts=-Xss10240k,-Dfile.encoding=UTF-8,-Duser.country=US,-Duser.language=en,-Duser.variant]
Configuration on demand is an incubating feature.
System Go installation: /usr/bin/go is go version go1.16.12 linux/amd64; Preparing to use /home/jenkins/go/bin/go1.16.12
go1.16.12: already downloaded in /home/jenkins/sdk/go1.16.12
GOCMD=/home/jenkins/go/bin/go1.16.12
System Go installation: /usr/bin/go is go version go1.16.12 linux/amd64; Preparing to use /home/jenkins/go/bin/go1.16.12
go1.16.12: already downloaded in /home/jenkins/sdk/go1.16.12
GOCMD=/home/jenkins/go/bin/go1.16.12
/home/jenkins/go/bin/go1.16.12 build -o ./build/target/linux_amd64/boot boot.go

Deprecated Gradle features were used in this build, making it incompatible with Gradle 8.0.

You can use '--warning-mode all' to show the individual deprecation warnings and determine if they come from your own scripts or plugins.

See https://docs.gradle.org/7.3.2/userguide/command_line_interface.html#sec:command_line_warnings

BUILD SUCCESSFUL in 1m 24s
16 actionable tasks: 5 executed, 11 up-to-date
Daemon vm is shutting down... The daemon has exited normally or was terminated in response to a user interrupt.
----- End of the daemon log -----


FAILURE: Build failed with an exception.

* What went wrong:
Gradle build daemon disappeared unexpectedly (it may have been killed or may have crashed)

* Try:
> Run with --stacktrace option to get the stack trace.
> Run with --info or --debug option to get more log output.
> Run with --scan to get full insights.

* Get more help at https://help.gradle.org
$ ./gradlew :sdks:go:container:docker -Pdocker-repository-root=us.gcr.io/apache-beam-testing/jenkins -Pdocker-tag=20220101-120214

> Task :goIntegrationTests FAILED

FAILURE: Build failed with an exception.

* What went wrong:
Execution failed for task ':goIntegrationTests'.
> Process 'command 'sh'' finished with non-zero exit value 1

* Try:
> Run with --stacktrace option to get the stack trace.
> Run with --info or --debug option to get more log output.
> Run with --scan to get full insights.

* Get more help at https://help.gradle.org

Deprecated Gradle features were used in this build, making it incompatible with Gradle 8.0.

You can use '--warning-mode all' to show the individual deprecation warnings and determine if they come from your own scripts or plugins.

See https://docs.gradle.org/7.3.2/userguide/command_line_interface.html#sec:command_line_warnings

BUILD FAILED in 3m 11s
70 actionable tasks: 35 executed, 33 from cache, 2 up-to-date

Publishing build scan...
https://gradle.com/s/sn3qunwh6umei

Build step 'Invoke Gradle script' changed build result to FAILURE
Build step 'Invoke Gradle script' marked build as failure

---------------------------------------------------------------------
To unsubscribe, e-mail: builds-unsubscribe@beam.apache.org
For additional commands, e-mail: builds-help@beam.apache.org


Jenkins build is back to normal : beam_PostCommit_Go #9308

Posted by Apache Jenkins Server <je...@builds.apache.org>.
See <https://ci-beam.apache.org/job/beam_PostCommit_Go/9308/display/redirect>


---------------------------------------------------------------------
To unsubscribe, e-mail: builds-unsubscribe@beam.apache.org
For additional commands, e-mail: builds-help@beam.apache.org