You are viewing a plain text version of this content. The canonical link for it is here.
Posted to dev@lucene.apache.org by Apache Hudson Server <hu...@hudson.apache.org> on 2011/03/12 02:38:28 UTC
[HUDSON] Lucene-Solr-tests-only-trunk - Build # 5833 - Still
Failing
Build: https://hudson.apache.org/hudson/job/Lucene-Solr-tests-only-trunk/5833/
2 tests failed.
FAILED: org.apache.solr.update.DirectUpdateHandlerOptimizeTest.testWatchChildren
Error Message:
Forked Java VM exited abnormally. Please note the time in the report does not reflect the time until the VM exit.
Stack Trace:
junit.framework.AssertionFailedError: Forked Java VM exited abnormally. Please note the time in the report does not reflect the time until the VM exit.
at java.lang.Thread.run(Thread.java:636)
FAILED: TEST-org.apache.solr.cloud.ZkSolrClientTest.xml.<init>
Error Message:
Stack Trace:
Test report file /home/hudson/hudson-slave/workspace/Lucene-Solr-tests-only-trunk/checkout/solr/build/test-results/TEST-org.apache.solr.cloud.ZkSolrClientTest.xml was length 0
Build Log (for compile errors):
[...truncated 8481 lines...]
---------------------------------------------------------------------
To unsubscribe, e-mail: dev-unsubscribe@lucene.apache.org
For additional commands, e-mail: dev-help@lucene.apache.org
[HUDSON] Lucene-Solr-tests-only-trunk - Build # 5834 - Still
Failing
Posted by Apache Hudson Server <hu...@hudson.apache.org>.
Build: https://hudson.apache.org/hudson/job/Lucene-Solr-tests-only-trunk/5834/
1 tests failed.
FAILED: org.apache.solr.cloud.ZkSolrClientTest.testConnect
Error Message:
Could not connect to ZooKeeper 127.0.0.1:30762/solr within 30000 ms
Stack Trace:
java.util.concurrent.TimeoutException: Could not connect to ZooKeeper 127.0.0.1:30762/solr within 30000 ms
at org.apache.solr.common.cloud.ConnectionManager.waitForConnected(ConnectionManager.java:124)
at org.apache.solr.common.cloud.SolrZkClient.<init>(SolrZkClient.java:121)
at org.apache.solr.common.cloud.SolrZkClient.<init>(SolrZkClient.java:84)
at org.apache.solr.common.cloud.SolrZkClient.<init>(SolrZkClient.java:65)
at org.apache.solr.cloud.ZkSolrClientTest.testConnect(ZkSolrClientTest.java:43)
at org.apache.lucene.util.LuceneTestCase$LuceneTestCaseRunner.runChild(LuceneTestCase.java:1214)
at org.apache.lucene.util.LuceneTestCase$LuceneTestCaseRunner.runChild(LuceneTestCase.java:1146)
Build Log (for compile errors):
[...truncated 8578 lines...]
---------------------------------------------------------------------
To unsubscribe, e-mail: dev-unsubscribe@lucene.apache.org
For additional commands, e-mail: dev-help@lucene.apache.org