You are viewing a plain text version of this content. The canonical link for it is here.
Posted to dev@chukwa.apache.org by Apache Jenkins Server <je...@builds.apache.org> on 2012/03/25 21:20:17 UTC

Build failed in Jenkins: Chukwa-trunk #440

See <https://builds.apache.org/job/Chukwa-trunk/440/>

------------------------------------------
[...truncated 1055 lines...]
AU        lib/libsigar-ppc-aix-5.so
A         bin
AU        bin/chukwa-daemons.sh
AU        bin/chukwa
AU        bin/hourlyRolling.sh
A         bin/VERSION
AU        bin/start-agents.sh
AU        bin/start-chukwa.sh
AU        bin/chukwa-daemon.sh
A         bin/README
AU        bin/chukwa-config.sh
AU        bin/dailyRolling.sh
AU        bin/stop-data-processors.sh
AU        bin/stop-collectors.sh
AU        bin/slaves.sh
A         bin/downSampling.sh
AU        bin/start-data-processors.sh
AU        bin/stop-agents.sh
AU        bin/start-collectors.sh
AU        bin/stop-chukwa.sh
A         README.txt
 U        .
At revision 1305091
no change for http://svn.apache.org/repos/asf/incubator/chukwa/trunk since the previous build
[trunk] $ /home/hudson/hudson-slave/tools/maven-3.0.4/bin/mvn clean package
[INFO] Scanning for projects...
[WARNING] 
[WARNING] Some problems were encountered while building the effective model for org.apache.incubator:chukwa:jar:0.6.0
[WARNING] 'dependencies.dependency.systemPath' for com.josephoconnell.html:html-filter:jar should not point at files within the project directory, ${basedir}/lib/html-filter-1.0.jar will be unresolvable by dependent projects @ line 99, column 25
[WARNING] 'dependencies.dependency.systemPath' for edu.berkeley.confspell:confspellcheck:jar should not point at files within the project directory, ${basedir}/lib/confspellcheck.jar will be unresolvable by dependent projects @ line 106, column 25
[WARNING] 'dependencies.dependency.systemPath' for com.mdimension:jchronic:jar should not point at files within the project directory, ${basedir}/lib/jchronic-0.2.3.jar will be unresolvable by dependent projects @ line 113, column 25
[WARNING] 'dependencies.dependency.systemPath' for org.apache.log4j:NagiosAppender:jar should not point at files within the project directory, ${basedir}/lib/NagiosAppender-1.5.0.jar will be unresolvable by dependent projects @ line 120, column 25
[WARNING] 'dependencies.dependency.systemPath' for org.hyperic:sigar:jar should not point at files within the project directory, ${basedir}/lib/sigar.jar will be unresolvable by dependent projects @ line 127, column 25
[WARNING] 
[WARNING] It is highly recommended to fix these problems because they threaten the stability of your build.
[WARNING] 
[WARNING] For this reason, future Maven versions might no longer support building such malformed projects.
[WARNING] 
[INFO]                                                                         
[INFO] ------------------------------------------------------------------------
[INFO] Building Apache Chukwa 0.6.0
[INFO] ------------------------------------------------------------------------
[WARNING] The POM for javax.jms:jms:jar:1.1 is invalid, transitive dependencies (if any) will not be available, enable debug logging for more details
[WARNING] The POM for com.sun.jdmk:jmxtools:jar:1.2.1 is invalid, transitive dependencies (if any) will not be available, enable debug logging for more details
[WARNING] The POM for com.sun.jmx:jmxri:jar:1.2.1 is invalid, transitive dependencies (if any) will not be available, enable debug logging for more details
[INFO] 
[INFO] --- maven-clean-plugin:2.4.1:clean (default-clean) @ chukwa ---
[INFO] 
[INFO] --- maven-antrun-plugin:1.4:run (setup) @ chukwa ---
project.artifactId
[INFO] Executing tasks
    [mkdir] Created dir: <https://builds.apache.org/job/Chukwa-trunk/ws/trunk/target>
    [mkdir] Created dir: <https://builds.apache.org/job/Chukwa-trunk/ws/trunk/target/clover>
[INFO] Executed tasks
[INFO] 
[INFO] --- maven-resources-plugin:2.4.3:copy-resources (copy-configuration) @ chukwa ---
[INFO] Using 'UTF-8' encoding to copy filtered resources.
[INFO] Copying 22 resources
[INFO] 
[INFO] --- maven-resources-plugin:2.4.3:resources (default-resources) @ chukwa ---
[INFO] Using 'UTF-8' encoding to copy filtered resources.
[INFO] skip non existing resourceDirectory <https://builds.apache.org/job/Chukwa-trunk/ws/trunk/src/main/resources>
[INFO] 
[INFO] --- maven-compiler-plugin:2.3.2:compile (default-compile) @ chukwa ---
[INFO] Compiling 298 source files to <https://builds.apache.org/job/Chukwa-trunk/ws/trunk/target/classes>
[INFO] 
[INFO] --- maven-antrun-plugin:1.4:run (test-setup) @ chukwa ---
project.artifactId
[INFO] Executing tasks
    [mkdir] Created dir: <https://builds.apache.org/job/Chukwa-trunk/ws/trunk/target/test/var>
    [mkdir] Created dir: <https://builds.apache.org/job/Chukwa-trunk/ws/trunk/target/test/var/log>
    [mkdir] Created dir: <https://builds.apache.org/job/Chukwa-trunk/ws/trunk/target/test/var/run>
     [copy] Copying 3 files to <https://builds.apache.org/job/Chukwa-trunk/ws/trunk/target/test/var/log>
     [copy] Copying 1 file to <https://builds.apache.org/job/Chukwa-trunk/ws/trunk/target/test/conf>
     [copy] Copying 1 file to <https://builds.apache.org/job/Chukwa-trunk/ws/trunk/target/test/conf>
     [copy] Copying 1 file to <https://builds.apache.org/job/Chukwa-trunk/ws/trunk/target/test/conf>
     [copy] Copying 1 file to <https://builds.apache.org/job/Chukwa-trunk/ws/trunk/target/test/classes>
     [copy] Copying 1 file to <https://builds.apache.org/job/Chukwa-trunk/ws/trunk/target/test/conf>
     [copy] Copying 1 file to <https://builds.apache.org/job/Chukwa-trunk/ws/trunk/target/test/conf>
[INFO] Executed tasks
[INFO] 
[INFO] --- maven-resources-plugin:2.4.3:testResources (default-testResources) @ chukwa ---
[INFO] Using 'UTF-8' encoding to copy filtered resources.
[INFO] Copying 6 resources
[INFO] 
[INFO] --- maven-compiler-plugin:2.3.2:testCompile (default-testCompile) @ chukwa ---
[INFO] Compiling 92 source files to <https://builds.apache.org/job/Chukwa-trunk/ws/trunk/target/test-classes>
[INFO] 
[INFO] --- maven-surefire-plugin:2.10:test (default-test) @ chukwa ---
[INFO] Surefire report directory: <https://builds.apache.org/job/Chukwa-trunk/ws/trunk/target/test-reports>

-------------------------------------------------------
 T E S T S
-------------------------------------------------------

-------------------------------------------------------
 T E S T S
-------------------------------------------------------
Running org.apache.hadoop.chukwa.rest.resource.TestViewResource
Running org.apache.hadoop.chukwa.rest.resource.TestWidgetResource
Running org.apache.hadoop.chukwa.rest.resource.TestUserResource
Running org.apache.hadoop.chukwa.rest.resource.TestClientTrace
Running org.apache.hadoop.chukwa.TestChunkBuilder
Tests run: 1, Failures: 0, Errors: 0, Skipped: 0, Time elapsed: 0.115 sec
Running org.apache.hadoop.chukwa.dataloader.TestSocketDataLoader
Tests run: 1, Failures: 0, Errors: 0, Skipped: 0, Time elapsed: 0.498 sec
Running org.apache.hadoop.chukwa.hicc.TestChart
Tests run: 3, Failures: 0, Errors: 0, Skipped: 0, Time elapsed: 0.145 sec
Running org.apache.hadoop.chukwa.util.TestRecordConsts
Tests run: 2, Failures: 0, Errors: 0, Skipped: 0, Time elapsed: 0.03 sec
Running org.apache.hadoop.chukwa.util.TestCRValidator
Tests run: 3, Failures: 0, Errors: 0, Skipped: 0, Time elapsed: 0.654 sec
Running org.apache.hadoop.chukwa.util.TestCopySequenceFile
Tests run: 1, Failures: 0, Errors: 0, Skipped: 0, Time elapsed: 0.712 sec
Running org.apache.hadoop.chukwa.util.TestFilter
Tests run: 2, Failures: 0, Errors: 0, Skipped: 0, Time elapsed: 0.12 sec
Running org.apache.hadoop.chukwa.util.TestDumpChunks
Tests run: 1, Failures: 0, Errors: 0, Skipped: 0, Time elapsed: 0.662 sec
Running org.apache.hadoop.chukwa.util.TestXSSFilter
Tests run: 1, Failures: 0, Errors: 0, Skipped: 0, Time elapsed: 0.129 sec
Running org.apache.hadoop.chukwa.util.TestCreateRecordFile
Tests run: 1, Failures: 0, Errors: 0, Skipped: 0, Time elapsed: 0.685 sec
Running org.apache.hadoop.chukwa.inputtools.log4j.TestTaskLogAppender
Tests run: 1, Failures: 0, Errors: 0, Skipped: 0, Time elapsed: 3.225 sec
Running org.apache.hadoop.chukwa.inputtools.log4j.TestChukwaDailyRollingFileAppender
Tests run: 1, Failures: 0, Errors: 0, Skipped: 0, Time elapsed: 2.136 sec
Running org.apache.hadoop.chukwa.inputtools.TestInputFormat
Tests run: 1, Failures: 0, Errors: 0, Skipped: 0, Time elapsed: 0.613 sec
Running org.apache.hadoop.chukwa.tools.backfilling.TestBackfillingLoader
Tests run: 4, Failures: 0, Errors: 0, Skipped: 0, Time elapsed: 76.265 sec
Running org.apache.hadoop.chukwa.database.TestMacro
Tests run: 2, Failures: 0, Errors: 0, Skipped: 0, Time elapsed: 0.147 sec
Running org.apache.hadoop.chukwa.datacollection.sender.TestRetryListOfCollectors
Tests run: 2, Failures: 0, Errors: 0, Skipped: 0, Time elapsed: 0.332 sec
Running org.apache.hadoop.chukwa.datacollection.sender.TestAcksOnFailure
Tests run: 1, Failures: 0, Errors: 0, Skipped: 0, Time elapsed: 3.504 sec
Running org.apache.hadoop.chukwa.datacollection.adaptor.TestDirTailingAdaptor
Tests run: 2, Failures: 0, Errors: 0, Skipped: 0, Time elapsed: 23.702 sec
Running org.apache.hadoop.chukwa.datacollection.adaptor.jms.TestJMSMessagePropertyTransformer
Tests run: 9, Failures: 0, Errors: 0, Skipped: 0, Time elapsed: 10.379 sec
Running org.apache.hadoop.chukwa.datacollection.adaptor.jms.TestJMSAdaptor
Tests run: 4, Failures: 0, Errors: 0, Skipped: 0, Time elapsed: 5.248 sec
Running org.apache.hadoop.chukwa.datacollection.adaptor.TestSyslogAdaptor
Tests run: 1, Failures: 0, Errors: 0, Skipped: 0, Time elapsed: 0.352 sec
Running org.apache.hadoop.chukwa.datacollection.adaptor.TestUDPAdaptor
Tests run: 1, Failures: 0, Errors: 0, Skipped: 0, Time elapsed: 0.11 sec
Running org.apache.hadoop.chukwa.datacollection.adaptor.TestFileAdaptor
Tests run: 2, Failures: 0, Errors: 0, Skipped: 0, Time elapsed: 1.974 sec
Running org.apache.hadoop.chukwa.datacollection.adaptor.TestBufferingWrappers
Tests run: 2, Failures: 0, Errors: 0, Skipped: 0, Time elapsed: 8.923 sec
Running org.apache.hadoop.chukwa.datacollection.adaptor.filetailer.TestStartAtOffset
Tests run: 1, Failures: 0, Errors: 0, Skipped: 0, Time elapsed: 0.687 sec
Running org.apache.hadoop.chukwa.datacollection.adaptor.filetailer.TestLogRotate
Tests run: 1, Failures: 0, Errors: 0, Skipped: 0, Time elapsed: 11.694 sec
Running org.apache.hadoop.chukwa.datacollection.adaptor.filetailer.TestFileTailingAdaptors
Tests run: 3, Failures: 0, Errors: 0, Skipped: 0, Time elapsed: 10.785 sec
Running org.apache.hadoop.chukwa.datacollection.adaptor.filetailer.TestFileTailingAdaptorBigRecord
Tests run: 1, Failures: 0, Errors: 0, Skipped: 0, Time elapsed: 40.664 sec
Running org.apache.hadoop.chukwa.datacollection.adaptor.filetailer.TestRawAdaptor
Tests run: 3, Failures: 0, Errors: 0, Skipped: 0, Time elapsed: 4.038 sec
Running org.apache.hadoop.chukwa.datacollection.adaptor.filetailer.TestRCheckAdaptor
Tests run: 2, Failures: 0, Errors: 0, Skipped: 0, Time elapsed: 33.703 sec
Running org.apache.hadoop.chukwa.datacollection.adaptor.filetailer.TestFileExpirationPolicy
Tests run: 2, Failures: 0, Errors: 0, Skipped: 0, Time elapsed: 101.959 sec
Running org.apache.hadoop.chukwa.datacollection.adaptor.filetailer.TestCharFileTailingAdaptorUTF8
Tests run: 1, Failures: 0, Errors: 0, Skipped: 0, Time elapsed: 2.631 sec
Running org.apache.hadoop.chukwa.datacollection.adaptor.TestExecAdaptor
Tests run: 2, Failures: 0, Errors: 0, Skipped: 0, Time elapsed: 5.763 sec
Running org.apache.hadoop.chukwa.datacollection.collector.TestFailedCollectorAck
Tests run: 1, Failures: 0, Errors: 0, Skipped: 0, Time elapsed: 27.248 sec
Running org.apache.hadoop.chukwa.datacollection.collector.TestAdaptorTimeout
Tests run: 1, Failures: 0, Errors: 0, Skipped: 0, Time elapsed: 37.059 sec
Running org.apache.hadoop.chukwa.datacollection.collector.TestBackpressure
Tests run: 1, Failures: 0, Errors: 0, Skipped: 0, Time elapsed: 41.667 sec
Running org.apache.hadoop.chukwa.datacollection.collector.TestDelayedAcks
Tests run: 3, Failures: 0, Errors: 0, Skipped: 0, Time elapsed: 44.77 sec
Running org.apache.hadoop.chukwa.datacollection.collector.TestCollector
Tests run: 1, Failures: 0, Errors: 0, Skipped: 0, Time elapsed: 2.624 sec
Running org.apache.hadoop.chukwa.datacollection.connector.TestFailedCollector
Tests run: 1, Failures: 0, Errors: 0, Skipped: 0, Time elapsed: 3.711 sec
Running org.apache.hadoop.chukwa.datacollection.agent.rest.TestAdaptorController
Tests run: 14, Failures: 0, Errors: 0, Skipped: 0, Time elapsed: 7.106 sec
Running org.apache.hadoop.chukwa.datacollection.agent.TestAgentConfig
Tests run: 2, Failures: 0, Errors: 0, Skipped: 0, Time elapsed: 13.306 sec
Running org.apache.hadoop.chukwa.datacollection.agent.TestAgent
Tests run: 3, Failures: 0, Errors: 0, Skipped: 0, Time elapsed: 163.936 sec
Running org.apache.hadoop.chukwa.datacollection.agent.TestCmd
Tests run: 4, Failures: 0, Errors: 0, Skipped: 0, Time elapsed: 7.065 sec
Running org.apache.hadoop.chukwa.datacollection.TestOffsetStatsManager
Tests run: 3, Failures: 0, Errors: 0, Skipped: 0, Time elapsed: 13.105 sec
Running org.apache.hadoop.chukwa.datacollection.controller.TestAgentClient
Tests run: 1, Failures: 0, Errors: 0, Skipped: 0, Time elapsed: 0.551 sec
Running org.apache.hadoop.chukwa.datacollection.writer.TestSocketTee
Tests run: 1, Failures: 0, Errors: 0, Skipped: 0, Time elapsed: 0.352 sec
Running org.apache.hadoop.chukwa.datacollection.writer.TestHBaseWriter
Tests run: 1, Failures: 1, Errors: 0, Skipped: 0, Time elapsed: 101.294 sec <<< FAILURE!
Running org.apache.hadoop.chukwa.datacollection.writer.TestChukwaWriters
Tests run: 3, Failures: 0, Errors: 0, Skipped: 0, Time elapsed: 23.688 sec
Running org.apache.hadoop.chukwa.datacollection.writer.TestClientAck
Tests run: 1, Failures: 0, Errors: 0, Skipped: 0, Time elapsed: 18.098 sec
Running org.apache.hadoop.chukwa.extraction.demux.TestDemuxReducerConfigs
Tests run: 1, Failures: 0, Errors: 0, Skipped: 0, Time elapsed: 0.37 sec
Running org.apache.hadoop.chukwa.extraction.demux.TestPostDemuxTrigger
Tests run: 2, Failures: 0, Errors: 0, Skipped: 0, Time elapsed: 0.676 sec
Running org.apache.hadoop.chukwa.extraction.demux.TestDemuxMapperConfigs
Tests run: 1, Failures: 0, Errors: 0, Skipped: 0, Time elapsed: 0.377 sec
Running org.apache.hadoop.chukwa.extraction.demux.TestDemux
Tests run: 1, Failures: 0, Errors: 0, Skipped: 0, Time elapsed: 11.546 sec
Running org.apache.hadoop.chukwa.extraction.demux.processor.mapper.TestJobLogEntry
Tests run: 1, Failures: 0, Errors: 0, Skipped: 0, Time elapsed: 0.244 sec
Running org.apache.hadoop.chukwa.extraction.demux.processor.mapper.TestLog4JMetricsContextChukwaRecord
Tests run: 1, Failures: 0, Errors: 0, Skipped: 0, Time elapsed: 0.06 sec
Running org.apache.hadoop.chukwa.extraction.demux.processor.mapper.TestAbtractProcessor
Tests run: 1, Failures: 0, Errors: 0, Skipped: 0, Time elapsed: 0.119 sec
Running org.apache.hadoop.chukwa.extraction.demux.processor.mapper.TestPsOutput
Tests run: 1, Failures: 0, Errors: 0, Skipped: 0, Time elapsed: 0.029 sec
Running org.apache.hadoop.chukwa.extraction.demux.processor.mapper.TestTsProcessor
Tests run: 7, Failures: 0, Errors: 0, Skipped: 0, Time elapsed: 0.574 sec
Running org.apache.hadoop.chukwa.extraction.demux.processor.mapper.TestHadoopLogProcessor
Tests run: 1, Failures: 0, Errors: 0, Skipped: 0, Time elapsed: 1.501 sec
Running org.apache.hadoop.chukwa.extraction.demux.TestDemuxManager
Tests run: 6, Failures: 0, Errors: 0, Skipped: 0, Time elapsed: 5.762 sec

Results :

Failed tests:   testWriters(org.apache.hadoop.chukwa.datacollection.writer.TestHBaseWriter): Call to vesta.apache.org/67.195.138.9:55666 failed on local exception: java.io.EOFException

Tests run: 129, Failures: 1, Errors: 0, Skipped: 0

[INFO] ------------------------------------------------------------------------
[INFO] BUILD FAILURE
[INFO] ------------------------------------------------------------------------
[INFO] Total time: 16:29.771s
[INFO] Finished at: Sun Mar 25 19:17:15 UTC 2012
[INFO] Final Memory: 28M/101M
[INFO] ------------------------------------------------------------------------
[ERROR] Failed to execute goal org.apache.maven.plugins:maven-surefire-plugin:2.10:test (default-test) on project chukwa: There are test failures.
[ERROR] 
[ERROR] Please refer to <https://builds.apache.org/job/Chukwa-trunk/ws/trunk/target/test-reports> for the individual test results.
[ERROR] -> [Help 1]
[ERROR] 
[ERROR] To see the full stack trace of the errors, re-run Maven with the -e switch.
[ERROR] Re-run Maven using the -X switch to enable full debug logging.
[ERROR] 
[ERROR] For more information about the errors and possible solutions, please read the following articles:
[ERROR] [Help 1] http://cwiki.apache.org/confluence/display/MAVEN/MojoFailureException
Build step 'Invoke top-level Maven targets' marked build as failure
Archiving artifacts
Recording test results

Jenkins build is back to normal : Chukwa-trunk #442

Posted by Apache Jenkins Server <je...@builds.apache.org>.
See <https://builds.apache.org/job/Chukwa-trunk/442/>


Build failed in Jenkins: Chukwa-trunk #441

Posted by Apache Jenkins Server <je...@builds.apache.org>.
See <https://builds.apache.org/job/Chukwa-trunk/441/changes>

Changes:

[eyang] CHUKWA-300. Updated adaptor list in document. (Eric Yang)

------------------------------------------
[...truncated 1067 lines...]
AU        bin/stop-data-processors.sh
AU        bin/stop-collectors.sh
AU        bin/slaves.sh
A         bin/downSampling.sh
AU        bin/start-data-processors.sh
AU        bin/stop-agents.sh
AU        bin/start-collectors.sh
AU        bin/stop-chukwa.sh
A         README.txt
 U        .
At revision 1307708
[trunk] $ /home/jenkins/jenkins-slave/tools/maven-3.0.4/bin/mvn clean package
[INFO] Scanning for projects...
[WARNING] 
[WARNING] Some problems were encountered while building the effective model for org.apache.incubator:chukwa:jar:0.6.0
[WARNING] 'dependencies.dependency.systemPath' for com.josephoconnell.html:html-filter:jar should not point at files within the project directory, ${basedir}/lib/html-filter-1.0.jar will be unresolvable by dependent projects @ line 99, column 25
[WARNING] 'dependencies.dependency.systemPath' for edu.berkeley.confspell:confspellcheck:jar should not point at files within the project directory, ${basedir}/lib/confspellcheck.jar will be unresolvable by dependent projects @ line 106, column 25
[WARNING] 'dependencies.dependency.systemPath' for com.mdimension:jchronic:jar should not point at files within the project directory, ${basedir}/lib/jchronic-0.2.3.jar will be unresolvable by dependent projects @ line 113, column 25
[WARNING] 'dependencies.dependency.systemPath' for org.apache.log4j:NagiosAppender:jar should not point at files within the project directory, ${basedir}/lib/NagiosAppender-1.5.0.jar will be unresolvable by dependent projects @ line 120, column 25
[WARNING] 'dependencies.dependency.systemPath' for org.hyperic:sigar:jar should not point at files within the project directory, ${basedir}/lib/sigar.jar will be unresolvable by dependent projects @ line 127, column 25
[WARNING] 
[WARNING] It is highly recommended to fix these problems because they threaten the stability of your build.
[WARNING] 
[WARNING] For this reason, future Maven versions might no longer support building such malformed projects.
[WARNING] 
[INFO]                                                                         
[INFO] ------------------------------------------------------------------------
[INFO] Building Apache Chukwa 0.6.0
[INFO] ------------------------------------------------------------------------
[INFO] 
[INFO] --- maven-clean-plugin:2.4.1:clean (default-clean) @ chukwa ---
[INFO] 
[INFO] --- maven-antrun-plugin:1.4:run (setup) @ chukwa ---
project.artifactId
[INFO] Executing tasks
    [mkdir] Created dir: /x1/jenkins/jenkins-slave/workspace/Chukwa-trunk/trunk/target
    [mkdir] Created dir: /x1/jenkins/jenkins-slave/workspace/Chukwa-trunk/trunk/target/clover
[INFO] Executed tasks
[INFO] 
[INFO] --- maven-resources-plugin:2.4.3:copy-resources (copy-configuration) @ chukwa ---
[INFO] Using 'UTF-8' encoding to copy filtered resources.
[INFO] Copying 22 resources
[INFO] 
[INFO] --- maven-resources-plugin:2.4.3:resources (default-resources) @ chukwa ---
[INFO] Using 'UTF-8' encoding to copy filtered resources.
[INFO] skip non existing resourceDirectory /x1/jenkins/jenkins-slave/workspace/Chukwa-trunk/trunk/src/main/resources
[INFO] 
[INFO] --- maven-compiler-plugin:2.3.2:compile (default-compile) @ chukwa ---
[INFO] Compiling 298 source files to /x1/jenkins/jenkins-slave/workspace/Chukwa-trunk/trunk/target/classes
[INFO] 
[INFO] --- maven-antrun-plugin:1.4:run (test-setup) @ chukwa ---
project.artifactId
[INFO] Executing tasks
    [mkdir] Created dir: /x1/jenkins/jenkins-slave/workspace/Chukwa-trunk/trunk/target/test/var
    [mkdir] Created dir: /x1/jenkins/jenkins-slave/workspace/Chukwa-trunk/trunk/target/test/var/log
    [mkdir] Created dir: /x1/jenkins/jenkins-slave/workspace/Chukwa-trunk/trunk/target/test/var/run
     [copy] Copying 3 files to /x1/jenkins/jenkins-slave/workspace/Chukwa-trunk/trunk/target/test/var/log
     [copy] Copying 1 file to /x1/jenkins/jenkins-slave/workspace/Chukwa-trunk/trunk/target/test/conf
     [copy] Copying 1 file to /x1/jenkins/jenkins-slave/workspace/Chukwa-trunk/trunk/target/test/conf
     [copy] Copying 1 file to /x1/jenkins/jenkins-slave/workspace/Chukwa-trunk/trunk/target/test/conf
     [copy] Copying 1 file to /x1/jenkins/jenkins-slave/workspace/Chukwa-trunk/trunk/target/test/classes
     [copy] Copying 1 file to /x1/jenkins/jenkins-slave/workspace/Chukwa-trunk/trunk/target/test/conf
     [copy] Copying 1 file to /x1/jenkins/jenkins-slave/workspace/Chukwa-trunk/trunk/target/test/conf
[INFO] Executed tasks
[INFO] 
[INFO] --- maven-resources-plugin:2.4.3:testResources (default-testResources) @ chukwa ---
[INFO] Using 'UTF-8' encoding to copy filtered resources.
[INFO] Copying 6 resources
[INFO] 
[INFO] --- maven-compiler-plugin:2.3.2:testCompile (default-testCompile) @ chukwa ---
[INFO] Compiling 92 source files to /x1/jenkins/jenkins-slave/workspace/Chukwa-trunk/trunk/target/test-classes
[INFO] 
[INFO] --- maven-surefire-plugin:2.10:test (default-test) @ chukwa ---
[INFO] Surefire report directory: /x1/jenkins/jenkins-slave/workspace/Chukwa-trunk/trunk/target/test-reports

-------------------------------------------------------
 T E S T S
-------------------------------------------------------

-------------------------------------------------------
 T E S T S
-------------------------------------------------------
Java HotSpot(TM) Server VM warning: Insufficient space for shared memory file:
   /tmp/hsperfdata_jenkins/9421
Try using the -Djava.io.tmpdir= option to select an alternate temp location.
Running org.apache.hadoop.chukwa.TestChunkBuilder
Tests run: 1, Failures: 0, Errors: 0, Skipped: 0, Time elapsed: 0.106 sec
Java HotSpot(TM) Server VM warning: Insufficient space for shared memory file:
   /tmp/hsperfdata_jenkins/9457
Try using the -Djava.io.tmpdir= option to select an alternate temp location.
Running org.apache.hadoop.chukwa.dataloader.TestSocketDataLoader
Tests run: 1, Failures: 0, Errors: 0, Skipped: 0, Time elapsed: 0.571 sec
Java HotSpot(TM) Server VM warning: Insufficient space for shared memory file:
   /tmp/hsperfdata_jenkins/9494
Try using the -Djava.io.tmpdir= option to select an alternate temp location.
Running org.apache.hadoop.chukwa.rest.resource.TestWidgetResource
Java HotSpot(TM) Server VM warning: Insufficient space for shared memory file:
   /tmp/hsperfdata_jenkins/9528
Try using the -Djava.io.tmpdir= option to select an alternate temp location.
Running org.apache.hadoop.chukwa.rest.resource.TestClientTrace
Java HotSpot(TM) Server VM warning: Insufficient space for shared memory file:
   /tmp/hsperfdata_jenkins/9562
Try using the -Djava.io.tmpdir= option to select an alternate temp location.
Running org.apache.hadoop.chukwa.rest.resource.TestUserResource
Java HotSpot(TM) Server VM warning: Insufficient space for shared memory file:
   /tmp/hsperfdata_jenkins/9596
Try using the -Djava.io.tmpdir= option to select an alternate temp location.
Running org.apache.hadoop.chukwa.rest.resource.TestViewResource
Java HotSpot(TM) Server VM warning: Insufficient space for shared memory file:
   /tmp/hsperfdata_jenkins/9630
Try using the -Djava.io.tmpdir= option to select an alternate temp location.
Running org.apache.hadoop.chukwa.hicc.TestChart
Tests run: 3, Failures: 0, Errors: 0, Skipped: 0, Time elapsed: 0.102 sec
Java HotSpot(TM) Server VM warning: Insufficient space for shared memory file:
   /tmp/hsperfdata_jenkins/9664
Try using the -Djava.io.tmpdir= option to select an alternate temp location.
Running org.apache.hadoop.chukwa.extraction.demux.TestDemuxManager
Java HotSpot(TM) Server VM warning: Insufficient space for shared memory file:
   /tmp/hsperfdata_jenkins/9717
Try using the -Djava.io.tmpdir= option to select an alternate temp location.
Running org.apache.hadoop.chukwa.extraction.demux.TestPostDemuxTrigger
Tests run: 2, Failures: 0, Errors: 0, Skipped: 0, Time elapsed: 0.493 sec
Java HotSpot(TM) Server VM warning: Insufficient space for shared memory file:
   /tmp/hsperfdata_jenkins/9786
Try using the -Djava.io.tmpdir= option to select an alternate temp location.
Running org.apache.hadoop.chukwa.extraction.demux.processor.mapper.TestAbtractProcessor
Tests run: 1, Failures: 0, Errors: 0, Skipped: 0, Time elapsed: 0.09 sec
Java HotSpot(TM) Server VM warning: Insufficient space for shared memory file:
   /tmp/hsperfdata_jenkins/9820
Try using the -Djava.io.tmpdir= option to select an alternate temp location.
Running org.apache.hadoop.chukwa.extraction.demux.processor.mapper.TestHadoopLogProcessor
Tests run: 1, Failures: 0, Errors: 0, Skipped: 0, Time elapsed: 1.064 sec
Java HotSpot(TM) Server VM warning: Insufficient space for shared memory file:
   /tmp/hsperfdata_jenkins/9854
Try using the -Djava.io.tmpdir= option to select an alternate temp location.
Running org.apache.hadoop.chukwa.extraction.demux.processor.mapper.TestLog4JMetricsContextChukwaRecord
Tests run: 1, Failures: 0, Errors: 0, Skipped: 0, Time elapsed: 0.045 sec
Java HotSpot(TM) Server VM warning: Insufficient space for shared memory file:
   /tmp/hsperfdata_jenkins/9887
Try using the -Djava.io.tmpdir= option to select an alternate temp location.
Running org.apache.hadoop.chukwa.extraction.demux.processor.mapper.TestJobLogEntry
Tests run: 1, Failures: 0, Errors: 0, Skipped: 0, Time elapsed: 0.209 sec
Java HotSpot(TM) Server VM warning: Insufficient space for shared memory file:
   /tmp/hsperfdata_jenkins/9921
Try using the -Djava.io.tmpdir= option to select an alternate temp location.
Running org.apache.hadoop.chukwa.extraction.demux.processor.mapper.TestTsProcessor
Tests run: 7, Failures: 0, Errors: 0, Skipped: 0, Time elapsed: 0.43 sec
Java HotSpot(TM) Server VM warning: Insufficient space for shared memory file:
   /tmp/hsperfdata_jenkins/9955
Try using the -Djava.io.tmpdir= option to select an alternate temp location.
Running org.apache.hadoop.chukwa.extraction.demux.processor.mapper.TestPsOutput
Tests run: 1, Failures: 0, Errors: 0, Skipped: 0, Time elapsed: 0.022 sec
Java HotSpot(TM) Server VM warning: Insufficient space for shared memory file:
   /tmp/hsperfdata_jenkins/9988
Try using the -Djava.io.tmpdir= option to select an alternate temp location.
Running org.apache.hadoop.chukwa.extraction.demux.TestDemuxReducerConfigs
Tests run: 1, Failures: 0, Errors: 0, Skipped: 0, Time elapsed: 0.276 sec
Java HotSpot(TM) Server VM warning: Insufficient space for shared memory file:
   /tmp/hsperfdata_jenkins/10022
Try using the -Djava.io.tmpdir= option to select an alternate temp location.
Running org.apache.hadoop.chukwa.extraction.demux.TestDemuxMapperConfigs
Tests run: 1, Failures: 0, Errors: 0, Skipped: 0, Time elapsed: 0.282 sec
Java HotSpot(TM) Server VM warning: Insufficient space for shared memory file:
   /tmp/hsperfdata_jenkins/10056
Try using the -Djava.io.tmpdir= option to select an alternate temp location.
Running org.apache.hadoop.chukwa.extraction.demux.TestDemux
Tests run: 1, Failures: 0, Errors: 0, Skipped: 0, Time elapsed: 22.188 sec
Java HotSpot(TM) Server VM warning: Insufficient space for shared memory file:
   /tmp/hsperfdata_jenkins/10189
Try using the -Djava.io.tmpdir= option to select an alternate temp location.
Running org.apache.hadoop.chukwa.util.TestCreateRecordFile
Tests run: 1, Failures: 0, Errors: 1, Skipped: 0, Time elapsed: 0.484 sec <<< FAILURE!
Java HotSpot(TM) Server VM warning: Insufficient space for shared memory file:
   /tmp/hsperfdata_jenkins/10224
Try using the -Djava.io.tmpdir= option to select an alternate temp location.
Running org.apache.hadoop.chukwa.util.TestRecordConsts
Tests run: 2, Failures: 0, Errors: 0, Skipped: 0, Time elapsed: 0.021 sec
Java HotSpot(TM) Server VM warning: Insufficient space for shared memory file:
   /tmp/hsperfdata_jenkins/10257
Try using the -Djava.io.tmpdir= option to select an alternate temp location.
Running org.apache.hadoop.chukwa.util.TestFilter
Tests run: 2, Failures: 0, Errors: 0, Skipped: 0, Time elapsed: 0.086 sec
Java HotSpot(TM) Server VM warning: Insufficient space for shared memory file:
   /tmp/hsperfdata_jenkins/10291
Try using the -Djava.io.tmpdir= option to select an alternate temp location.
Running org.apache.hadoop.chukwa.util.TestXSSFilter
Tests run: 1, Failures: 0, Errors: 0, Skipped: 0, Time elapsed: 0.088 sec
Java HotSpot(TM) Server VM warning: Insufficient space for shared memory file:
   /tmp/hsperfdata_jenkins/10325
Try using the -Djava.io.tmpdir= option to select an alternate temp location.
Running org.apache.hadoop.chukwa.util.TestCopySequenceFile
Tests run: 1, Failures: 0, Errors: 1, Skipped: 0, Time elapsed: 0.427 sec <<< FAILURE!
Java HotSpot(TM) Server VM warning: Insufficient space for shared memory file:
   /tmp/hsperfdata_jenkins/10360
Try using the -Djava.io.tmpdir= option to select an alternate temp location.
Running org.apache.hadoop.chukwa.util.TestDumpChunks
Tests run: 1, Failures: 0, Errors: 1, Skipped: 0, Time elapsed: 0.418 sec <<< FAILURE!
Java HotSpot(TM) Server VM warning: Insufficient space for shared memory file:
   /tmp/hsperfdata_jenkins/10395
Try using the -Djava.io.tmpdir= option to select an alternate temp location.
Running org.apache.hadoop.chukwa.util.TestCRValidator
Tests run: 3, Failures: 0, Errors: 1, Skipped: 0, Time elapsed: 0.421 sec <<< FAILURE!
Java HotSpot(TM) Server VM warning: Insufficient space for shared memory file:
   /tmp/hsperfdata_jenkins/10430
Try using the -Djava.io.tmpdir= option to select an alternate temp location.
Running org.apache.hadoop.chukwa.tools.backfilling.TestBackfillingLoader
Tests run: 4, Failures: 4, Errors: 0, Skipped: 0, Time elapsed: 0.507 sec <<< FAILURE!
Java HotSpot(TM) Server VM warning: Insufficient space for shared memory file:
   /tmp/hsperfdata_jenkins/10465
Try using the -Djava.io.tmpdir= option to select an alternate temp location.
Running org.apache.hadoop.chukwa.datacollection.agent.TestAgentConfig
Tests run: 2, Failures: 2, Errors: 0, Skipped: 0, Time elapsed: 0.411 sec <<< FAILURE!
Java HotSpot(TM) Server VM warning: Insufficient space for shared memory file:
   /tmp/hsperfdata_jenkins/10510
Try using the -Djava.io.tmpdir= option to select an alternate temp location.
Running org.apache.hadoop.chukwa.datacollection.agent.TestCmd
Tests run: 4, Failures: 0, Errors: 0, Skipped: 0, Time elapsed: 6.876 sec
Java HotSpot(TM) Server VM warning: Insufficient space for shared memory file:
   /tmp/hsperfdata_jenkins/10566
Try using the -Djava.io.tmpdir= option to select an alternate temp location.
Running org.apache.hadoop.chukwa.datacollection.agent.rest.TestAdaptorController
Tests run: 14, Failures: 0, Errors: 0, Skipped: 0, Time elapsed: 6.957 sec
Java HotSpot(TM) Server VM warning: Insufficient space for shared memory file:
   /tmp/hsperfdata_jenkins/10701
Try using the -Djava.io.tmpdir= option to select an alternate temp location.
Running org.apache.hadoop.chukwa.datacollection.agent.TestAgent
Tests run: 3, Failures: 0, Errors: 0, Skipped: 0, Time elapsed: 162.746 sec
Java HotSpot(TM) Server VM warning: Insufficient space for shared memory file:
   /tmp/hsperfdata_jenkins/10977
Try using the -Djava.io.tmpdir= option to select an alternate temp location.
Running org.apache.hadoop.chukwa.datacollection.connector.TestFailedCollector
Tests run: 1, Failures: 0, Errors: 0, Skipped: 0, Time elapsed: 0.442 sec
Java HotSpot(TM) Server VM warning: Insufficient space for shared memory file:
   /tmp/hsperfdata_jenkins/11019
Try using the -Djava.io.tmpdir= option to select an alternate temp location.
Running org.apache.hadoop.chukwa.datacollection.controller.TestAgentClient
Tests run: 1, Failures: 0, Errors: 0, Skipped: 0, Time elapsed: 0.403 sec
Java HotSpot(TM) Server VM warning: Insufficient space for shared memory file:
   /tmp/hsperfdata_jenkins/11063
Try using the -Djava.io.tmpdir= option to select an alternate temp location.
Running org.apache.hadoop.chukwa.datacollection.collector.TestFailedCollectorAck
Java HotSpot(TM) Server VM warning: Insufficient space for shared memory file:
   /tmp/hsperfdata_jenkins/11125
Try using the -Djava.io.tmpdir= option to select an alternate temp location.
Running org.apache.hadoop.chukwa.datacollection.collector.TestDelayedAcks
Build timed out (after 120 minutes). Marking the build as failed.
Archiving artifacts
Recording test results
Updating CHUKWA-300