You are viewing a plain text version of this content. The canonical link for it is here.
Posted to notifications@maven.apache.org by Apache Jenkins Server <je...@builds.apache.org> on 2019/10/20 12:28:06 UTC

Build failed in Jenkins: Maven TLP » maven » reproducible #49

See https://builds.apache.org/job/maven-box/job/maven/job/reproducible/49/

Changes:

* add repo to resolve SNAPSHOT parent POM and plugins
* build on nodes instead of running ITs
* add sha512 checksum to output
* inject buildId containing commitId into classifier for CI archive
* temporary hack: avoid plexus-component-metadata:merge-metadata
* temporary hack: disable sisu-maven-plugin
* exclude IDE files that may pollute source archive
* use the new project.build.outputTimestamp property

No tests ran.

Build log:
[...truncated 15245 lines...]
[INFO] Downloaded from central: https://repo.maven.apache.org/maven2/org/codehaus/plexus/plexus-io/3.2.0/plexus-io-3.2.0.pom (4.5 kB at 162 kB/s)
[INFO] Downloading from central: https://repo.maven.apache.org/maven2/commons-io/commons-io/2.6/commons-io-2.6.pom
[INFO] Downloaded from central: https://repo.maven.apache.org/maven2/commons-io/commons-io/2.6/commons-io-2.6.pom (14 kB at 419 kB/s)
[INFO] Downloading from central: https://repo.maven.apache.org/maven2/org/apache/commons/commons-compress/1.19/commons-compress-1.19.pom
[INFO] Downloaded from central: https://repo.maven.apache.org/maven2/org/apache/commons/commons-compress/1.19/commons-compress-1.19.pom (18 kB at 521 kB/s)
[INFO] Downloaded from central: https://repo.maven.apache.org/maven2/commons-io/commons-io/2.6/commons-io-2.6.pom (14 kB at 366 kB/s)
[INFO] Downloading from central: https://repo.maven.apache.org/maven2/org/apache/commons/commons-compress/1.19/commons-compress-1.19.pom
[INFO] Downloaded from central: https://repo.maven.apache.org/maven2/org/apache/commons/commons-compress/1.19/commons-compress-1.19.pom (18 kB at 536 kB/s)
[INFO] Downloading from central: https://repo.maven.apache.org/maven2/org/apache/commons/commons-parent/48/commons-parent-48.pom
[INFO] Downloaded from central: https://repo.maven.apache.org/maven2/org/apache/commons/commons-parent/48/commons-parent-48.pom (72 kB at 1.6 MB/s)
[INFO] Downloading from central: https://repo.maven.apache.org/maven2/org/tukaani/xz/1.8/xz-1.8.pom
[INFO] Downloaded from central: https://repo.maven.apache.org/maven2/org/tukaani/xz/1.8/xz-1.8.pom (1.9 kB at 62 kB/s)
[INFO] Downloading from plexus-snapshots: https://oss.sonatype.org/content/repositories/plexus-snapshots/org/codehaus/plexus/plexus-archiver/4.2.0-SNAPSHOT/maven-metadata.xml
[INFO] Downloading from Nexus: http://repository.apache.org/snapshots/org/codehaus/plexus/plexus-archiver/4.2.0-SNAPSHOT/maven-metadata.xml
[INFO] Downloading from apache-snapshots: http://repository.apache.org/snapshots/org/codehaus/plexus/plexus-archiver/4.2.0-SNAPSHOT/maven-metadata.xml
[INFO] Downloading from central: https://repo.maven.apache.org/maven2/org/apache/commons/commons-parent/48/commons-parent-48.pom
[INFO] Downloaded from central: https://repo.maven.apache.org/maven2/org/apache/commons/commons-parent/48/commons-parent-48.pom (72 kB at 1.4 MB/s)
[INFO] Downloading from central: https://repo.maven.apache.org/maven2/org/tukaani/xz/1.8/xz-1.8.pom
[INFO] Downloaded from central: https://repo.maven.apache.org/maven2/org/tukaani/xz/1.8/xz-1.8.pom (1.9 kB at 37 kB/s)
[INFO] Downloading from plexus-snapshots: https://oss.sonatype.org/content/repositories/plexus-snapshots/org/codehaus/plexus/plexus-archiver/4.2.0-SNAPSHOT/maven-metadata.xml
[INFO] Downloading from apache-snapshots: http://repository.apache.org/snapshots/org/codehaus/plexus/plexus-archiver/4.2.0-SNAPSHOT/maven-metadata.xml
[INFO] Downloading from Nexus: http://repository.apache.org/snapshots/org/codehaus/plexus/plexus-archiver/4.2.0-SNAPSHOT/maven-metadata.xml
[INFO] Downloaded from plexus-snapshots: https://oss.sonatype.org/content/repositories/plexus-snapshots/org/codehaus/plexus/plexus-archiver/4.2.0-SNAPSHOT/maven-metadata.xml (787 B at 2.1 kB/s)
[INFO] Downloading from apache-snapshots: http://repository.apache.org/snapshots/org/codehaus/plexus/plexus-archiver/4.2.0-SNAPSHOT/plexus-archiver-4.2.0-20191016.055243-10.pom
[INFO] Downloaded from plexus-snapshots: https://oss.sonatype.org/content/repositories/plexus-snapshots/org/codehaus/plexus/plexus-archiver/4.2.0-SNAPSHOT/maven-metadata.xml (787 B at 2.0 kB/s)
[INFO] Downloading from apache-snapshots: http://repository.apache.org/snapshots/org/codehaus/plexus/plexus-archiver/4.2.0-SNAPSHOT/plexus-archiver-4.2.0-20191016.055243-10.pom
[INFO] Downloading from plexus-snapshots: https://oss.sonatype.org/content/repositories/plexus-snapshots/org/codehaus/plexus/plexus-archiver/4.2.0-SNAPSHOT/plexus-archiver-4.2.0-20191016.055243-10.pom
[INFO] Downloading from plexus-snapshots: https://oss.sonatype.org/content/repositories/plexus-snapshots/org/codehaus/plexus/plexus-archiver/4.2.0-SNAPSHOT/plexus-archiver-4.2.0-20191016.055243-10.pom
[INFO] Downloaded from plexus-snapshots: https://oss.sonatype.org/content/repositories/plexus-snapshots/org/codehaus/plexus/plexus-archiver/4.2.0-SNAPSHOT/plexus-archiver-4.2.0-20191016.055243-10.pom (4.8 kB at 23 kB/s)
[INFO] Downloaded from plexus-snapshots: https://oss.sonatype.org/content/repositories/plexus-snapshots/org/codehaus/plexus/plexus-archiver/4.2.0-SNAPSHOT/plexus-archiver-4.2.0-20191016.055243-10.pom (4.8 kB at 23 kB/s)
[INFO] Downloading from central: https://repo.maven.apache.org/maven2/org/apache/maven/shared/file-management/3.0.0/file-management-3.0.0.jar
[INFO] Downloading from central: https://repo.maven.apache.org/maven2/org/apache/maven/wagon/wagon-provider-api/2.10/wagon-provider-api-2.10.jar
[INFO] Downloading from central: https://repo.maven.apache.org/maven2/org/codehaus/plexus/plexus-io/3.2.0/plexus-io-3.2.0.jar
[INFO] Downloading from central: https://repo.maven.apache.org/maven2/org/apache/maven/maven-compat/3.0/maven-compat-3.0.jar
[INFO] Downloading from central: https://repo.maven.apache.org/maven2/org/apache/maven/shared/maven-shared-io/3.0.0/maven-shared-io-3.0.0.jar
[INFO] Downloaded from central: https://repo.maven.apache.org/maven2/org/apache/maven/maven-compat/3.0/maven-compat-3.0.jar (285 kB at 4.3 MB/s)
[INFO] Downloading from central: https://repo.maven.apache.org/maven2/org/apache/commons/commons-compress/1.19/commons-compress-1.19.jar
[INFO] Downloading from central: https://repo.maven.apache.org/maven2/org/apache/maven/shared/file-management/3.0.0/file-management-3.0.0.jar
[INFO] Downloading from central: https://repo.maven.apache.org/maven2/org/apache/maven/wagon/wagon-provider-api/2.10/wagon-provider-api-2.10.jar
[INFO] Downloading from central: https://repo.maven.apache.org/maven2/org/apache/maven/maven-compat/3.0/maven-compat-3.0.jar
[INFO] Downloading from central: https://repo.maven.apache.org/maven2/org/codehaus/plexus/plexus-io/3.2.0/plexus-io-3.2.0.jar
[INFO] Downloading from central: https://repo.maven.apache.org/maven2/org/apache/maven/shared/maven-shared-io/3.0.0/maven-shared-io-3.0.0.jar
[INFO] Downloaded from central: https://repo.maven.apache.org/maven2/org/apache/maven/maven-compat/3.0/maven-compat-3.0.jar (285 kB at 1.8 MB/s)
[INFO] Downloading from central: https://repo.maven.apache.org/maven2/org/apache/commons/commons-compress/1.19/commons-compress-1.19.jar
[INFO] Downloaded from central: https://repo.maven.apache.org/maven2/org/apache/commons/commons-compress/1.19/commons-compress-1.19.jar (615 kB at 3.3 MB/s)
[INFO] Downloading from central: https://repo.maven.apache.org/maven2/org/tukaani/xz/1.8/xz-1.8.jar
[INFO] Downloaded from central: https://repo.maven.apache.org/maven2/org/apache/maven/wagon/wagon-provider-api/2.10/wagon-provider-api-2.10.jar (54 kB at 222 kB/s)
[INFO] Downloading from central: https://repo.maven.apache.org/maven2/org/codehaus/plexus/plexus-utils/3.3.0/plexus-utils-3.3.0.jar
[INFO] Downloaded from central: https://repo.maven.apache.org/maven2/org/codehaus/plexus/plexus-io/3.2.0/plexus-io-3.2.0.jar (76 kB at 283 kB/s)
[INFO] Downloaded from central: https://repo.maven.apache.org/maven2/org/codehaus/plexus/plexus-utils/3.3.0/plexus-utils-3.3.0.jar (263 kB at 1.1 MB/s)
[INFO] Downloaded from central: https://repo.maven.apache.org/maven2/org/apache/maven/wagon/wagon-provider-api/2.10/wagon-provider-api-2.10.jar (54 kB at 244 kB/s)
[INFO] Downloading from central: https://repo.maven.apache.org/maven2/org/tukaani/xz/1.8/xz-1.8.jar
[INFO] Downloaded from central: https://repo.maven.apache.org/maven2/org/apache/commons/commons-compress/1.19/commons-compress-1.19.jar (615 kB at 2.8 MB/s)
[INFO] Downloading from central: https://repo.maven.apache.org/maven2/org/codehaus/plexus/plexus-utils/3.3.0/plexus-utils-3.3.0.jar
[INFO] Downloaded from central: https://repo.maven.apache.org/maven2/org/codehaus/plexus/plexus-io/3.2.0/plexus-io-3.2.0.jar (76 kB at 278 kB/s)
[INFO] Downloaded from central: https://repo.maven.apache.org/maven2/org/codehaus/plexus/plexus-utils/3.3.0/plexus-utils-3.3.0.jar (263 kB at 934 kB/s)
[INFO] Downloaded from central: https://repo.maven.apache.org/maven2/org/apache/maven/shared/file-management/3.0.0/file-management-3.0.0.jar (35 kB at 107 kB/s)
[INFO] Downloaded from central: https://repo.maven.apache.org/maven2/org/apache/maven/shared/maven-shared-io/3.0.0/maven-shared-io-3.0.0.jar (41 kB at 109 kB/s)
[INFO] Downloaded from central: https://repo.maven.apache.org/maven2/org/apache/maven/shared/maven-shared-io/3.0.0/maven-shared-io-3.0.0.jar (41 kB at 112 kB/s)
[INFO] Downloaded from central: https://repo.maven.apache.org/maven2/org/apache/maven/shared/file-management/3.0.0/file-management-3.0.0.jar (35 kB at 90 kB/s)
[INFO] Downloaded from central: https://repo.maven.apache.org/maven2/org/tukaani/xz/1.8/xz-1.8.jar (109 kB at 268 kB/s)
[INFO] Downloading from apache-snapshots: http://repository.apache.org/snapshots/org/apache/maven/maven-archiver/3.4.1-SNAPSHOT/maven-archiver-3.4.1-20191016.062626-16.jar
[INFO] Downloaded from central: https://repo.maven.apache.org/maven2/org/tukaani/xz/1.8/xz-1.8.jar (109 kB at 235 kB/s)
[INFO] Downloading from apache-snapshots: http://repository.apache.org/snapshots/org/apache/maven/maven-archiver/3.4.1-SNAPSHOT/maven-archiver-3.4.1-20191016.062626-16.jar
[INFO] Downloaded from apache-snapshots: http://repository.apache.org/snapshots/org/apache/maven/maven-archiver/3.4.1-SNAPSHOT/maven-archiver-3.4.1-20191016.062626-16.jar (25 kB at 27 kB/s)
[INFO] Downloading from plexus-snapshots: https://oss.sonatype.org/content/repositories/plexus-snapshots/org/codehaus/plexus/plexus-archiver/4.2.0-SNAPSHOT/plexus-archiver-4.2.0-20191016.055243-10.jar
[INFO] Downloaded from apache-snapshots: http://repository.apache.org/snapshots/org/apache/maven/maven-archiver/3.4.1-SNAPSHOT/maven-archiver-3.4.1-20191016.062626-16.jar (25 kB at 27 kB/s)
[INFO] Downloading from plexus-snapshots: https://oss.sonatype.org/content/repositories/plexus-snapshots/org/codehaus/plexus/plexus-archiver/4.2.0-SNAPSHOT/plexus-archiver-4.2.0-20191016.055243-10.jar
[INFO] Downloaded from plexus-snapshots: https://oss.sonatype.org/content/repositories/plexus-snapshots/org/codehaus/plexus/plexus-archiver/4.2.0-SNAPSHOT/plexus-archiver-4.2.0-20191016.055243-10.jar (196 kB at 213 kB/s)
[INFO] Downloaded from plexus-snapshots: https://oss.sonatype.org/content/repositories/plexus-snapshots/org/codehaus/plexus/plexus-archiver/4.2.0-SNAPSHOT/plexus-archiver-4.2.0-20191016.055243-10.jar (196 kB at 213 kB/s)
[INFO] ------------------------------------------------------------------------
[INFO] Reactor Summary for Apache Maven 3.6.3-SNAPSHOT:
[INFO] 
[INFO] Apache Maven ....................................... SUCCESS [ 52.275 s]
[INFO] Maven Model ........................................ FAILURE [ 22.447 s]
[INFO] Maven Artifact ..................................... SKIPPED
[INFO] Maven Plugin API ................................... SKIPPED
[INFO] Maven Builder Support .............................. SKIPPED
[INFO] Maven Model Builder ................................ SKIPPED
[INFO] Maven Settings ..................................... SKIPPED
[INFO] Maven Settings Builder ............................. SKIPPED
[INFO] Maven Repository Metadata Model .................... SKIPPED
[INFO] Maven Artifact Resolver Provider ................... SKIPPED
[INFO] Maven Core ......................................... SKIPPED
[INFO] Maven SLF4J Simple Provider ........................ SKIPPED
[INFO] Maven Embedder ..................................... SKIPPED
[INFO] Maven Compat ....................................... SKIPPED
[INFO] Apache Maven Distribution .......................... SKIPPED
[INFO] ------------------------------------------------------------------------
[INFO] BUILD FAILURE
[INFO] ------------------------------------------------------------------------
[INFO] Total time:  01:18 min
[INFO] Finished at: 2019-10-20T05:28:03-07:00
[INFO] ------------------------------------------------------------------------
[INFO] [jenkins-event-spy] Generated F:\jenkins\jenkins-slave\workspace\maven-box_maven_reproducible@tmp\withMaven7458fdb0\maven-spy-20191020-052644-7426769696263830783094.log
[ERROR] Failed to execute goal org.apache.maven.plugins:maven-jar-plugin:3.2.0.RB-SNAPSHOT:jar (default-jar) on project maven-model: Execution default-jar of goal org.apache.maven.plugins:maven-jar-plugin:3.2.0.RB-SNAPSHOT:jar failed: An API incompatibility was encountered while executing org.apache.maven.plugins:maven-jar-plugin:3.2.0.RB-SNAPSHOT:jar: java.lang.NoSuchMethodError: org.apache.maven.archiver.MavenArchiver.configureReproducible(Ljava/lang/String;)Ljava/util/Date;
[ERROR] -----------------------------------------------------
[ERROR] realm =    plugin>org.apache.maven.plugins:maven-jar-plugin:3.2.0.RB-SNAPSHOT
[ERROR] strategy = org.codehaus.plexus.classworlds.strategy.SelfFirstStrategy
[ERROR] urls[0] = file:/f:/jenkins/jenkins-slave/workspace/maven-box_maven_reproducible/.repository/org/apache/maven/plugins/maven-jar-plugin/3.2.0.RB-SNAPSHOT/maven-jar-plugin-3.2.0.RB-SNAPSHOT.jar
[ERROR] urls[1] = file:/f:/jenkins/jenkins-slave/workspace/maven-box_maven_reproducible/.repository/org/sonatype/sisu/sisu-inject-bean/1.4.2/sisu-inject-bean-1.4.2.jar
[ERROR] urls[2] = file:/f:/jenkins/jenkins-slave/workspace/maven-box_maven_reproducible/.repository/org/sonatype/sisu/sisu-guice/2.1.7/sisu-guice-2.1.7-noaop.jar
[ERROR] urls[3] = file:/f:/jenkins/jenkins-slave/workspace/maven-box_maven_reproducible/.repository/org/sonatype/aether/aether-util/1.7/aether-util-1.7.jar
[ERROR] urls[4] = file:/f:/jenkins/jenkins-slave/workspace/maven-box_maven_reproducible/.repository/org/codehaus/plexus/plexus-interpolation/1.14/plexus-interpolation-1.14.jar
[ERROR] urls[5] = file:/f:/jenkins/jenkins-slave/workspace/maven-box_maven_reproducible/.repository/org/codehaus/plexus/plexus-component-annotations/1.7.1/plexus-component-annotations-1.7.1.jar
[ERROR] urls[6] = file:/f:/jenkins/jenkins-slave/workspace/maven-box_maven_reproducible/.repository/org/sonatype/plexus/plexus-sec-dispatcher/1.3/plexus-sec-dispatcher-1.3.jar
[ERROR] urls[7] = file:/f:/jenkins/jenkins-slave/workspace/maven-box_maven_reproducible/.repository/org/sonatype/plexus/plexus-cipher/1.4/plexus-cipher-1.4.jar
[ERROR] urls[8] = file:/f:/jenkins/jenkins-slave/workspace/maven-box_maven_reproducible/.repository/org/apache/maven/shared/file-management/3.0.0/file-management-3.0.0.jar
[ERROR] urls[9] = file:/f:/jenkins/jenkins-slave/workspace/maven-box_maven_reproducible/.repository/org/apache/maven/shared/maven-shared-io/3.0.0/maven-shared-io-3.0.0.jar
[ERROR] urls[10] = file:/f:/jenkins/jenkins-slave/workspace/maven-box_maven_reproducible/.repository/org/apache/maven/maven-archiver/3.4.1-SNAPSHOT/maven-archiver-3.4.1-SNAPSHOT.jar
[ERROR] urls[11] = file:/f:/jenkins/jenkins-slave/workspace/maven-box_maven_reproducible/.repository/commons-io/commons-io/2.5/commons-io-2.5.jar
[ERROR] urls[12] = file:/f:/jenkins/jenkins-slave/workspace/maven-box_maven_reproducible/.repository/org/apache/maven/shared/maven-shared-utils/3.2.1/maven-shared-utils-3.2.1.jar
[ERROR] urls[13] = file:/f:/jenkins/jenkins-slave/workspace/maven-box_maven_reproducible/.repository/org/codehaus/plexus/plexus-archiver/4.2.0-SNAPSHOT/plexus-archiver-4.2.0-SNAPSHOT.jar
[ERROR] urls[14] = file:/f:/jenkins/jenkins-slave/workspace/maven-box_maven_reproducible/.repository/org/codehaus/plexus/plexus-io/3.2.0/plexus-io-3.2.0.jar
[ERROR] urls[15] = file:/f:/jenkins/jenkins-slave/workspace/maven-box_maven_reproducible/.repository/org/apache/commons/commons-compress/1.19/commons-compress-1.19.jar
[ERROR] urls[16] = file:/f:/jenkins/jenkins-slave/workspace/maven-box_maven_reproducible/.repository/org/iq80/snappy/snappy/0.4/snappy-0.4.jar
[ERROR] urls[17] = file:/f:/jenkins/jenkins-slave/workspace/maven-box_maven_reproducible/.repository/org/tukaani/xz/1.8/xz-1.8.jar
[ERROR] urls[18] = file:/f:/jenkins/jenkins-slave/workspace/maven-box_maven_reproducible/.repository/org/codehaus/plexus/plexus-utils/3.3.0/plexus-utils-3.3.0.jar
[ERROR] Number of foreign imports: 1
[ERROR] import: Entry[import  from realm ClassRealm[maven.api, parent: null]]
[ERROR] 
[ERROR] -----------------------------------------------------
[ERROR] -> [Help 1]
[ERROR] 
[ERROR] To see the full stack trace of the errors, re-run Maven with the -e switch.
[ERROR] Re-run Maven using the -X switch to enable full debug logging.
[ERROR] 
[ERROR] For more information about the errors and possible solutions, please read the following articles:
[ERROR] [Help 1] http://cwiki.apache.org/confluence/display/MAVEN/PluginContainerException
[ERROR] 
[ERROR] After correcting the problems, you can resume the build with the command
[ERROR]   mvn <args> -rf :maven-model
Picked up JAVA_TOOL_OPTIONS: -Dmaven.ext.class.path="f:\jenkins\jenkins-slave\workspace\maven-box_maven_reproducible@tmp\withMaven7458fdb0\pipeline-maven-spy.jar" -Dorg.jenkinsci.plugins.pipeline.maven.reportsFolder="f:\jenkins\jenkins-slave\workspace\maven-box_maven_reproducible@tmp\withMaven7458fdb0" 
[Pipeline] }
[INFO] ------------------------------------------------------------------------
[INFO] Reactor Summary for Apache Maven 3.6.3-SNAPSHOT:
[INFO] 
[INFO] Apache Maven ....................................... SUCCESS [ 53.228 s]
[INFO] Maven Model ........................................ FAILURE [ 22.447 s]
[INFO] Maven Artifact ..................................... SKIPPED
[INFO] Maven Plugin API ................................... SKIPPED
[INFO] Maven Builder Support .............................. SKIPPED
[INFO] Maven Model Builder ................................ SKIPPED
[INFO] Maven Settings ..................................... SKIPPED
[INFO] Maven Settings Builder ............................. SKIPPED
[INFO] Maven Repository Metadata Model .................... SKIPPED
[INFO] Maven Artifact Resolver Provider ................... SKIPPED
[INFO] Maven Core ......................................... SKIPPED
[INFO] Maven SLF4J Simple Provider ........................ SKIPPED
[INFO] Maven Embedder ..................................... SKIPPED
[withMaven] artifactsPublisher - Archive artifact pom.xml under org\apache\maven\maven\3.6.3-SNAPSHOT\maven-3.6.3-SNAPSHOT.pom[INFO] Maven Compat ....................................... SKIPPED

[INFO] Apache Maven Distribution .......................... SKIPPED
[INFO] ------------------------------------------------------------------------
[INFO] BUILD FAILURE
[INFO] ------------------------------------------------------------------------
[INFO] Total time:  01:19 min
[INFO] Finished at: 2019-10-20T05:28:03-07:00
[INFO] ------------------------------------------------------------------------
[INFO] [jenkins-event-spy] Generated F:\jenkins\jenkins-slave\workspace\maven-box_maven_reproducible@2@tmp\withMavenaf968d77\maven-spy-20191020-052644-5487594829041022883475.log
[ERROR] Failed to execute goal org.apache.maven.plugins:maven-jar-plugin:3.2.0.RB-SNAPSHOT:jar (default-jar) on project maven-model: Execution default-jar of goal org.apache.maven.plugins:maven-jar-plugin:3.2.0.RB-SNAPSHOT:jar failed: An API incompatibility was encountered while executing org.apache.maven.plugins:maven-jar-plugin:3.2.0.RB-SNAPSHOT:jar: java.lang.NoSuchMethodError: org.apache.maven.archiver.MavenArchiver.configureReproducible(Ljava/lang/String;)Ljava/util/Date;
[ERROR] -----------------------------------------------------
[ERROR] realm =    plugin>org.apache.maven.plugins:maven-jar-plugin:3.2.0.RB-SNAPSHOT
[ERROR] strategy = org.codehaus.plexus.classworlds.strategy.SelfFirstStrategy
[ERROR] urls[0] = file:/f:/jenkins/jenkins-slave/workspace/maven-box_maven_reproducible@2/.repository/org/apache/maven/plugins/maven-jar-plugin/3.2.0.RB-SNAPSHOT/maven-jar-plugin-3.2.0.RB-SNAPSHOT.jar
[ERROR] urls[1] = file:/f:/jenkins/jenkins-slave/workspace/maven-box_maven_reproducible@2/.repository/org/sonatype/sisu/sisu-inject-bean/1.4.2/sisu-inject-bean-1.4.2.jar
[ERROR] urls[2] = file:/f:/jenkins/jenkins-slave/workspace/maven-box_maven_reproducible@2/.repository/org/sonatype/sisu/sisu-guice/2.1.7/sisu-guice-2.1.7-noaop.jar
[ERROR] urls[3] = file:/f:/jenkins/jenkins-slave/workspace/maven-box_maven_reproducible@2/.repository/org/sonatype/aether/aether-util/1.7/aether-util-1.7.jar
[ERROR] urls[4] = file:/f:/jenkins/jenkins-slave/workspace/maven-box_maven_reproducible@2/.repository/org/codehaus/plexus/plexus-interpolation/1.14/plexus-interpolation-1.14.jar
[ERROR] urls[5] = file:/f:/jenkins/jenkins-slave/workspace/maven-box_maven_reproducible@2/.repository/org/codehaus/plexus/plexus-component-annotations/1.7.1/plexus-component-annotations-1.7.1.jar
[ERROR] urls[6] = file:/f:/jenkins/jenkins-slave/workspace/maven-box_maven_reproducible@2/.repository/org/sonatype/plexus/plexus-sec-dispatcher/1.3/plexus-sec-dispatcher-1.3.jar
[ERROR] urls[7] = file:/f:/jenkins/jenkins-slave/workspace/maven-box_maven_reproducible@2/.repository/org/sonatype/plexus/plexus-cipher/1.4/plexus-cipher-1.4.jar
[ERROR] urls[8] = file:/f:/jenkins/jenkins-slave/workspace/maven-box_maven_reproducible@2/.repository/org/apache/maven/shared/file-management/3.0.0/file-management-3.0.0.jar
[ERROR] urls[9] = file:/f:/jenkins/jenkins-slave/workspace/maven-box_maven_reproducible@2/.repository/org/apache/maven/shared/maven-shared-io/3.0.0/maven-shared-io-3.0.0.jar
[ERROR] urls[10] = file:/f:/jenkins/jenkins-slave/workspace/maven-box_maven_reproducible@2/.repository/org/apache/maven/maven-archiver/3.4.1-SNAPSHOT/maven-archiver-3.4.1-SNAPSHOT.jar
[ERROR] urls[11] = file:/f:/jenkins/jenkins-slave/workspace/maven-box_maven_reproducible@2/.repository/commons-io/commons-io/2.5/commons-io-2.5.jar
[ERROR] urls[12] = file:/f:/jenkins/jenkins-slave/workspace/maven-box_maven_reproducible@2/.repository/org/apache/maven/shared/maven-shared-utils/3.2.1/maven-shared-utils-3.2.1.jar
[ERROR] urls[13] = file:/f:/jenkins/jenkins-slave/workspace/maven-box_maven_reproducible@2/.repository/org/codehaus/plexus/plexus-archiver/4.2.0-SNAPSHOT/plexus-archiver-4.2.0-SNAPSHOT.jar
[ERROR] urls[14] = file:/f:/jenkins/jenkins-slave/workspace/maven-box_maven_reproducible@2/.repository/org/codehaus/plexus/plexus-io/3.2.0/plexus-io-3.2.0.jar
[ERROR] urls[15] = file:/f:/jenkins/jenkins-slave/workspace/maven-box_maven_reproducible@2/.repository/org/apache/commons/commons-compress/1.19/commons-compress-1.19.jar
[ERROR] urls[16] = file:/f:/jenkins/jenkins-slave/workspace/maven-box_maven_reproducible@2/.repository/org/iq80/snappy/snappy/0.4/snappy-0.4.jar
[ERROR] urls[17] = file:/f:/jenkins/jenkins-slave/workspace/maven-box_maven_reproducible@2/.repository/org/tukaani/xz/1.8/xz-1.8.jar
[ERROR] urls[18] = file:/f:/jenkins/jenkins-slave/workspace/maven-box_maven_reproducible@2/.repository/org/codehaus/plexus/plexus-utils/3.3.0/plexus-utils-3.3.0.jar
[ERROR] Number of foreign imports: 1
[ERROR] import: Entry[import  from realm ClassRealm[maven.api, parent: null]]
[ERROR] 
[ERROR] -----------------------------------------------------
[ERROR] -> [Help 1]
[ERROR] 
[ERROR] To see the full stack trace of the errors, re-run Maven with the -e switch.
[ERROR] Re-run Maven using the -X switch to enable full debug logging.
[ERROR] 
[ERROR] For more information about the errors and possible solutions, please read the following articles:
[ERROR] [Help 1] http://cwiki.apache.org/confluence/display/MAVEN/PluginContainerException
[ERROR] 
[ERROR] After correcting the problems, you can resume the build with the command
[ERROR]   mvn <args> -rf :maven-model
Picked up JAVA_TOOL_OPTIONS: -Dmaven.ext.class.path="f:\jenkins\jenkins-slave\workspace\maven-box_maven_reproducible@2@tmp\withMavenaf968d77\pipeline-maven-spy.jar" -Dorg.jenkinsci.plugins.pipeline.maven.reportsFolder="f:\jenkins\jenkins-slave\workspace\maven-box_maven_reproducible@2@tmp\withMavenaf968d77" 
[withMaven] artifactsPublisher - Archive artifact target\maven-3.6.3-SNAPSHOT-site.xml under org\apache\maven\maven\3.6.3-SNAPSHOT\maven-3.6.3-SNAPSHOT-site.xml
[Pipeline] }
[withMaven] artifactsPublisher - Archive artifact pom.xml under org\apache\maven\maven\3.6.3-SNAPSHOT\maven-3.6.3-SNAPSHOT.pom
[withMaven] artifactsPublisher - Archive artifact target\maven-3.6.3-SNAPSHOT-site.xml under org\apache\maven\maven\3.6.3-SNAPSHOT\maven-3.6.3-SNAPSHOT-site.xml
[withMaven] junitPublisher - Archive test results for Maven artifact org.apache.maven:maven-model:jar:3.6.3-SNAPSHOT generated by maven-surefire-plugin:test (default-test): maven-model\target\surefire-reports\*.xml
Recording test results
None of the test reports contained any result
[withMaven] junitPublisher - Archive test results for Maven artifact org.apache.maven:maven-model:jar:3.6.3-SNAPSHOT generated by maven-surefire-plugin:test (default-test): maven-model\target\surefire-reports\*.xml
Recording test results
None of the test reports contained any result
[withMaven] openTasksPublisher - Scan Tasks for Maven artifact org.apache.maven:maven-model:jar:3.6.3-SNAPSHOT in source directory maven-model\src\main\java
[TASKS] Scanning folder 'f:\jenkins\jenkins-slave\workspace\maven-box_maven_reproducible' for files matching the pattern 'maven-model\src\main\java\**\*' - excludes: null
[TASKS] Found 4 files to scan for tasks
[TASKS] Found 2 open tasks.
Skipping warnings blame since pipelines do not have an SCM link.%n
[withMaven] openTasksPublisher - Scan Tasks for Maven artifact org.apache.maven:maven-model:jar:3.6.3-SNAPSHOT in source directory maven-model\src\main\java
[TASKS] Computing warning deltas based on reference build #46
[withMaven] Publishers: Pipeline Graph Publisher: 2 ms, Generated Artifacts Publisher: 1234 ms, Junit Publisher: 9 ms, Open Task Scanner Publisher: 79 ms
[TASKS] Scanning folder 'f:\jenkins\jenkins-slave\workspace\maven-box_maven_reproducible@2' for files matching the pattern 'maven-model\src\main\java\**\*' - excludes: null
[TASKS] Found 4 files to scan for tasks
[TASKS] Found 2 open tasks.
Skipping warnings blame since pipelines do not have an SCM link.%n
[Pipeline] // withMaven
[Pipeline] }
[TASKS] Computing warning deltas based on reference build #46
[withMaven] Publishers: Pipeline Graph Publisher: 1 ms, Generated Artifacts Publisher: 1159 ms, Junit Publisher: 9 ms, Open Task Scanner Publisher: 80 ms
[Pipeline] // stage
[Pipeline] // withMaven
[Pipeline] }
[Pipeline] }
[Pipeline] // node
[Pipeline] // stage
[Pipeline] }
Failed in branch windows-jdk7
[Pipeline] }
[Pipeline] // node
[Pipeline] }
Failed in branch windows-jdk8
[Pipeline] // parallel
[Pipeline] echo
[FAILURE-003] AbortException hudson.AbortException: script returned exit code 1
[Pipeline] stage
[Pipeline] { (Notifications)
[Pipeline] echo
Build result: FAILURE
[Pipeline] jiraIssueSelector
[Pipeline] echo
The authors of changes [hboutemy].
[Pipeline] echo
Sending email ...
[Pipeline] emailext

Build succeeded in Jenkins: Maven TLP » maven » reproducible #51

Posted by Apache Jenkins Server <je...@builds.apache.org>.
See https://builds.apache.org/job/maven-box/job/maven/job/reproducible/51/

No changes.

No tests ran.

Build failed in Jenkins: Maven TLP » maven » reproducible #50

Posted by Apache Jenkins Server <je...@builds.apache.org>.
See https://builds.apache.org/job/maven-box/job/maven/job/reproducible/50/

Changes:

* add repo to resolve SNAPSHOT parent POM and plugins
* build on nodes instead of running ITs
* add sha512 checksum to output
* inject buildId containing commitId into classifier for CI archive
* use packaging plugins' Reproducible Builds versions via parent
* temporary hack: avoid plexus-component-metadata:merge-metadata
* temporary hack: disable sisu-maven-plugin
* exclude IDE files that may pollute source archive

No tests ran.

Build log:
[...truncated 15257 lines...]
[INFO] Downloaded from central: https://repo.maven.apache.org/maven2/org/codehaus/plexus/plexus-io/3.2.0/plexus-io-3.2.0.pom (4.5 kB at 142 kB/s)
[INFO] Downloading from central: https://repo.maven.apache.org/maven2/commons-io/commons-io/2.6/commons-io-2.6.pom
[INFO] Downloaded from central: https://repo.maven.apache.org/maven2/commons-io/commons-io/2.6/commons-io-2.6.pom (14 kB at 432 kB/s)
[INFO] Downloaded from central: https://repo.maven.apache.org/maven2/commons-io/commons-io/2.6/commons-io-2.6.pom (14 kB at 407 kB/s)
[INFO] Downloading from central: https://repo.maven.apache.org/maven2/org/apache/commons/commons-compress/1.19/commons-compress-1.19.pom
[INFO] Downloaded from central: https://repo.maven.apache.org/maven2/org/apache/commons/commons-compress/1.19/commons-compress-1.19.pom (18 kB at 506 kB/s)
[INFO] Downloading from central: https://repo.maven.apache.org/maven2/org/apache/commons/commons-parent/48/commons-parent-48.pom
[INFO] Downloaded from central: https://repo.maven.apache.org/maven2/org/apache/commons/commons-parent/48/commons-parent-48.pom (72 kB at 1.4 MB/s)
[INFO] Downloading from central: https://repo.maven.apache.org/maven2/org/tukaani/xz/1.8/xz-1.8.pom
[INFO] Downloaded from central: https://repo.maven.apache.org/maven2/org/tukaani/xz/1.8/xz-1.8.pom (1.9 kB at 68 kB/s)
[INFO] Downloading from plexus-snapshots: https://oss.sonatype.org/content/repositories/plexus-snapshots/org/codehaus/plexus/plexus-archiver/4.2.0-SNAPSHOT/maven-metadata.xml
[INFO] Downloading from apache-snapshots: http://repository.apache.org/snapshots/org/codehaus/plexus/plexus-archiver/4.2.0-SNAPSHOT/maven-metadata.xml
[INFO] Downloading from Nexus: http://repository.apache.org/snapshots/org/codehaus/plexus/plexus-archiver/4.2.0-SNAPSHOT/maven-metadata.xml
[INFO] Downloading from central: https://repo.maven.apache.org/maven2/org/apache/commons/commons-compress/1.19/commons-compress-1.19.pom
[INFO] Downloaded from central: https://repo.maven.apache.org/maven2/org/apache/commons/commons-compress/1.19/commons-compress-1.19.pom (18 kB at 424 kB/s)
[INFO] Downloading from central: https://repo.maven.apache.org/maven2/org/apache/commons/commons-parent/48/commons-parent-48.pom
[INFO] Downloaded from central: https://repo.maven.apache.org/maven2/org/apache/commons/commons-parent/48/commons-parent-48.pom (72 kB at 1.4 MB/s)
[INFO] Downloading from central: https://repo.maven.apache.org/maven2/org/tukaani/xz/1.8/xz-1.8.pom
[INFO] Downloaded from central: https://repo.maven.apache.org/maven2/org/tukaani/xz/1.8/xz-1.8.pom (1.9 kB at 66 kB/s)
[INFO] Downloading from plexus-snapshots: https://oss.sonatype.org/content/repositories/plexus-snapshots/org/codehaus/plexus/plexus-archiver/4.2.0-SNAPSHOT/maven-metadata.xml
[INFO] Downloading from apache-snapshots: http://repository.apache.org/snapshots/org/codehaus/plexus/plexus-archiver/4.2.0-SNAPSHOT/maven-metadata.xml
[INFO] Downloading from Nexus: http://repository.apache.org/snapshots/org/codehaus/plexus/plexus-archiver/4.2.0-SNAPSHOT/maven-metadata.xml
[INFO] Downloaded from plexus-snapshots: https://oss.sonatype.org/content/repositories/plexus-snapshots/org/codehaus/plexus/plexus-archiver/4.2.0-SNAPSHOT/maven-metadata.xml (787 B at 2.0 kB/s)
[INFO] Downloading from apache-snapshots: http://repository.apache.org/snapshots/org/codehaus/plexus/plexus-archiver/4.2.0-SNAPSHOT/plexus-archiver-4.2.0-20191016.055243-10.pom
[INFO] Downloading from plexus-snapshots: https://oss.sonatype.org/content/repositories/plexus-snapshots/org/codehaus/plexus/plexus-archiver/4.2.0-SNAPSHOT/plexus-archiver-4.2.0-20191016.055243-10.pom
[INFO] Downloaded from plexus-snapshots: https://oss.sonatype.org/content/repositories/plexus-snapshots/org/codehaus/plexus/plexus-archiver/4.2.0-SNAPSHOT/maven-metadata.xml (787 B at 2.0 kB/s)
[INFO] Downloading from apache-snapshots: http://repository.apache.org/snapshots/org/codehaus/plexus/plexus-archiver/4.2.0-SNAPSHOT/plexus-archiver-4.2.0-20191016.055243-10.pom
[INFO] Downloading from plexus-snapshots: https://oss.sonatype.org/content/repositories/plexus-snapshots/org/codehaus/plexus/plexus-archiver/4.2.0-SNAPSHOT/plexus-archiver-4.2.0-20191016.055243-10.pom
[INFO] Downloaded from plexus-snapshots: https://oss.sonatype.org/content/repositories/plexus-snapshots/org/codehaus/plexus/plexus-archiver/4.2.0-SNAPSHOT/plexus-archiver-4.2.0-20191016.055243-10.pom (4.8 kB at 22 kB/s)
[INFO] Downloading from central: https://repo.maven.apache.org/maven2/org/apache/maven/shared/file-management/3.0.0/file-management-3.0.0.jar
[INFO] Downloading from central: https://repo.maven.apache.org/maven2/org/codehaus/plexus/plexus-io/3.2.0/plexus-io-3.2.0.jar
[INFO] Downloading from central: https://repo.maven.apache.org/maven2/org/apache/maven/wagon/wagon-provider-api/2.10/wagon-provider-api-2.10.jar
[INFO] Downloading from central: https://repo.maven.apache.org/maven2/org/apache/maven/maven-compat/3.0/maven-compat-3.0.jar
[INFO] Downloading from central: https://repo.maven.apache.org/maven2/org/apache/maven/shared/maven-shared-io/3.0.0/maven-shared-io-3.0.0.jar
[INFO] Downloaded from plexus-snapshots: https://oss.sonatype.org/content/repositories/plexus-snapshots/org/codehaus/plexus/plexus-archiver/4.2.0-SNAPSHOT/plexus-archiver-4.2.0-20191016.055243-10.pom (4.8 kB at 22 kB/s)
[INFO] Downloading from central: https://repo.maven.apache.org/maven2/org/apache/maven/shared/file-management/3.0.0/file-management-3.0.0.jar
[INFO] Downloading from central: https://repo.maven.apache.org/maven2/org/codehaus/plexus/plexus-io/3.2.0/plexus-io-3.2.0.jar
[INFO] Downloading from central: https://repo.maven.apache.org/maven2/org/apache/maven/wagon/wagon-provider-api/2.10/wagon-provider-api-2.10.jar
[INFO] Downloading from central: https://repo.maven.apache.org/maven2/org/apache/maven/maven-compat/3.0/maven-compat-3.0.jar
[INFO] Downloading from central: https://repo.maven.apache.org/maven2/org/apache/maven/shared/maven-shared-io/3.0.0/maven-shared-io-3.0.0.jar
[INFO] Downloaded from central: https://repo.maven.apache.org/maven2/org/apache/maven/maven-compat/3.0/maven-compat-3.0.jar (285 kB at 4.3 MB/s)
[INFO] Downloading from central: https://repo.maven.apache.org/maven2/org/apache/commons/commons-compress/1.19/commons-compress-1.19.jar
[INFO] Downloaded from central: https://repo.maven.apache.org/maven2/org/apache/commons/commons-compress/1.19/commons-compress-1.19.jar (615 kB at 4.3 MB/s)
[INFO] Downloading from central: https://repo.maven.apache.org/maven2/org/tukaani/xz/1.8/xz-1.8.jar
[INFO] Downloaded from central: https://repo.maven.apache.org/maven2/org/apache/maven/wagon/wagon-provider-api/2.10/wagon-provider-api-2.10.jar (54 kB at 223 kB/s)
[INFO] Downloading from central: https://repo.maven.apache.org/maven2/org/codehaus/plexus/plexus-utils/3.3.0/plexus-utils-3.3.0.jar
[INFO] Downloaded from central: https://repo.maven.apache.org/maven2/org/apache/maven/maven-compat/3.0/maven-compat-3.0.jar (285 kB at 3.6 MB/s)
[INFO] Downloading from central: https://repo.maven.apache.org/maven2/org/apache/commons/commons-compress/1.19/commons-compress-1.19.jar
[INFO] Downloaded from central: https://repo.maven.apache.org/maven2/org/apache/commons/commons-compress/1.19/commons-compress-1.19.jar (615 kB at 3.6 MB/s)
[INFO] Downloading from central: https://repo.maven.apache.org/maven2/org/tukaani/xz/1.8/xz-1.8.jar
[INFO] Downloaded from central: https://repo.maven.apache.org/maven2/org/apache/maven/shared/maven-shared-io/3.0.0/maven-shared-io-3.0.0.jar (41 kB at 106 kB/s)
[INFO] Downloading from central: https://repo.maven.apache.org/maven2/org/codehaus/plexus/plexus-utils/3.3.0/plexus-utils-3.3.0.jar
[INFO] Downloaded from central: https://repo.maven.apache.org/maven2/org/apache/maven/shared/file-management/3.0.0/file-management-3.0.0.jar (35 kB at 110 kB/s)
[INFO] Downloaded from central: https://repo.maven.apache.org/maven2/org/apache/maven/shared/maven-shared-io/3.0.0/maven-shared-io-3.0.0.jar (41 kB at 109 kB/s)
[INFO] Downloaded from central: https://repo.maven.apache.org/maven2/org/codehaus/plexus/plexus-utils/3.3.0/plexus-utils-3.3.0.jar (263 kB at 561 kB/s)
[INFO] Downloaded from central: https://repo.maven.apache.org/maven2/org/codehaus/plexus/plexus-io/3.2.0/plexus-io-3.2.0.jar (76 kB at 161 kB/s)
[INFO] Downloaded from central: https://repo.maven.apache.org/maven2/org/tukaani/xz/1.8/xz-1.8.jar (109 kB at 230 kB/s)
[INFO] Downloaded from central: https://repo.maven.apache.org/maven2/org/apache/maven/wagon/wagon-provider-api/2.10/wagon-provider-api-2.10.jar (54 kB at 114 kB/s)
[INFO] Downloaded from central: https://repo.maven.apache.org/maven2/org/apache/maven/shared/file-management/3.0.0/file-management-3.0.0.jar (35 kB at 75 kB/s)
[INFO] Downloaded from central: https://repo.maven.apache.org/maven2/org/tukaani/xz/1.8/xz-1.8.jar (109 kB at 227 kB/s)
[INFO] Downloaded from central: https://repo.maven.apache.org/maven2/org/codehaus/plexus/plexus-utils/3.3.0/plexus-utils-3.3.0.jar (263 kB at 548 kB/s)
[INFO] Downloaded from central: https://repo.maven.apache.org/maven2/org/codehaus/plexus/plexus-io/3.2.0/plexus-io-3.2.0.jar (76 kB at 157 kB/s)
[INFO] Downloading from apache-snapshots: http://repository.apache.org/snapshots/org/apache/maven/maven-archiver/3.4.1-SNAPSHOT/maven-archiver-3.4.1-20191016.062626-16.jar
[INFO] Downloading from apache-snapshots: http://repository.apache.org/snapshots/org/apache/maven/maven-archiver/3.4.1-SNAPSHOT/maven-archiver-3.4.1-20191016.062626-16.jar
[INFO] Downloaded from apache-snapshots: http://repository.apache.org/snapshots/org/apache/maven/maven-archiver/3.4.1-SNAPSHOT/maven-archiver-3.4.1-20191016.062626-16.jar (25 kB at 39 kB/s)
[INFO] Downloaded from apache-snapshots: http://repository.apache.org/snapshots/org/apache/maven/maven-archiver/3.4.1-SNAPSHOT/maven-archiver-3.4.1-20191016.062626-16.jar (25 kB at 39 kB/s)
[INFO] Downloading from plexus-snapshots: https://oss.sonatype.org/content/repositories/plexus-snapshots/org/codehaus/plexus/plexus-archiver/4.2.0-SNAPSHOT/plexus-archiver-4.2.0-20191016.055243-10.jar
[INFO] Downloading from plexus-snapshots: https://oss.sonatype.org/content/repositories/plexus-snapshots/org/codehaus/plexus/plexus-archiver/4.2.0-SNAPSHOT/plexus-archiver-4.2.0-20191016.055243-10.jar
[INFO] Downloaded from plexus-snapshots: https://oss.sonatype.org/content/repositories/plexus-snapshots/org/codehaus/plexus/plexus-archiver/4.2.0-SNAPSHOT/plexus-archiver-4.2.0-20191016.055243-10.jar (196 kB at 210 kB/s)
[INFO] Downloaded from plexus-snapshots: https://oss.sonatype.org/content/repositories/plexus-snapshots/org/codehaus/plexus/plexus-archiver/4.2.0-SNAPSHOT/plexus-archiver-4.2.0-20191016.055243-10.jar (196 kB at 210 kB/s)
[INFO] ------------------------------------------------------------------------
[INFO] Reactor Summary for Apache Maven 3.6.3-SNAPSHOT:
[INFO] 
[INFO] Apache Maven ....................................... SUCCESS [ 55.590 s]
[INFO] Maven Model ........................................ FAILURE [ 21.387 s]
[INFO] Maven Artifact ..................................... SKIPPED
[INFO] Maven Plugin API ................................... SKIPPED
[INFO] Maven Builder Support .............................. SKIPPED
[INFO] Maven Model Builder ................................ SKIPPED
[INFO] Maven Settings ..................................... SKIPPED
[INFO] Maven Settings Builder ............................. SKIPPED
[INFO] Maven Repository Metadata Model .................... SKIPPED
[INFO] Maven Artifact Resolver Provider ................... SKIPPED
[INFO] Maven Core ......................................... SKIPPED
[INFO] Maven SLF4J Simple Provider ........................ SKIPPED
[INFO] Maven Embedder ..................................... SKIPPED
[INFO] Maven Compat ....................................... SKIPPED
[INFO] Apache Maven Distribution .......................... SKIPPED
[INFO] ------------------------------------------------------------------------
[INFO] BUILD FAILURE
[INFO] ------------------------------------------------------------------------
[INFO] Total time:  01:20 min
[INFO] Finished at: 2019-10-20T05:55:36-07:00
[INFO] ------------------------------------------------------------------------
[INFO] ------------------------------------------------------------------------
[INFO] Reactor Summary for Apache Maven 3.6.3-SNAPSHOT:
[INFO] 
[INFO] Apache Maven ....................................... SUCCESS [ 55.797 s]
[INFO] Maven Model ........................................ FAILURE [ 21.300 s]
[INFO] Maven Artifact ..................................... SKIPPED
[INFO] Maven Plugin API ................................... SKIPPED
[INFO] Maven Builder Support .............................. SKIPPED
[INFO] Maven Model Builder ................................ SKIPPED
[INFO] Maven Settings ..................................... SKIPPED
[INFO] Maven Settings Builder ............................. SKIPPED
[INFO] Maven Repository Metadata Model .................... SKIPPED
[INFO] Maven Artifact Resolver Provider ................... SKIPPED
[INFO] Maven Core ......................................... SKIPPED
[INFO] Maven SLF4J Simple Provider ........................ SKIPPED
[INFO] Maven Embedder ..................................... SKIPPED
[INFO] Maven Compat ....................................... SKIPPED
[INFO] Apache Maven Distribution .......................... SKIPPED
[INFO] ------------------------------------------------------------------------
[INFO] BUILD FAILURE
[INFO] ------------------------------------------------------------------------
[INFO] Total time:  01:20 min
[INFO] Finished at: 2019-10-20T05:55:36-07:00
[INFO] ------------------------------------------------------------------------
[INFO] [jenkins-event-spy] Generated F:\jenkins\jenkins-slave\workspace\maven-box_maven_reproducible@2@tmp\withMaven4a8b9c87\maven-spy-20191020-055415-7922898879630894468695.log
[ERROR] Failed to execute goal org.apache.maven.plugins:maven-jar-plugin:3.2.0.RB-SNAPSHOT:jar (default-jar) on project maven-model: Execution default-jar of goal org.apache.maven.plugins:maven-jar-plugin:3.2.0.RB-SNAPSHOT:jar failed: An API incompatibility was encountered while executing org.apache.maven.plugins:maven-jar-plugin:3.2.0.RB-SNAPSHOT:jar: java.lang.NoSuchMethodError: org.apache.maven.archiver.MavenArchiver.configureReproducible(Ljava/lang/String;)Ljava/util/Date;
[ERROR] -----------------------------------------------------
[ERROR] realm =    plugin>org.apache.maven.plugins:maven-jar-plugin:3.2.0.RB-SNAPSHOT
[ERROR] strategy = org.codehaus.plexus.classworlds.strategy.SelfFirstStrategy
[ERROR] urls[0] = file:/f:/jenkins/jenkins-slave/workspace/maven-box_maven_reproducible@2/.repository/org/apache/maven/plugins/maven-jar-plugin/3.2.0.RB-SNAPSHOT/maven-jar-plugin-3.2.0.RB-SNAPSHOT.jar
[ERROR] urls[1] = file:/f:/jenkins/jenkins-slave/workspace/maven-box_maven_reproducible@2/.repository/org/sonatype/sisu/sisu-inject-bean/1.4.2/sisu-inject-bean-1.4.2.jar
[ERROR] urls[2] = file:/f:/jenkins/jenkins-slave/workspace/maven-box_maven_reproducible@2/.repository/org/sonatype/sisu/sisu-guice/2.1.7/sisu-guice-2.1.7-noaop.jar
[ERROR] urls[3] = file:/f:/jenkins/jenkins-slave/workspace/maven-box_maven_reproducible@2/.repository/org/sonatype/aether/aether-util/1.7/aether-util-1.7.jar
[ERROR] urls[4] = file:/f:/jenkins/jenkins-slave/workspace/maven-box_maven_reproducible@2/.repository/org/codehaus/plexus/plexus-interpolation/1.14/plexus-interpolation-1.14.jar
[ERROR] urls[5] = file:/f:/jenkins/jenkins-slave/workspace/maven-box_maven_reproducible@2/.repository/org/codehaus/plexus/plexus-component-annotations/1.7.1/plexus-component-annotations-1.7.1.jar
[ERROR] urls[6] = file:/f:/jenkins/jenkins-slave/workspace/maven-box_maven_reproducible@2/.repository/org/sonatype/plexus/plexus-sec-dispatcher/1.3/plexus-sec-dispatcher-1.3.jar
[ERROR] urls[7] = file:/f:/jenkins/jenkins-slave/workspace/maven-box_maven_reproducible@2/.repository/org/sonatype/plexus/plexus-cipher/1.4/plexus-cipher-1.4.jar
[ERROR] urls[8] = file:/f:/jenkins/jenkins-slave/workspace/maven-box_maven_reproducible@2/.repository/org/apache/maven/shared/file-management/3.0.0/file-management-3.0.0.jar
[ERROR] urls[9] = file:/f:/jenkins/jenkins-slave/workspace/maven-box_maven_reproducible@2/.repository/org/apache/maven/shared/maven-shared-io/3.0.0/maven-shared-io-3.0.0.jar
[ERROR] urls[10] = file:/f:/jenkins/jenkins-slave/workspace/maven-box_maven_reproducible@2/.repository/org/apache/maven/maven-archiver/3.4.1-SNAPSHOT/maven-archiver-3.4.1-SNAPSHOT.jar
[ERROR] urls[11] = file:/f:/jenkins/jenkins-slave/workspace/maven-box_maven_reproducible@2/.repository/commons-io/commons-io/2.5/commons-io-2.5.jar
[ERROR] urls[12] = file:/f:/jenkins/jenkins-slave/workspace/maven-box_maven_reproducible@2/.repository/org/apache/maven/shared/maven-shared-utils/3.2.1/maven-shared-utils-3.2.1.jar
[ERROR] urls[13] = file:/f:/jenkins/jenkins-slave/workspace/maven-box_maven_reproducible@2/.repository/org/codehaus/plexus/plexus-archiver/4.2.0-SNAPSHOT/plexus-archiver-4.2.0-SNAPSHOT.jar
[ERROR] urls[14] = file:/f:/jenkins/jenkins-slave/workspace/maven-box_maven_reproducible@2/.repository/org/codehaus/plexus/plexus-io/3.2.0/plexus-io-3.2.0.jar
[ERROR] urls[15] = file:/f:/jenkins/jenkins-slave/workspace/maven-box_maven_reproducible@2/.repository/org/apache/commons/commons-compress/1.19/commons-compress-1.19.jar
[ERROR] urls[16] = file:/f:/jenkins/jenkins-slave/workspace/maven-box_maven_reproducible@2/.repository/org/iq80/snappy/snappy/0.4/snappy-0.4.jar
[ERROR] urls[17] = file:/f:/jenkins/jenkins-slave/workspace/maven-box_maven_reproducible@2/.repository/org/tukaani/xz/1.8/xz-1.8.jar
[ERROR] urls[18] = file:/f:/jenkins/jenkins-slave/workspace/maven-box_maven_reproducible@2/.repository/org/codehaus/plexus/plexus-utils/3.3.0/plexus-utils-3.3.0.jar
[ERROR] Number of foreign imports: 1
[ERROR] import: Entry[import  from realm ClassRealm[maven.api, parent: null]]
[ERROR] 
[ERROR] -----------------------------------------------------
[ERROR] -> [Help 1]
[ERROR] 
[ERROR] To see the full stack trace of the errors, re-run Maven with the -e switch.
[ERROR] Re-run Maven using the -X switch to enable full debug logging.
[ERROR] 
[ERROR] For more information about the errors and possible solutions, please read the following articles:
[ERROR] [Help 1] http://cwiki.apache.org/confluence/display/MAVEN/PluginContainerException
[ERROR] 
[ERROR] After correcting the problems, you can resume the build with the command
[ERROR]   mvn <args> -rf :maven-model
Picked up JAVA_TOOL_OPTIONS: -Dmaven.ext.class.path="f:\jenkins\jenkins-slave\workspace\maven-box_maven_reproducible@2@tmp\withMaven4a8b9c87\pipeline-maven-spy.jar" -Dorg.jenkinsci.plugins.pipeline.maven.reportsFolder="f:\jenkins\jenkins-slave\workspace\maven-box_maven_reproducible@2@tmp\withMaven4a8b9c87" 
[Pipeline] }
[withMaven] artifactsPublisher - Archive artifact pom.xml under org\apache\maven\maven\3.6.3-SNAPSHOT\maven-3.6.3-SNAPSHOT.pom
[withMaven] artifactsPublisher - Archive artifact target\maven-3.6.3-SNAPSHOT-site.xml under org\apache\maven\maven\3.6.3-SNAPSHOT\maven-3.6.3-SNAPSHOT-site.xml
[INFO] [jenkins-event-spy] Generated F:\jenkins\jenkins-slave\workspace\maven-box_maven_reproducible@tmp\withMaven021284f2\maven-spy-20191020-055415-8821455024685245118161.log
[ERROR] Failed to execute goal org.apache.maven.plugins:maven-jar-plugin:3.2.0.RB-SNAPSHOT:jar (default-jar) on project maven-model: Execution default-jar of goal org.apache.maven.plugins:maven-jar-plugin:3.2.0.RB-SNAPSHOT:jar failed: An API incompatibility was encountered while executing org.apache.maven.plugins:maven-jar-plugin:3.2.0.RB-SNAPSHOT:jar: java.lang.NoSuchMethodError: org.apache.maven.archiver.MavenArchiver.configureReproducible(Ljava/lang/String;)Ljava/util/Date;
[ERROR] -----------------------------------------------------
[ERROR] realm =    plugin>org.apache.maven.plugins:maven-jar-plugin:3.2.0.RB-SNAPSHOT
[ERROR] strategy = org.codehaus.plexus.classworlds.strategy.SelfFirstStrategy
[ERROR] urls[0] = file:/f:/jenkins/jenkins-slave/workspace/maven-box_maven_reproducible/.repository/org/apache/maven/plugins/maven-jar-plugin/3.2.0.RB-SNAPSHOT/maven-jar-plugin-3.2.0.RB-SNAPSHOT.jar
[ERROR] urls[1] = file:/f:/jenkins/jenkins-slave/workspace/maven-box_maven_reproducible/.repository/org/sonatype/sisu/sisu-inject-bean/1.4.2/sisu-inject-bean-1.4.2.jar
[ERROR] urls[2] = file:/f:/jenkins/jenkins-slave/workspace/maven-box_maven_reproducible/.repository/org/sonatype/sisu/sisu-guice/2.1.7/sisu-guice-2.1.7-noaop.jar
[ERROR] urls[3] = file:/f:/jenkins/jenkins-slave/workspace/maven-box_maven_reproducible/.repository/org/sonatype/aether/aether-util/1.7/aether-util-1.7.jar
[ERROR] urls[4] = file:/f:/jenkins/jenkins-slave/workspace/maven-box_maven_reproducible/.repository/org/codehaus/plexus/plexus-interpolation/1.14/plexus-interpolation-1.14.jar
[ERROR] urls[5] = file:/f:/jenkins/jenkins-slave/workspace/maven-box_maven_reproducible/.repository/org/codehaus/plexus/plexus-component-annotations/1.7.1/plexus-component-annotations-1.7.1.jar
[ERROR] urls[6] = file:/f:/jenkins/jenkins-slave/workspace/maven-box_maven_reproducible/.repository/org/sonatype/plexus/plexus-sec-dispatcher/1.3/plexus-sec-dispatcher-1.3.jar
[ERROR] urls[7] = file:/f:/jenkins/jenkins-slave/workspace/maven-box_maven_reproducible/.repository/org/sonatype/plexus/plexus-cipher/1.4/plexus-cipher-1.4.jar
[ERROR] urls[8] = file:/f:/jenkins/jenkins-slave/workspace/maven-box_maven_reproducible/.repository/org/apache/maven/shared/file-management/3.0.0/file-management-3.0.0.jar
[ERROR] urls[9] = file:/f:/jenkins/jenkins-slave/workspace/maven-box_maven_reproducible/.repository/org/apache/maven/shared/maven-shared-io/3.0.0/maven-shared-io-3.0.0.jar
[ERROR] urls[10] = file:/f:/jenkins/jenkins-slave/workspace/maven-box_maven_reproducible/.repository/org/apache/maven/maven-archiver/3.4.1-SNAPSHOT/maven-archiver-3.4.1-SNAPSHOT.jar
[ERROR] urls[11] = file:/f:/jenkins/jenkins-slave/workspace/maven-box_maven_reproducible/.repository/commons-io/commons-io/2.5/commons-io-2.5.jar
[ERROR] urls[12] = file:/f:/jenkins/jenkins-slave/workspace/maven-box_maven_reproducible/.repository/org/apache/maven/shared/maven-shared-utils/3.2.1/maven-shared-utils-3.2.1.jar
[ERROR] urls[13] = file:/f:/jenkins/jenkins-slave/workspace/maven-box_maven_reproducible/.repository/org/codehaus/plexus/plexus-archiver/4.2.0-SNAPSHOT/plexus-archiver-4.2.0-SNAPSHOT.jar
[ERROR] urls[14] = file:/f:/jenkins/jenkins-slave/workspace/maven-box_maven_reproducible/.repository/org/codehaus/plexus/plexus-io/3.2.0/plexus-io-3.2.0.jar
[ERROR] urls[15] = file:/f:/jenkins/jenkins-slave/workspace/maven-box_maven_reproducible/.repository/org/apache/commons/commons-compress/1.19/commons-compress-1.19.jar
[ERROR] urls[16] = file:/f:/jenkins/jenkins-slave/workspace/maven-box_maven_reproducible/.repository/org/iq80/snappy/snappy/0.4/snappy-0.4.jar
[ERROR] urls[17] = file:/f:/jenkins/jenkins-slave/workspace/maven-box_maven_reproducible/.repository/org/tukaani/xz/1.8/xz-1.8.jar
[ERROR] urls[18] = file:/f:/jenkins/jenkins-slave/workspace/maven-box_maven_reproducible/.repository/org/codehaus/plexus/plexus-utils/3.3.0/plexus-utils-3.3.0.jar
[ERROR] Number of foreign imports: 1
[ERROR] import: Entry[import  from realm ClassRealm[maven.api, parent: null]]
[ERROR] 
[ERROR] -----------------------------------------------------
[ERROR] -> [Help 1]
[ERROR] 
[ERROR] To see the full stack trace of the errors, re-run Maven with the -e switch.
[ERROR] Re-run Maven using the -X switch to enable full debug logging.
[ERROR] 
[ERROR] For more information about the errors and possible solutions, please read the following articles:
[ERROR] [Help 1] http://cwiki.apache.org/confluence/display/MAVEN/PluginContainerException
[ERROR] 
[ERROR] After correcting the problems, you can resume the build with the command
[ERROR]   mvn <args> -rf :maven-model
Picked up JAVA_TOOL_OPTIONS: -Dmaven.ext.class.path="f:\jenkins\jenkins-slave\workspace\maven-box_maven_reproducible@tmp\withMaven021284f2\pipeline-maven-spy.jar" -Dorg.jenkinsci.plugins.pipeline.maven.reportsFolder="f:\jenkins\jenkins-slave\workspace\maven-box_maven_reproducible@tmp\withMaven021284f2" 
[Pipeline] }
[withMaven] artifactsPublisher - Archive artifact pom.xml under org\apache\maven\maven\3.6.3-SNAPSHOT\maven-3.6.3-SNAPSHOT.pom
[withMaven] artifactsPublisher - Archive artifact target\maven-3.6.3-SNAPSHOT-site.xml under org\apache\maven\maven\3.6.3-SNAPSHOT\maven-3.6.3-SNAPSHOT-site.xml
[withMaven] junitPublisher - Archive test results for Maven artifact org.apache.maven:maven-model:jar:3.6.3-SNAPSHOT generated by maven-surefire-plugin:test (default-test): maven-model\target\surefire-reports\*.xml
Recording test results
None of the test reports contained any result
[withMaven] openTasksPublisher - Scan Tasks for Maven artifact org.apache.maven:maven-model:jar:3.6.3-SNAPSHOT in source directory maven-model\src\main\java
[TASKS] Scanning folder 'f:\jenkins\jenkins-slave\workspace\maven-box_maven_reproducible@2' for files matching the pattern 'maven-model\src\main\java\**\*' - excludes: null
[TASKS] Found 4 files to scan for tasks
[TASKS] Found 2 open tasks.
Skipping warnings blame since pipelines do not have an SCM link.%n
[TASKS] Computing warning deltas based on reference build #46
[withMaven] Publishers: Pipeline Graph Publisher: 1 ms, Generated Artifacts Publisher: 1109 ms, Junit Publisher: 14 ms, Open Task Scanner Publisher: 93 ms
[Pipeline] // withMaven
[Pipeline] }
[withMaven] junitPublisher - Archive test results for Maven artifact org.apache.maven:maven-model:jar:3.6.3-SNAPSHOT generated by maven-surefire-plugin:test (default-test): maven-model\target\surefire-reports\*.xml
Recording test results
[Pipeline] // stage
[Pipeline] }
None of the test reports contained any result
[Pipeline] // node
[Pipeline] }
Failed in branch windows-jdk8
[withMaven] openTasksPublisher - Scan Tasks for Maven artifact org.apache.maven:maven-model:jar:3.6.3-SNAPSHOT in source directory maven-model\src\main\java
[TASKS] Scanning folder 'f:\jenkins\jenkins-slave\workspace\maven-box_maven_reproducible' for files matching the pattern 'maven-model\src\main\java\**\*' - excludes: null
[TASKS] Found 4 files to scan for tasks
[TASKS] Found 2 open tasks.
Skipping warnings blame since pipelines do not have an SCM link.%n
[TASKS] Computing warning deltas based on reference build #46
[withMaven] Publishers: Pipeline Graph Publisher: 1 ms, Generated Artifacts Publisher: 1164 ms, Junit Publisher: 26 ms, Open Task Scanner Publisher: 93 ms
[Pipeline] // withMaven
[Pipeline] }
[Pipeline] // stage
[Pipeline] }
[Pipeline] // node
[Pipeline] }
Failed in branch windows-jdk7
[Pipeline] // parallel
[Pipeline] echo
[FAILURE-003] AbortException hudson.AbortException: script returned exit code 1
[Pipeline] stage
[Pipeline] { (Notifications)
[Pipeline] echo
Build result: FAILURE
[Pipeline] jiraIssueSelector
[Pipeline] echo
The authors of changes [hboutemy].
[Pipeline] echo
Sending email ...
[Pipeline] emailext