You are viewing a plain text version of this content. The canonical link for it is here.
Posted to commits@phoenix.apache.org by Apache Jenkins Server <je...@builds.apache.org> on 2020/08/13 17:50:38 UTC

Build failed in Jenkins: Phoenix | Master | HBase Profile » 2.3 #147

See <https://builds.apache.org/job/Phoenix-master-matrix/HBASE_PROFILE=2.3/147/display/redirect?page=changes>

Changes:

[stoty] PHOENIX-6056 Migrate from builds.apache.org by August 15


------------------------------------------
[...truncated 600.85 KB...]
	at org.apache.maven.surefire.junitcore.JUnitCoreWrapper.execute(JUnitCoreWrapper.java:75)
	at org.apache.maven.surefire.junitcore.JUnitCoreProvider.invoke(JUnitCoreProvider.java:158)
	at org.apache.maven.surefire.booter.ForkedBooter.invokeProviderInSameClassLoader(ForkedBooter.java:383)
	at org.apache.maven.surefire.booter.ForkedBooter.runSuitesInProcess(ForkedBooter.java:344)
	at org.apache.maven.surefire.booter.ForkedBooter.execute(ForkedBooter.java:125)
	at org.apache.maven.surefire.booter.ForkedBooter.main(ForkedBooter.java:417)
	at --------Future.get--------(Unknown Source)
	at org.apache.hadoop.hbase.procedure2.RemoteProcedureException.unwrapRemoteIOException(RemoteProcedureException.java:86)
	at org.apache.hadoop.hbase.master.procedure.MasterProcedureUtil.unwrapRemoteIOException(MasterProcedureUtil.java:196)
	at org.apache.hadoop.hbase.master.MasterRpcServices.getProcedureResult(MasterRpcServices.java:1263)
	at org.apache.hadoop.hbase.shaded.protobuf.generated.MasterProtos$MasterService$2.callBlockingMethod(MasterProtos.java)
	at org.apache.hadoop.hbase.ipc.RpcServer.call(RpcServer.java:393)
	at org.apache.hadoop.hbase.ipc.CallRunner.run(CallRunner.java:133)
	at org.apache.hadoop.hbase.ipc.RpcExecutor$Handler.run(RpcExecutor.java:338)
	at org.apache.hadoop.hbase.ipc.RpcExecutor$Handler.run(RpcExecutor.java:318)

[INFO] Running org.apache.phoenix.end2end.DropIndexedColsIT
[INFO] Tests run: 4, Failures: 0, Errors: 0, Skipped: 0, Time elapsed: 24.788 s - in org.apache.phoenix.end2end.DropIndexedColsIT
[INFO] Running org.apache.phoenix.end2end.TenantSpecificViewIndexSaltedIT
[ERROR] Tests run: 1, Failures: 0, Errors: 1, Skipped: 0, Time elapsed: 0.014 s <<< FAILURE! - in org.apache.phoenix.end2end.TenantSpecificViewIndexSaltedIT
[ERROR] org.apache.phoenix.end2end.TenantSpecificViewIndexSaltedIT  Time elapsed: 0.01 s  <<< ERROR!
java.io.IOException: java.lang.Exception: java.lang.AssertionError
	at java.lang.Thread.getStackTrace(Thread.java:1559)
	at org.apache.hadoop.hbase.util.FutureUtils.setStackTrace(FutureUtils.java:130)
	at org.apache.hadoop.hbase.util.FutureUtils.rethrow(FutureUtils.java:145)
	at org.apache.hadoop.hbase.util.FutureUtils.get(FutureUtils.java:182)
	at org.apache.hadoop.hbase.client.Admin.enableTable(Admin.java:487)
	at org.apache.phoenix.query.BaseTest.splitRegion(BaseTest.java:1824)
	at org.apache.phoenix.query.BaseTest.splitTable(BaseTest.java:1855)
	at org.apache.phoenix.query.BaseTest.splitSystemCatalog(BaseTest.java:1926)
	at org.apache.phoenix.end2end.SplitSystemCatalogIT.splitSystemCatalog(SplitSystemCatalogIT.java:85)
	at org.apache.phoenix.end2end.SplitSystemCatalogIT.doSetup(SplitSystemCatalogIT.java:68)
	at org.apache.phoenix.end2end.SplitSystemCatalogIT.doSetup(SplitSystemCatalogIT.java:54)
	at sun.reflect.NativeMethodAccessorImpl.invoke0(Native Method)
	at sun.reflect.NativeMethodAccessorImpl.invoke(NativeMethodAccessorImpl.java:62)
	at sun.reflect.DelegatingMethodAccessorImpl.invoke(DelegatingMethodAccessorImpl.java:43)
	at java.lang.reflect.Method.invoke(Method.java:498)
	at org.junit.runners.model.FrameworkMethod$1.runReflectiveCall(FrameworkMethod.java:59)
	at org.junit.internal.runners.model.ReflectiveCallable.run(ReflectiveCallable.java:12)
	at org.junit.runners.model.FrameworkMethod.invokeExplosively(FrameworkMethod.java:56)
	at org.junit.internal.runners.statements.RunBefores.invokeMethod(RunBefores.java:33)
	at org.junit.internal.runners.statements.RunBefores.evaluate(RunBefores.java:24)
	at org.junit.rules.ExternalResource$1.evaluate(ExternalResource.java:54)
	at org.junit.rules.RunRules.evaluate(RunRules.java:20)
	at org.junit.runners.ParentRunner$3.evaluate(ParentRunner.java:306)
	at org.junit.runners.ParentRunner.run(ParentRunner.java:413)
	at org.junit.runners.Suite.runChild(Suite.java:128)
	at org.junit.runners.Suite.runChild(Suite.java:27)
	at org.junit.runners.ParentRunner$4.run(ParentRunner.java:331)
	at org.junit.runners.ParentRunner$1.schedule(ParentRunner.java:79)
	at org.junit.runners.ParentRunner.runChildren(ParentRunner.java:329)
	at org.junit.runners.ParentRunner.access$100(ParentRunner.java:66)
	at org.junit.runners.ParentRunner$2.evaluate(ParentRunner.java:293)
	at org.junit.runners.ParentRunner$3.evaluate(ParentRunner.java:306)
	at org.junit.runners.ParentRunner.run(ParentRunner.java:413)
	at org.apache.maven.surefire.junitcore.JUnitCore.run(JUnitCore.java:55)
	at org.apache.maven.surefire.junitcore.JUnitCoreWrapper.createRequestAndRun(JUnitCoreWrapper.java:137)
	at org.apache.maven.surefire.junitcore.JUnitCoreWrapper.executeEager(JUnitCoreWrapper.java:107)
	at org.apache.maven.surefire.junitcore.JUnitCoreWrapper.execute(JUnitCoreWrapper.java:83)
	at org.apache.maven.surefire.junitcore.JUnitCoreWrapper.execute(JUnitCoreWrapper.java:75)
	at org.apache.maven.surefire.junitcore.JUnitCoreProvider.invoke(JUnitCoreProvider.java:158)
	at org.apache.maven.surefire.booter.ForkedBooter.invokeProviderInSameClassLoader(ForkedBooter.java:383)
	at org.apache.maven.surefire.booter.ForkedBooter.runSuitesInProcess(ForkedBooter.java:344)
	at org.apache.maven.surefire.booter.ForkedBooter.execute(ForkedBooter.java:125)
	at org.apache.maven.surefire.booter.ForkedBooter.main(ForkedBooter.java:417)
	at --------Future.get--------(Unknown Source)
	at org.apache.hadoop.hbase.procedure2.RemoteProcedureException.unwrapRemoteIOException(RemoteProcedureException.java:86)
	at org.apache.hadoop.hbase.master.procedure.MasterProcedureUtil.unwrapRemoteIOException(MasterProcedureUtil.java:196)
	at org.apache.hadoop.hbase.master.MasterRpcServices.getProcedureResult(MasterRpcServices.java:1263)
	at org.apache.hadoop.hbase.shaded.protobuf.generated.MasterProtos$MasterService$2.callBlockingMethod(MasterProtos.java)
	at org.apache.hadoop.hbase.ipc.RpcServer.call(RpcServer.java:393)
	at org.apache.hadoop.hbase.ipc.CallRunner.run(CallRunner.java:133)
	at org.apache.hadoop.hbase.ipc.RpcExecutor$Handler.run(RpcExecutor.java:338)
	at org.apache.hadoop.hbase.ipc.RpcExecutor$Handler.run(RpcExecutor.java:318)

[INFO] Running org.apache.phoenix.end2end.ViewIT
[ERROR] Tests run: 1, Failures: 0, Errors: 1, Skipped: 0, Time elapsed: 0.016 s <<< FAILURE! - in org.apache.phoenix.end2end.ViewIT
[ERROR] org.apache.phoenix.end2end.ViewIT  Time elapsed: 0.013 s  <<< ERROR!
java.io.IOException: java.lang.Exception: java.lang.AssertionError
	at java.lang.Thread.getStackTrace(Thread.java:1559)
	at org.apache.hadoop.hbase.util.FutureUtils.setStackTrace(FutureUtils.java:130)
	at org.apache.hadoop.hbase.util.FutureUtils.rethrow(FutureUtils.java:145)
	at org.apache.hadoop.hbase.util.FutureUtils.get(FutureUtils.java:182)
	at org.apache.hadoop.hbase.client.Admin.enableTable(Admin.java:487)
	at org.apache.phoenix.query.BaseTest.splitRegion(BaseTest.java:1824)
	at org.apache.phoenix.query.BaseTest.splitTable(BaseTest.java:1855)
	at org.apache.phoenix.query.BaseTest.splitSystemCatalog(BaseTest.java:1926)
	at org.apache.phoenix.end2end.SplitSystemCatalogIT.splitSystemCatalog(SplitSystemCatalogIT.java:85)
	at org.apache.phoenix.end2end.ViewIT.doSetup(ViewIT.java:147)
	at sun.reflect.NativeMethodAccessorImpl.invoke0(Native Method)
	at sun.reflect.NativeMethodAccessorImpl.invoke(NativeMethodAccessorImpl.java:62)
	at sun.reflect.DelegatingMethodAccessorImpl.invoke(DelegatingMethodAccessorImpl.java:43)
	at java.lang.reflect.Method.invoke(Method.java:498)
	at org.junit.runners.model.FrameworkMethod$1.runReflectiveCall(FrameworkMethod.java:59)
	at org.junit.internal.runners.model.ReflectiveCallable.run(ReflectiveCallable.java:12)
	at org.junit.runners.model.FrameworkMethod.invokeExplosively(FrameworkMethod.java:56)
	at org.junit.internal.runners.statements.RunBefores.invokeMethod(RunBefores.java:33)
	at org.junit.internal.runners.statements.RunBefores.evaluate(RunBefores.java:24)
	at org.junit.rules.ExternalResource$1.evaluate(ExternalResource.java:54)
	at org.junit.rules.RunRules.evaluate(RunRules.java:20)
	at org.junit.runners.ParentRunner$3.evaluate(ParentRunner.java:306)
	at org.junit.runners.ParentRunner.run(ParentRunner.java:413)
	at org.junit.runners.Suite.runChild(Suite.java:128)
	at org.junit.runners.Suite.runChild(Suite.java:27)
	at org.junit.runners.ParentRunner$4.run(ParentRunner.java:331)
	at org.junit.runners.ParentRunner$1.schedule(ParentRunner.java:79)
	at org.junit.runners.ParentRunner.runChildren(ParentRunner.java:329)
	at org.junit.runners.ParentRunner.access$100(ParentRunner.java:66)
	at org.junit.runners.ParentRunner$2.evaluate(ParentRunner.java:293)
	at org.junit.runners.ParentRunner$3.evaluate(ParentRunner.java:306)
	at org.junit.runners.ParentRunner.run(ParentRunner.java:413)
	at org.apache.maven.surefire.junitcore.JUnitCore.run(JUnitCore.java:55)
	at org.apache.maven.surefire.junitcore.JUnitCoreWrapper.createRequestAndRun(JUnitCoreWrapper.java:137)
	at org.apache.maven.surefire.junitcore.JUnitCoreWrapper.executeEager(JUnitCoreWrapper.java:107)
	at org.apache.maven.surefire.junitcore.JUnitCoreWrapper.execute(JUnitCoreWrapper.java:83)
	at org.apache.maven.surefire.junitcore.JUnitCoreWrapper.execute(JUnitCoreWrapper.java:75)
	at org.apache.maven.surefire.junitcore.JUnitCoreProvider.invoke(JUnitCoreProvider.java:158)
	at org.apache.maven.surefire.booter.ForkedBooter.invokeProviderInSameClassLoader(ForkedBooter.java:383)
	at org.apache.maven.surefire.booter.ForkedBooter.runSuitesInProcess(ForkedBooter.java:344)
	at org.apache.maven.surefire.booter.ForkedBooter.execute(ForkedBooter.java:125)
	at org.apache.maven.surefire.booter.ForkedBooter.main(ForkedBooter.java:417)
	at --------Future.get--------(Unknown Source)
	at org.apache.hadoop.hbase.procedure2.RemoteProcedureException.unwrapRemoteIOException(RemoteProcedureException.java:86)
	at org.apache.hadoop.hbase.master.procedure.MasterProcedureUtil.unwrapRemoteIOException(MasterProcedureUtil.java:196)
	at org.apache.hadoop.hbase.master.MasterRpcServices.getProcedureResult(MasterRpcServices.java:1263)
	at org.apache.hadoop.hbase.shaded.protobuf.generated.MasterProtos$MasterService$2.callBlockingMethod(MasterProtos.java)
	at org.apache.hadoop.hbase.ipc.RpcServer.call(RpcServer.java:393)
	at org.apache.hadoop.hbase.ipc.CallRunner.run(CallRunner.java:133)
	at org.apache.hadoop.hbase.ipc.RpcExecutor$Handler.run(RpcExecutor.java:338)
	at org.apache.hadoop.hbase.ipc.RpcExecutor$Handler.run(RpcExecutor.java:318)

[INFO] Running org.apache.phoenix.end2end.ViewMetadataIT
[ERROR] Tests run: 1, Failures: 0, Errors: 1, Skipped: 0, Time elapsed: 0.008 s <<< FAILURE! - in org.apache.phoenix.end2end.ViewMetadataIT
[ERROR] org.apache.phoenix.end2end.ViewMetadataIT  Time elapsed: 0.006 s  <<< ERROR!
java.io.IOException: java.lang.Exception: java.lang.AssertionError
	at java.lang.Thread.getStackTrace(Thread.java:1559)
	at org.apache.hadoop.hbase.util.FutureUtils.setStackTrace(FutureUtils.java:130)
	at org.apache.hadoop.hbase.util.FutureUtils.rethrow(FutureUtils.java:145)
	at org.apache.hadoop.hbase.util.FutureUtils.get(FutureUtils.java:182)
	at org.apache.hadoop.hbase.client.Admin.enableTable(Admin.java:487)
	at org.apache.phoenix.query.BaseTest.splitRegion(BaseTest.java:1824)
	at org.apache.phoenix.query.BaseTest.splitTable(BaseTest.java:1855)
	at org.apache.phoenix.query.BaseTest.splitSystemCatalog(BaseTest.java:1926)
	at org.apache.phoenix.end2end.SplitSystemCatalogIT.splitSystemCatalog(SplitSystemCatalogIT.java:85)
	at org.apache.phoenix.end2end.ViewMetadataIT.doSetup(ViewMetadataIT.java:104)
	at sun.reflect.NativeMethodAccessorImpl.invoke0(Native Method)
	at sun.reflect.NativeMethodAccessorImpl.invoke(NativeMethodAccessorImpl.java:62)
	at sun.reflect.DelegatingMethodAccessorImpl.invoke(DelegatingMethodAccessorImpl.java:43)
	at java.lang.reflect.Method.invoke(Method.java:498)
	at org.junit.runners.model.FrameworkMethod$1.runReflectiveCall(FrameworkMethod.java:59)
	at org.junit.internal.runners.model.ReflectiveCallable.run(ReflectiveCallable.java:12)
	at org.junit.runners.model.FrameworkMethod.invokeExplosively(FrameworkMethod.java:56)
	at org.junit.internal.runners.statements.RunBefores.invokeMethod(RunBefores.java:33)
	at org.junit.internal.runners.statements.RunBefores.evaluate(RunBefores.java:24)
	at org.junit.rules.ExternalResource$1.evaluate(ExternalResource.java:54)
	at org.junit.rules.RunRules.evaluate(RunRules.java:20)
	at org.junit.runners.ParentRunner$3.evaluate(ParentRunner.java:306)
	at org.junit.runners.ParentRunner.run(ParentRunner.java:413)
	at org.junit.runners.Suite.runChild(Suite.java:128)
	at org.junit.runners.Suite.runChild(Suite.java:27)
	at org.junit.runners.ParentRunner$4.run(ParentRunner.java:331)
	at org.junit.runners.ParentRunner$1.schedule(ParentRunner.java:79)
	at org.junit.runners.ParentRunner.runChildren(ParentRunner.java:329)
	at org.junit.runners.ParentRunner.access$100(ParentRunner.java:66)
	at org.junit.runners.ParentRunner$2.evaluate(ParentRunner.java:293)
	at org.junit.runners.ParentRunner$3.evaluate(ParentRunner.java:306)
	at org.junit.runners.ParentRunner.run(ParentRunner.java:413)
	at org.apache.maven.surefire.junitcore.JUnitCore.run(JUnitCore.java:55)
	at org.apache.maven.surefire.junitcore.JUnitCoreWrapper.createRequestAndRun(JUnitCoreWrapper.java:137)
	at org.apache.maven.surefire.junitcore.JUnitCoreWrapper.executeEager(JUnitCoreWrapper.java:107)
	at org.apache.maven.surefire.junitcore.JUnitCoreWrapper.execute(JUnitCoreWrapper.java:83)
	at org.apache.maven.surefire.junitcore.JUnitCoreWrapper.execute(JUnitCoreWrapper.java:75)
	at org.apache.maven.surefire.junitcore.JUnitCoreProvider.invoke(JUnitCoreProvider.java:158)
	at org.apache.maven.surefire.booter.ForkedBooter.invokeProviderInSameClassLoader(ForkedBooter.java:383)
	at org.apache.maven.surefire.booter.ForkedBooter.runSuitesInProcess(ForkedBooter.java:344)
	at org.apache.maven.surefire.booter.ForkedBooter.execute(ForkedBooter.java:125)
	at org.apache.maven.surefire.booter.ForkedBooter.main(ForkedBooter.java:417)
	at --------Future.get--------(Unknown Source)
	at org.apache.hadoop.hbase.procedure2.RemoteProcedureException.unwrapRemoteIOException(RemoteProcedureException.java:86)
	at org.apache.hadoop.hbase.master.procedure.MasterProcedureUtil.unwrapRemoteIOException(MasterProcedureUtil.java:196)
	at org.apache.hadoop.hbase.master.MasterRpcServices.getProcedureResult(MasterRpcServices.java:1263)
	at org.apache.hadoop.hbase.shaded.protobuf.generated.MasterProtos$MasterService$2.callBlockingMethod(MasterProtos.java)
	at org.apache.hadoop.hbase.ipc.RpcServer.call(RpcServer.java:393)
	at org.apache.hadoop.hbase.ipc.CallRunner.run(CallRunner.java:133)
	at org.apache.hadoop.hbase.ipc.RpcExecutor$Handler.run(RpcExecutor.java:338)
	at org.apache.hadoop.hbase.ipc.RpcExecutor$Handler.run(RpcExecutor.java:318)

[INFO] Running org.apache.phoenix.end2end.TenantSpecificViewIndexIT
[INFO] Tests run: 11, Failures: 0, Errors: 0, Skipped: 0, Time elapsed: 61.441 s - in org.apache.phoenix.end2end.TenantSpecificViewIndexIT
[INFO] Running org.apache.phoenix.end2end.index.ViewIndexIT
[WARNING] Tests run: 24, Failures: 0, Errors: 0, Skipped: 2, Time elapsed: 70.17 s - in org.apache.phoenix.end2end.index.ViewIndexIT
[INFO] 
[INFO] Results:
[INFO] 
[ERROR] Errors: 
[ERROR]   AlterMultiTenantTableWithViewsIT>SplitSystemCatalogIT.doSetup:54->SplitSystemCatalogIT.doSetup:68->SplitSystemCatalogIT.splitSystemCatalog:85->BaseTest.splitSystemCatalog:1926->BaseTest.splitTable:1855->BaseTest.splitRegion:1824 » IO
[ERROR]   AlterTableWithViewsIT>SplitSystemCatalogIT.doSetup:54->SplitSystemCatalogIT.doSetup:68->SplitSystemCatalogIT.splitSystemCatalog:85->BaseTest.splitSystemCatalog:1926->BaseTest.splitTable:1855->BaseTest.splitRegion:1824 » IO
[ERROR]   DropTableWithViewsIT.doSetup:72->SplitSystemCatalogIT.doSetup:68->SplitSystemCatalogIT.splitSystemCatalog:85->BaseTest.splitSystemCatalog:1926->BaseTest.splitTable:1855->BaseTest.splitRegion:1824 » IO
[ERROR]   TenantSpecificViewIndexSaltedIT>SplitSystemCatalogIT.doSetup:54->SplitSystemCatalogIT.doSetup:68->SplitSystemCatalogIT.splitSystemCatalog:85->BaseTest.splitSystemCatalog:1926->BaseTest.splitTable:1855->BaseTest.splitRegion:1824 » IO
[ERROR]   ViewIT.doSetup:147->SplitSystemCatalogIT.splitSystemCatalog:85->BaseTest.splitSystemCatalog:1926->BaseTest.splitTable:1855->BaseTest.splitRegion:1824 » IO
[ERROR]   ViewMetadataIT.doSetup:104->SplitSystemCatalogIT.splitSystemCatalog:85->BaseTest.splitSystemCatalog:1926->BaseTest.splitTable:1855->BaseTest.splitRegion:1824 » IO
[INFO] 
[ERROR] Tests run: 45, Failures: 0, Errors: 6, Skipped: 2
[INFO] 
[INFO] 
[INFO] --- jacoco-maven-plugin:0.7.9:report (report) @ phoenix-core ---
[INFO] Loading execution data file <https://builds.apache.org/job/Phoenix-master-matrix/HBASE_PROFILE=2.3/ws/phoenix-core/target/jacoco.exec>
[INFO] Analyzed bundle 'Phoenix Core' with 2079 classes
[INFO] 
[INFO] --- maven-failsafe-plugin:2.22.0:verify (ParallelStatsEnabledTest) @ phoenix-core ---
[INFO] ------------------------------------------------------------------------
[INFO] Reactor Summary for Apache Phoenix 5.1.0-SNAPSHOT:
[INFO] 
[INFO] Phoenix Hbase 2.3.0 compatibility .................. SUCCESS [  7.733 s]
[INFO] Phoenix Hbase 2.2.1 compatibility .................. SUCCESS [  2.916 s]
[INFO] Phoenix Hbase 2.1.6 compatibility .................. SUCCESS [  2.078 s]
[INFO] Apache Phoenix ..................................... SUCCESS [  2.829 s]
[INFO] Phoenix Core ....................................... FAILURE [  01:56 h]
[INFO] Phoenix - Pherf .................................... SKIPPED
[INFO] Phoenix Client ..................................... SKIPPED
[INFO] Phoenix Server ..................................... SKIPPED
[INFO] Phoenix - Tracing Web Application .................. SKIPPED
[INFO] Phoenix Assembly ................................... SKIPPED
[INFO] phoenix-tools ...................................... SKIPPED
[INFO] ------------------------------------------------------------------------
[INFO] BUILD FAILURE
[INFO] ------------------------------------------------------------------------
[INFO] Total time:  01:56 h
[INFO] Finished at: 2020-08-13T17:50:27Z
[INFO] ------------------------------------------------------------------------
[ERROR] Failed to execute goal org.apache.maven.plugins:maven-failsafe-plugin:2.22.0:verify (ParallelStatsEnabledTest) on project phoenix-core: There are test failures.
[ERROR] 
[ERROR] Please refer to <https://builds.apache.org/job/Phoenix-master-matrix/HBASE_PROFILE=2.3/ws/phoenix-core/target/failsafe-reports> for the individual test results.
[ERROR] Please refer to dump files (if any exist) [date]-jvmRun[N].dump, [date].dumpstream and [date]-jvmRun[N].dumpstream.
[ERROR] -> [Help 1]
[ERROR] 
[ERROR] To see the full stack trace of the errors, re-run Maven with the -e switch.
[ERROR] Re-run Maven using the -X switch to enable full debug logging.
[ERROR] 
[ERROR] For more information about the errors and possible solutions, please read the following articles:
[ERROR] [Help 1] http://cwiki.apache.org/confluence/display/MAVEN/MojoFailureException
[ERROR] 
[ERROR] After correcting the problems, you can resume the build with the command
[ERROR]   mvn <args> -rf :phoenix-core
Build step 'Invoke top-level Maven targets' marked build as failure
Archiving artifacts
[Fast Archiver] No prior successful build to compare, so performing full copy of artifacts
Recording test results
Not sending mail to unregistered user s.kadam@salesforce.com