You are viewing a plain text version of this content. The canonical link for it is here.
Posted to dev@kafka.apache.org by Apache Jenkins Server <je...@builds.apache.org> on 2024/03/09 02:17:28 UTC

Jenkins build is still unstable: Kafka » Kafka Branch Builder » 3.7 #107

See <https://ci-builds.apache.org/job/Kafka/job/kafka/job/3.7/107/display/redirect>


Build failed in Jenkins: Kafka » Kafka Branch Builder » 3.7 #111

Posted by Apache Jenkins Server <je...@builds.apache.org>.
See <https://ci-builds.apache.org/job/Kafka/job/kafka/job/3.7/111/display/redirect>

Changes:


------------------------------------------
[...truncated 447811 lines...]
[2024-03-15T11:06:41.016Z] Gradle Test Run :core:test > Gradle Test Executor 113 > PlaintextConsumerTest > testPerPartitionLagMetricsCleanUpWithSubscribe(String, String) > testPerPartitionLagMetricsCleanUpWithSubscribe(String, String).quorum=kraft+kip848.groupProtocol=classic PASSED
[2024-03-15T11:06:41.016Z] 
[2024-03-15T11:06:41.016Z] Gradle Test Run :core:test > Gradle Test Executor 113 > PlaintextConsumerTest > testPerPartitionLagMetricsCleanUpWithSubscribe(String, String) > testPerPartitionLagMetricsCleanUpWithSubscribe(String, String).quorum=kraft+kip848.groupProtocol=consumer STARTED
[2024-03-15T11:06:49.142Z] kafka.api.PlaintextConsumerTest.testPerPartitionLagMetricsCleanUpWithSubscribe(String, String)[4] failed, log available in /home/jenkins/workspace/Kafka_kafka_3.7/core/build/reports/testOutput/kafka.api.PlaintextConsumerTest.testPerPartitionLagMetricsCleanUpWithSubscribe(String, String)[4].test.stdout
[2024-03-15T11:06:49.142Z] 
[2024-03-15T11:06:49.142Z] Gradle Test Run :core:test > Gradle Test Executor 113 > PlaintextConsumerTest > testPerPartitionLagMetricsCleanUpWithSubscribe(String, String) > testPerPartitionLagMetricsCleanUpWithSubscribe(String, String).quorum=kraft+kip848.groupProtocol=consumer FAILED
[2024-03-15T11:06:49.142Z]     org.opentest4j.AssertionFailedError: should be assigned once ==> expected: <1> but was: <0>
[2024-03-15T11:06:49.142Z]         at app//org.junit.jupiter.api.AssertionFailureBuilder.build(AssertionFailureBuilder.java:151)
[2024-03-15T11:06:49.142Z]         at app//org.junit.jupiter.api.AssertionFailureBuilder.buildAndThrow(AssertionFailureBuilder.java:132)
[2024-03-15T11:06:49.142Z]         at app//org.junit.jupiter.api.AssertEquals.failNotEqual(AssertEquals.java:197)
[2024-03-15T11:06:49.142Z]         at app//org.junit.jupiter.api.AssertEquals.assertEquals(AssertEquals.java:150)
[2024-03-15T11:06:49.142Z]         at app//org.junit.jupiter.api.Assertions.assertEquals(Assertions.java:563)
[2024-03-15T11:06:49.142Z]         at app//kafka.api.PlaintextConsumerTest.testPerPartitionLagMetricsCleanUpWithSubscribe(PlaintextConsumerTest.scala:1653)
[2024-03-15T11:06:49.142Z] 
[2024-03-15T11:06:49.142Z] Gradle Test Run :core:test > Gradle Test Executor 113 > PlaintextConsumerTest > testPerPartitionLeadMetricsCleanUpWithSubscribe(String, String) > testPerPartitionLeadMetricsCleanUpWithSubscribe(String, String).quorum=zk.groupProtocol=classic STARTED
[2024-03-15T11:06:54.251Z] 
[2024-03-15T11:06:54.251Z] Gradle Test Run :core:test > Gradle Test Executor 113 > PlaintextConsumerTest > testPerPartitionLeadMetricsCleanUpWithSubscribe(String, String) > testPerPartitionLeadMetricsCleanUpWithSubscribe(String, String).quorum=zk.groupProtocol=classic PASSED
[2024-03-15T11:06:54.251Z] 
[2024-03-15T11:06:54.251Z] Gradle Test Run :core:test > Gradle Test Executor 113 > PlaintextConsumerTest > testPerPartitionLeadMetricsCleanUpWithSubscribe(String, String) > testPerPartitionLeadMetricsCleanUpWithSubscribe(String, String).quorum=kraft.groupProtocol=classic STARTED
[2024-03-15T11:06:59.580Z] 
[2024-03-15T11:06:59.581Z] Gradle Test Run :core:test > Gradle Test Executor 113 > PlaintextConsumerTest > testPerPartitionLeadMetricsCleanUpWithSubscribe(String, String) > testPerPartitionLeadMetricsCleanUpWithSubscribe(String, String).quorum=kraft.groupProtocol=classic PASSED
[2024-03-15T11:06:59.581Z] 
[2024-03-15T11:06:59.581Z] Gradle Test Run :core:test > Gradle Test Executor 113 > PlaintextConsumerTest > testPerPartitionLeadMetricsCleanUpWithSubscribe(String, String) > testPerPartitionLeadMetricsCleanUpWithSubscribe(String, String).quorum=kraft+kip848.groupProtocol=classic STARTED
[2024-03-15T11:07:05.010Z] 
[2024-03-15T11:07:05.010Z] Gradle Test Run :core:test > Gradle Test Executor 112 > TransactionsBounceTest > testWithGroupMetadata() PASSED
[2024-03-15T11:07:06.655Z] 
[2024-03-15T11:07:06.655Z] Gradle Test Run :core:test > Gradle Test Executor 113 > PlaintextConsumerTest > testPerPartitionLeadMetricsCleanUpWithSubscribe(String, String) > testPerPartitionLeadMetricsCleanUpWithSubscribe(String, String).quorum=kraft+kip848.groupProtocol=classic PASSED
[2024-03-15T11:07:06.655Z] 
[2024-03-15T11:07:06.655Z] Gradle Test Run :core:test > Gradle Test Executor 113 > PlaintextConsumerTest > testPerPartitionLeadMetricsCleanUpWithSubscribe(String, String) > testPerPartitionLeadMetricsCleanUpWithSubscribe(String, String).quorum=kraft+kip848.groupProtocol=consumer STARTED
[2024-03-15T11:07:13.564Z] kafka.api.PlaintextConsumerTest.testPerPartitionLeadMetricsCleanUpWithSubscribe(String, String)[4] failed, log available in /home/jenkins/workspace/Kafka_kafka_3.7/core/build/reports/testOutput/kafka.api.PlaintextConsumerTest.testPerPartitionLeadMetricsCleanUpWithSubscribe(String, String)[4].test.stdout
[2024-03-15T11:07:13.564Z] 
[2024-03-15T11:07:13.564Z] Gradle Test Run :core:test > Gradle Test Executor 113 > PlaintextConsumerTest > testPerPartitionLeadMetricsCleanUpWithSubscribe(String, String) > testPerPartitionLeadMetricsCleanUpWithSubscribe(String, String).quorum=kraft+kip848.groupProtocol=consumer FAILED
[2024-03-15T11:07:13.564Z]     org.opentest4j.AssertionFailedError: should be assigned once ==> expected: <1> but was: <0>
[2024-03-15T11:07:13.564Z]         at app//org.junit.jupiter.api.AssertionFailureBuilder.build(AssertionFailureBuilder.java:151)
[2024-03-15T11:07:13.564Z]         at app//org.junit.jupiter.api.AssertionFailureBuilder.buildAndThrow(AssertionFailureBuilder.java:132)
[2024-03-15T11:07:13.564Z]         at app//org.junit.jupiter.api.AssertEquals.failNotEqual(AssertEquals.java:197)
[2024-03-15T11:07:13.564Z]         at app//org.junit.jupiter.api.AssertEquals.assertEquals(AssertEquals.java:150)
[2024-03-15T11:07:13.564Z]         at app//org.junit.jupiter.api.Assertions.assertEquals(Assertions.java:563)
[2024-03-15T11:07:13.564Z]         at app//kafka.api.PlaintextConsumerTest.testPerPartitionLeadMetricsCleanUpWithSubscribe(PlaintextConsumerTest.scala:1613)
[2024-03-15T11:07:13.564Z] 
[2024-03-15T11:07:13.564Z] Gradle Test Run :core:test > Gradle Test Executor 113 > LogDirFailureTest > testIOExceptionDuringLogRoll(String) > testIOExceptionDuringLogRoll(String).quorum=zk STARTED
[2024-03-15T11:07:21.595Z] 
[2024-03-15T11:07:21.595Z] Gradle Test Run :core:test > Gradle Test Executor 113 > LogDirFailureTest > testIOExceptionDuringLogRoll(String) > testIOExceptionDuringLogRoll(String).quorum=zk PASSED
[2024-03-15T11:07:21.595Z] 
[2024-03-15T11:07:21.595Z] Gradle Test Run :core:test > Gradle Test Executor 113 > LogDirFailureTest > testIOExceptionDuringLogRoll(String) > testIOExceptionDuringLogRoll(String).quorum=kraft STARTED
[2024-03-15T11:07:28.131Z] 
[2024-03-15T11:07:28.131Z] Gradle Test Run :core:test > Gradle Test Executor 113 > LogDirFailureTest > testIOExceptionDuringLogRoll(String) > testIOExceptionDuringLogRoll(String).quorum=kraft PASSED
[2024-03-15T11:07:28.131Z] 
[2024-03-15T11:07:28.131Z] Gradle Test Run :core:test > Gradle Test Executor 113 > LogDirFailureTest > testProduceErrorFromFailureOnLogRoll(String) > testProduceErrorFromFailureOnLogRoll(String).quorum=zk STARTED
[2024-03-15T11:07:32.859Z] 
[2024-03-15T11:07:32.859Z] Gradle Test Run :core:test > Gradle Test Executor 113 > LogDirFailureTest > testProduceErrorFromFailureOnLogRoll(String) > testProduceErrorFromFailureOnLogRoll(String).quorum=zk PASSED
[2024-03-15T11:07:32.859Z] 
[2024-03-15T11:07:32.859Z] Gradle Test Run :core:test > Gradle Test Executor 113 > LogDirFailureTest > testProduceErrorFromFailureOnLogRoll(String) > testProduceErrorFromFailureOnLogRoll(String).quorum=kraft STARTED
[2024-03-15T11:07:36.161Z] kafka.server.LogDirFailureTest.testProduceErrorFromFailureOnLogRoll(String)[2] failed, log available in /home/jenkins/workspace/Kafka_kafka_3.7/core/build/reports/testOutput/kafka.server.LogDirFailureTest.testProduceErrorFromFailureOnLogRoll(String)[2].test.stdout
[2024-03-15T11:07:36.161Z] 
[2024-03-15T11:07:36.161Z] Gradle Test Run :core:test > Gradle Test Executor 113 > LogDirFailureTest > testProduceErrorFromFailureOnLogRoll(String) > testProduceErrorFromFailureOnLogRoll(String).quorum=kraft FAILED
[2024-03-15T11:07:36.161Z]     org.opentest4j.AssertionFailedError: expected: <true> but was: <false>
[2024-03-15T11:07:36.161Z]         at app//org.junit.jupiter.api.AssertionFailureBuilder.build(AssertionFailureBuilder.java:151)
[2024-03-15T11:07:36.161Z]         at app//org.junit.jupiter.api.AssertionFailureBuilder.buildAndThrow(AssertionFailureBuilder.java:132)
[2024-03-15T11:07:36.161Z]         at app//org.junit.jupiter.api.AssertTrue.failNotTrue(AssertTrue.java:63)
[2024-03-15T11:07:36.161Z]         at app//org.junit.jupiter.api.AssertTrue.assertTrue(AssertTrue.java:36)
[2024-03-15T11:07:36.161Z]         at app//org.junit.jupiter.api.AssertTrue.assertTrue(AssertTrue.java:31)
[2024-03-15T11:07:36.161Z]         at app//org.junit.jupiter.api.Assertions.assertTrue(Assertions.java:183)
[2024-03-15T11:07:36.161Z]         at app//kafka.utils.TestUtils$.causeLogDirFailure(TestUtils.scala:1671)
[2024-03-15T11:07:36.161Z]         at app//kafka.server.LogDirFailureTest.testProduceErrorsFromLogDirFailureOnLeader(LogDirFailureTest.scala:161)
[2024-03-15T11:07:36.161Z]         at app//kafka.server.LogDirFailureTest.testProduceErrorFromFailureOnLogRoll(LogDirFailureTest.scala:64)
[2024-03-15T11:07:36.161Z] 
[2024-03-15T11:07:36.161Z] 5515 tests completed, 8 failed, 18 skipped
[2024-03-15T11:07:44.617Z] There were failing tests. See the report at: file:///home/jenkins/workspace/Kafka_kafka_3.7/core/build/reports/tests/test/index.html
[2024-03-15T11:07:47.737Z] 
[2024-03-15T11:07:47.737Z] Deprecated Gradle features were used in this build, making it incompatible with Gradle 9.0.
[2024-03-15T11:07:47.737Z] 
[2024-03-15T11:07:47.737Z] You can use '--warning-mode all' to show the individual deprecation warnings and determine if they come from your own scripts or plugins.
[2024-03-15T11:07:47.737Z] 
[2024-03-15T11:07:47.737Z] For more on this, please refer to https://docs.gradle.org/8.6/userguide/command_line_interface.html#sec:command_line_warnings in the Gradle documentation.
[2024-03-15T11:07:47.737Z] 
[2024-03-15T11:07:47.737Z] BUILD SUCCESSFUL in 4h 2m 28s
[2024-03-15T11:07:47.737Z] 314 actionable tasks: 116 executed, 198 up-to-date
[2024-03-15T11:07:49.456Z] 
[2024-03-15T11:07:49.456Z] Publishing build scan...
[2024-03-15T11:07:51.177Z] https://ge.apache.org/s/f5oyw27and55y
[2024-03-15T11:07:51.177Z] 
[2024-03-15T11:07:52.894Z] 
[2024-03-15T11:07:52.894Z] See the profiling report at: file:///home/jenkins/workspace/Kafka_kafka_3.7/build/reports/profile/profile-2024-03-15-07-06-01.html
[2024-03-15T11:07:52.894Z] A fine-grained performance profile is available: use the --scan option.
[Pipeline] junit
[2024-03-15T11:07:58.644Z] Recording test results
[2024-03-15T11:09:31.190Z] [Checks API] No suitable checks publisher found.
[Pipeline] echo
[2024-03-15T11:09:31.192Z] Skipping Kafka Streams archetype test for Java 17
[Pipeline] }
[Pipeline] // withEnv
[Pipeline] }
[Pipeline] // withEnv
[Pipeline] }
[Pipeline] // withEnv
[Pipeline] }
[Pipeline] // node
[Pipeline] }
[Pipeline] // timestamps
[Pipeline] }
[Pipeline] // timeout
[Pipeline] }
[Pipeline] // stage
[Pipeline] }
Cancelling nested steps due to timeout
[2024-03-15T14:47:51.815Z] Sending interrupt signal to process
[2024-03-15T14:47:55.029Z] 
[2024-03-15T14:47:55.029Z] > Task :connect:mirror:test FAILED
[2024-03-15T14:47:55.029Z] Could not stop org.gradle.internal.actor.internal.DefaultActorFactory$NonBlockingActor@5cdfdc8e.
[2024-03-15T14:47:55.029Z] org.gradle.internal.dispatch.DispatchException: Could not dispatch message [MethodInvocation method: stop()].
[2024-03-15T14:47:55.029Z] 	at org.gradle.internal.dispatch.ExceptionTrackingFailureHandler.dispatchFailed(ExceptionTrackingFailureHandler.java:35)
[2024-03-15T14:47:55.029Z] 	at org.gradle.internal.dispatch.FailureHandlingDispatch.dispatch(FailureHandlingDispatch.java:32)
[2024-03-15T14:47:55.029Z] 	at org.gradle.internal.dispatch.AsyncDispatch.dispatchMessages(AsyncDispatch.java:87)
[2024-03-15T14:47:55.029Z] 	at org.gradle.internal.dispatch.AsyncDispatch.access$000(AsyncDispatch.java:36)
[2024-03-15T14:47:55.029Z] 	at org.gradle.internal.dispatch.AsyncDispatch$1.run(AsyncDispatch.java:71)
[2024-03-15T14:47:55.029Z] 	at org.gradle.internal.concurrent.InterruptibleRunnable.run(InterruptibleRunnable.java:42)
[2024-03-15T14:47:55.029Z] 	at org.gradle.internal.operations.CurrentBuildOperationRef.with(CurrentBuildOperationRef.java:80)
[2024-03-15T14:47:55.029Z] 	at org.gradle.internal.operations.CurrentBuildOperationPreservingRunnable.run(CurrentBuildOperationPreservingRunnable.java:51)
[2024-03-15T14:47:55.029Z] 	at org.gradle.internal.concurrent.ExecutorPolicy$CatchAndRecordFailures.onExecute(ExecutorPolicy.java:64)
[2024-03-15T14:47:55.029Z] 	at org.gradle.internal.concurrent.AbstractManagedExecutor$1.run(AbstractManagedExecutor.java:47)
[2024-03-15T14:47:55.029Z] 	at java.base/java.util.concurrent.ThreadPoolExecutor.runWorker(ThreadPoolExecutor.java:1128)
[2024-03-15T14:47:55.029Z] 	at java.base/java.util.concurrent.ThreadPoolExecutor$Worker.run(ThreadPoolExecutor.java:628)
[2024-03-15T14:47:55.029Z] 	at java.base/java.lang.Thread.run(Thread.java:829)
[2024-03-15T14:47:55.029Z] Caused by: org.gradle.process.internal.ExecException: Process 'Gradle Test Executor 42' finished with non-zero exit value 143
[2024-03-15T14:47:55.029Z] This problem might be caused by incorrect test process configuration.
[2024-03-15T14:47:55.029Z] For more on test execution, please refer to https://docs.gradle.org/8.6/userguide/java_testing.html#sec:test_execution in the Gradle documentation.
[2024-03-15T14:47:55.029Z] 	at org.gradle.api.internal.tasks.testing.worker.ForkingTestClassProcessor.stop(ForkingTestClassProcessor.java:159)
[2024-03-15T14:47:55.029Z] 	at org.gradle.api.internal.tasks.testing.processors.RestartEveryNTestClassProcessor.endBatch(RestartEveryNTestClassProcessor.java:77)
[2024-03-15T14:47:55.029Z] 	at org.gradle.api.internal.tasks.testing.processors.RestartEveryNTestClassProcessor.stop(RestartEveryNTestClassProcessor.java:62)
[2024-03-15T14:47:55.029Z] 	at jdk.internal.reflect.GeneratedMethodAccessor563.invoke(Unknown Source)
[2024-03-15T14:47:55.029Z] 	at java.base/jdk.internal.reflect.DelegatingMethodAccessorImpl.invoke(DelegatingMethodAccessorImpl.java:43)
[2024-03-15T14:47:55.029Z] 	at java.base/java.lang.reflect.Method.invoke(Method.java:566)
[2024-03-15T14:47:55.029Z] 	at org.gradle.internal.dispatch.ReflectionDispatch.dispatch(ReflectionDispatch.java:36)
[2024-03-15T14:47:55.029Z] 	at org.gradle.internal.dispatch.ReflectionDispatch.dispatch(ReflectionDispatch.java:24)
[2024-03-15T14:47:55.029Z] 	at org.gradle.internal.dispatch.FailureHandlingDispatch.dispatch(FailureHandlingDispatch.java:30)
[2024-03-15T14:47:55.029Z] 	... 11 more
[2024-03-15T14:47:55.029Z] 
[2024-03-15T14:47:55.029Z] Gradle Test Run :connect:mirror:test > Gradle Test Executor 41 > MirrorConnectorsWithCustomForwardingAdminIntegrationTest > testOffsetTranslationBehindReplicationFlow() SKIPPED
[2024-03-15T14:47:55.029Z] 
[2024-03-15T14:47:55.029Z] Gradle Test Run :connect:mirror:test > Gradle Test Executor 42 > IdentityReplicationIntegrationTest > testOneWayReplicationWithAutoOffsetSync() SKIPPED
[2024-03-15T14:47:55.029Z] 
[2024-03-15T14:47:55.029Z] FAILURE: Build completed with 2 failures.
[2024-03-15T14:47:55.029Z] 
[2024-03-15T14:47:55.029Z] 1: Task failed with an exception.
[2024-03-15T14:47:55.029Z] -----------
[2024-03-15T14:47:55.029Z] * What went wrong:
[2024-03-15T14:47:55.029Z] Execution failed for task ':streams:test'.
[2024-03-15T14:47:55.029Z] > Process 'Gradle Test Executor 27' finished with non-zero exit value 137
[2024-03-15T14:47:55.029Z]   This problem might be caused by incorrect test process configuration.
[2024-03-15T14:47:55.029Z]   For more on test execution, please refer to https://docs.gradle.org/8.6/userguide/java_testing.html#sec:test_execution in the Gradle documentation.
[2024-03-15T14:47:55.029Z] 
[2024-03-15T14:47:55.029Z] * Try:
[2024-03-15T14:47:55.029Z] > Run with --stacktrace option to get the stack trace.
[2024-03-15T14:47:55.029Z] > Run with --info or --debug option to get more log output.
[2024-03-15T14:47:55.029Z] > Get more help at https://help.gradle.org.
[2024-03-15T14:47:55.029Z] ==============================================================================
[2024-03-15T14:47:55.029Z] 
[2024-03-15T14:47:55.029Z] 2: Task failed with an exception.
[2024-03-15T14:47:55.029Z] -----------
[2024-03-15T14:47:55.029Z] * What went wrong:
[2024-03-15T14:47:55.029Z] Execution failed for task ':connect:mirror:test'.
[2024-03-15T14:47:55.029Z] > Process 'Gradle Test Executor 41' finished with non-zero exit value 137
[2024-03-15T14:47:55.029Z]   This problem might be caused by incorrect test process configuration.
[2024-03-15T14:47:55.029Z]   For more on test execution, please refer to https://docs.gradle.org/8.6/userguide/java_testing.html#sec:test_execution in the Gradle documentation.
[2024-03-15T14:47:55.029Z] 
[2024-03-15T14:47:55.029Z] * Try:
[2024-03-15T14:47:55.029Z] > Run with --stacktrace option to get the stack trace.
[2024-03-15T14:47:55.029Z] > Run with --info or --debug option to get more log output.
[2024-03-15T14:47:55.029Z] > Get more help at https://help.gradle.org.
[2024-03-15T14:47:55.029Z] ==============================================================================
[2024-03-15T14:47:55.029Z] 
[2024-03-15T14:47:55.029Z] Deprecated Gradle features were used in this build, making it incompatible with Gradle 9.0.
[2024-03-15T14:47:55.029Z] 
[2024-03-15T14:47:55.029Z] You can use '--warning-mode all' to show the individual deprecation warnings and determine if they come from your own scripts or plugins.
[2024-03-15T14:47:55.029Z] 
[2024-03-15T14:47:55.029Z] For more on this, please refer to https://docs.gradle.org/8.6/userguide/command_line_interface.html#sec:command_line_warnings in the Gradle documentation.
[2024-03-15T14:47:55.029Z] 
[2024-03-15T14:47:55.029Z] BUILD FAILED in 7h 35m 2s
[2024-03-15T14:47:55.029Z] 314 actionable tasks: 116 executed, 198 up-to-date
[2024-03-15T14:47:55.029Z] 
[2024-03-15T14:47:55.029Z] Publishing build scan...
[2024-03-15T14:47:55.029Z] The message received from the daemon indicates that the daemon has disappeared.
[2024-03-15T14:47:55.029Z] Build request sent: Build{id=f5e5de1f-07ce-419d-83eb-4da33cecec5e, currentDir=/home/jenkins/jenkins-agent/712657a4/workspace/Kafka_kafka_3.7}
[2024-03-15T14:47:55.029Z] Attempting to read last messages from the daemon log...
[2024-03-15T14:47:55.029Z] Daemon pid: 4094669
[2024-03-15T14:47:55.029Z]   log file: /home/jenkins/.gradle/daemon/8.6/daemon-4094669.out.log
[2024-03-15T14:47:55.029Z] ----- Last  20 lines from daemon log file - daemon-4094669.out.log -----
[2024-03-15T14:47:55.029Z]   This problem might be caused by incorrect test process configuration.
[2024-03-15T14:47:55.029Z]   For more on test execution, please refer to https://docs.gradle.org/8.6/userguide/java_testing.html#sec:test_execution in the Gradle documentation.
[2024-03-15T14:47:55.029Z] 
[2024-03-15T14:47:55.029Z] * Try:
[2024-03-15T14:47:55.029Z] > Run with --stacktrace option to get the stack trace.
[2024-03-15T14:47:55.029Z] > Run with --info or --debug option to get more log output.
[2024-03-15T14:47:55.029Z] > Get more help at https://help.gradle.org.
[2024-03-15T14:47:55.029Z] ==============================================================================
[2024-03-15T14:47:55.029Z] 
[2024-03-15T14:47:55.029Z] Deprecated Gradle features were used in this build, making it incompatible with Gradle 9.0.
[2024-03-15T14:47:55.029Z] 
[2024-03-15T14:47:55.029Z] You can use '--warning-mode all' to show the individual deprecation warnings and determine if they come from your own scripts or plugins.
[2024-03-15T14:47:55.029Z] 
[2024-03-15T14:47:55.029Z] For more on this, please refer to https://docs.gradle.org/8.6/userguide/command_line_interface.html#sec:command_line_warnings in the Gradle documentation.
[2024-03-15T14:47:55.029Z] 
[2024-03-15T14:47:55.029Z] BUILD FAILED in 7h 35m 2s
[2024-03-15T14:47:55.029Z] 314 actionable tasks: 116 executed, 198 up-to-date
[2024-03-15T14:47:55.029Z] 
[2024-03-15T14:47:55.029Z] Publishing build scan...
[2024-03-15T14:47:55.029Z] Daemon vm is shutting down... The daemon has exited normally or was terminated in response to a user interrupt.
[2024-03-15T14:47:55.029Z] ----- End of the daemon log -----
[2024-03-15T14:47:55.029Z] 
[2024-03-15T14:47:55.029Z] 
[2024-03-15T14:47:55.029Z] FAILURE: Build failed with an exception.
[2024-03-15T14:47:55.029Z] 
[2024-03-15T14:47:55.029Z] * What went wrong:
[2024-03-15T14:47:55.029Z] Gradle build daemon disappeared unexpectedly (it may have been killed or may have crashed)
[2024-03-15T14:47:55.029Z] 
[2024-03-15T14:47:55.029Z] * Try:
[2024-03-15T14:47:55.029Z] > Run with --stacktrace option to get the stack trace.
[2024-03-15T14:47:55.029Z] > Run with --info or --debug option to get more log output.
[2024-03-15T14:47:55.029Z] > Run with --scan to get full insights.
[2024-03-15T14:47:55.029Z] > Get more help at https://help.gradle.org.
[2024-03-15T14:47:55.498Z] script returned exit code 1
[Pipeline] }
[Pipeline] // withEnv
[Pipeline] }
[Pipeline] // withEnv
[Pipeline] }
[Pipeline] // withEnv
[Pipeline] }
[Pipeline] // node
[Pipeline] }
[Pipeline] // timestamps
[Pipeline] }
[Pipeline] // timeout
[Pipeline] }
[Pipeline] // stage
[Pipeline] }
Failed in branch JDK 11 and Scala 2.13
[Pipeline] // parallel
[Pipeline] }
[Pipeline] // stage
[Pipeline] stage
[Pipeline] { (Declarative: Post Actions)
[Pipeline] script
[Pipeline] {
[Pipeline] node
Running on builds49 in /home/jenkins/jenkins-agent/workspace/Kafka_kafka_3.7
[Pipeline] {
[Pipeline] step

Jenkins build is still unstable: Kafka » Kafka Branch Builder » 3.7 #110

Posted by Apache Jenkins Server <je...@builds.apache.org>.
See <https://ci-builds.apache.org/job/Kafka/job/kafka/job/3.7/110/display/redirect>


Jenkins build is unstable: Kafka » Kafka Branch Builder » 3.7 #109

Posted by Apache Jenkins Server <je...@builds.apache.org>.
See <https://ci-builds.apache.org/job/Kafka/job/kafka/job/3.7/109/display/redirect>


Build failed in Jenkins: Kafka » Kafka Branch Builder » 3.7 #108

Posted by Apache Jenkins Server <je...@builds.apache.org>.
See <https://ci-builds.apache.org/job/Kafka/job/kafka/job/3.7/108/display/redirect>

Changes:


------------------------------------------
[...truncated 457202 lines...]
[2024-03-11T21:23:32.885Z] > Task :group-coordinator:testClasses
[2024-03-11T21:23:33.983Z] > Task :core:compileScala
[2024-03-11T21:23:33.983Z] 
[2024-03-11T21:23:33.983Z] > Task :clients:javadoc
[2024-03-11T21:23:33.983Z] /home/jenkins/jenkins-agent/workspace/Kafka_kafka_3.7/clients/src/main/java/org/apache/kafka/common/security/oauthbearer/secured/package-info.java:21: warning - Tag @link: reference not found: org.apache.kafka.common.security.oauthbearer
[2024-03-11T21:23:33.983Z] 2 warnings
[2024-03-11T21:23:33.983Z] 
[2024-03-11T21:23:33.983Z] > Task :clients:javadocJar
[2024-03-11T21:23:35.248Z] > Task :streams:generateMetadataFileForMavenJavaPublication
[2024-03-11T21:23:35.248Z] > Task :metadata:compileTestJava
[2024-03-11T21:23:35.248Z] > Task :metadata:testClasses
[2024-03-11T21:23:35.248Z] > Task :clients:srcJar
[2024-03-11T21:23:35.248Z] > Task :clients:testJar
[2024-03-11T21:23:36.347Z] > Task :clients:testSrcJar
[2024-03-11T21:23:36.347Z] > Task :clients:publishMavenJavaPublicationToMavenLocal
[2024-03-11T21:23:36.347Z] > Task :clients:publishToMavenLocal
[2024-03-11T21:23:36.347Z] > Task :connect:api:generateMetadataFileForMavenJavaPublication
[2024-03-11T21:23:36.347Z] > Task :connect:api:compileTestJava UP-TO-DATE
[2024-03-11T21:23:36.347Z] > Task :connect:api:testClasses UP-TO-DATE
[2024-03-11T21:23:36.347Z] > Task :connect:api:testJar
[2024-03-11T21:23:36.347Z] > Task :connect:api:testSrcJar
[2024-03-11T21:23:36.347Z] > Task :connect:api:publishMavenJavaPublicationToMavenLocal
[2024-03-11T21:23:36.347Z] > Task :connect:api:publishToMavenLocal
[2024-03-11T21:23:41.773Z] > Task :streams:javadoc
[2024-03-11T21:23:41.773Z] > Task :streams:javadocJar
[2024-03-11T21:23:41.773Z] > Task :streams:srcJar
[2024-03-11T21:23:41.773Z] > Task :streams:processTestResources UP-TO-DATE
[2024-03-11T21:24:26.447Z] > Task :core:classes
[2024-03-11T21:24:26.447Z] > Task :core:compileTestJava NO-SOURCE
[2024-03-11T21:24:54.773Z] > Task :core:compileTestScala
[2024-03-11T21:25:46.921Z] > Task :core:testClasses
[2024-03-11T21:26:11.527Z] > Task :streams:compileTestJava
[2024-03-11T21:26:30.561Z] [Checks API] No suitable checks publisher found.
[Pipeline] echo
[2024-03-11T21:26:30.563Z] Skipping Kafka Streams archetype test for Java 17
[Pipeline] }
[Pipeline] // withEnv
[Pipeline] }
[Pipeline] // withEnv
[Pipeline] }
[Pipeline] // withEnv
[Pipeline] }
[Pipeline] // node
[Pipeline] }
[Pipeline] // timestamps
[Pipeline] }
[Pipeline] // timeout
[Pipeline] }
[Pipeline] // stage
[Pipeline] }
[2024-03-11T21:27:34.626Z] > Task :streams:testClasses
[2024-03-11T21:27:34.626Z] > Task :streams:testJar
[2024-03-11T21:27:34.626Z] > Task :streams:testSrcJar
[2024-03-11T21:27:34.626Z] > Task :streams:publishMavenJavaPublicationToMavenLocal
[2024-03-11T21:27:34.626Z] > Task :streams:publishToMavenLocal
[2024-03-11T21:27:34.626Z] 
[2024-03-11T21:27:34.626Z] Deprecated Gradle features were used in this build, making it incompatible with Gradle 9.0.
[2024-03-11T21:27:34.626Z] 
[2024-03-11T21:27:34.626Z] You can use '--warning-mode all' to show the individual deprecation warnings and determine if they come from your own scripts or plugins.
[2024-03-11T21:27:34.626Z] 
[2024-03-11T21:27:34.626Z] For more on this, please refer to https://docs.gradle.org/8.6/userguide/command_line_interface.html#sec:command_line_warnings in the Gradle documentation.
[2024-03-11T21:27:34.626Z] 
[2024-03-11T21:27:34.626Z] BUILD SUCCESSFUL in 4m 43s
[2024-03-11T21:27:34.626Z] 95 actionable tasks: 41 executed, 54 up-to-date
[2024-03-11T21:27:34.626Z] 
[2024-03-11T21:27:34.626Z] Publishing build scan...
[2024-03-11T21:27:34.626Z] https://ge.apache.org/s/dv5olsxhbcpr6
[2024-03-11T21:27:34.626Z] 
[Pipeline] sh
[2024-03-11T21:27:37.601Z] + grep ^version= gradle.properties
[2024-03-11T21:27:37.601Z] + cut -d= -f 2
[Pipeline] dir
[2024-03-11T21:27:38.452Z] Running in /home/jenkins/jenkins-agent/workspace/Kafka_kafka_3.7/streams/quickstart
[Pipeline] {
[Pipeline] sh
[2024-03-11T21:27:40.576Z] + mvn clean install -Dgpg.skip
[2024-03-11T21:27:41.674Z] [INFO] Scanning for projects...
[2024-03-11T21:27:42.773Z] [INFO] ------------------------------------------------------------------------
[2024-03-11T21:27:42.773Z] [INFO] Reactor Build Order:
[2024-03-11T21:27:42.773Z] [INFO] 
[2024-03-11T21:27:42.773Z] [INFO] Kafka Streams :: Quickstart                                        [pom]
[2024-03-11T21:27:42.773Z] [INFO] streams-quickstart-java                                [maven-archetype]
[2024-03-11T21:27:42.773Z] [INFO] 
[2024-03-11T21:27:42.773Z] [INFO] ----------------< org.apache.kafka:streams-quickstart >-----------------
[2024-03-11T21:27:42.773Z] [INFO] Building Kafka Streams :: Quickstart 3.7.1-SNAPSHOT                [1/2]
[2024-03-11T21:27:42.773Z] [INFO]   from pom.xml
[2024-03-11T21:27:42.773Z] [INFO] --------------------------------[ pom ]---------------------------------
[2024-03-11T21:27:42.773Z] [INFO] 
[2024-03-11T21:27:42.773Z] [INFO] --- clean:3.0.0:clean (default-clean) @ streams-quickstart ---
[2024-03-11T21:27:42.773Z] [INFO] 
[2024-03-11T21:27:42.773Z] [INFO] --- remote-resources:1.5:process (process-resource-bundles) @ streams-quickstart ---
[2024-03-11T21:27:43.871Z] [INFO] 
[2024-03-11T21:27:43.871Z] [INFO] --- site:3.5.1:attach-descriptor (attach-descriptor) @ streams-quickstart ---
[2024-03-11T21:27:43.871Z] [INFO] 
[2024-03-11T21:27:43.871Z] [INFO] --- gpg:1.6:sign (sign-artifacts) @ streams-quickstart ---
[2024-03-11T21:27:43.871Z] [INFO] 
[2024-03-11T21:27:43.871Z] [INFO] --- install:2.5.2:install (default-install) @ streams-quickstart ---
[2024-03-11T21:27:43.871Z] [INFO] Installing /home/jenkins/jenkins-agent/workspace/Kafka_kafka_3.7/streams/quickstart/pom.xml to /home/jenkins/.m2/repository/org/apache/kafka/streams-quickstart/3.7.1-SNAPSHOT/streams-quickstart-3.7.1-SNAPSHOT.pom
[2024-03-11T21:27:43.871Z] [INFO] 
[2024-03-11T21:27:43.871Z] [INFO] --------------< org.apache.kafka:streams-quickstart-java >--------------
[2024-03-11T21:27:43.871Z] [INFO] Building streams-quickstart-java 3.7.1-SNAPSHOT                    [2/2]
[2024-03-11T21:27:43.871Z] [INFO]   from java/pom.xml
[2024-03-11T21:27:43.871Z] [INFO] --------------------------[ maven-archetype ]---------------------------
[2024-03-11T21:27:43.871Z] [INFO] 
[2024-03-11T21:27:43.871Z] [INFO] --- clean:3.0.0:clean (default-clean) @ streams-quickstart-java ---
[2024-03-11T21:27:43.871Z] [INFO] 
[2024-03-11T21:27:43.871Z] [INFO] --- remote-resources:1.5:process (process-resource-bundles) @ streams-quickstart-java ---
[2024-03-11T21:27:43.871Z] [INFO] 
[2024-03-11T21:27:43.871Z] [INFO] --- resources:2.7:resources (default-resources) @ streams-quickstart-java ---
[2024-03-11T21:27:44.970Z] [INFO] Using 'UTF-8' encoding to copy filtered resources.
[2024-03-11T21:27:44.970Z] [INFO] Copying 6 resources
[2024-03-11T21:27:44.970Z] [INFO] Copying 3 resources
[2024-03-11T21:27:44.970Z] [INFO] 
[2024-03-11T21:27:44.970Z] [INFO] --- resources:2.7:testResources (default-testResources) @ streams-quickstart-java ---
[2024-03-11T21:27:44.970Z] [INFO] Using 'UTF-8' encoding to copy filtered resources.
[2024-03-11T21:27:44.970Z] [INFO] Copying 2 resources
[2024-03-11T21:27:44.970Z] [INFO] Copying 3 resources
[2024-03-11T21:27:44.970Z] [INFO] 
[2024-03-11T21:27:44.970Z] [INFO] --- archetype:2.2:jar (default-jar) @ streams-quickstart-java ---
[2024-03-11T21:27:44.970Z] [INFO] Building archetype jar: /home/jenkins/jenkins-agent/workspace/Kafka_kafka_3.7/streams/quickstart/java/target/streams-quickstart-java-3.7.1-SNAPSHOT
[2024-03-11T21:27:44.970Z] [INFO] 
[2024-03-11T21:27:44.970Z] [INFO] --- site:3.5.1:attach-descriptor (attach-descriptor) @ streams-quickstart-java ---
[2024-03-11T21:27:44.970Z] [INFO] 
[2024-03-11T21:27:44.970Z] [INFO] --- archetype:2.2:integration-test (default-integration-test) @ streams-quickstart-java ---
[2024-03-11T21:27:44.970Z] [WARNING]  Parameter 'skip' (user property 'archetype.test.skip') is read-only, must not be used in configuration
[2024-03-11T21:27:44.970Z] [INFO] 
[2024-03-11T21:27:44.970Z] [INFO] --- gpg:1.6:sign (sign-artifacts) @ streams-quickstart-java ---
[2024-03-11T21:27:44.970Z] [INFO] 
[2024-03-11T21:27:44.970Z] [INFO] --- install:2.5.2:install (default-install) @ streams-quickstart-java ---
[2024-03-11T21:27:44.970Z] [INFO] Installing /home/jenkins/jenkins-agent/workspace/Kafka_kafka_3.7/streams/quickstart/java/target/streams-quickstart-java-3.7.1-SNAPSHOT.jar to /home/jenkins/.m2/repository/org/apache/kafka/streams-quickstart-java/3.7.1-SNAPSHOT/streams-quickstart-java-3.7.1-SNAPSHOT.jar
[2024-03-11T21:27:44.970Z] [INFO] Installing /home/jenkins/jenkins-agent/workspace/Kafka_kafka_3.7/streams/quickstart/java/pom.xml to /home/jenkins/.m2/repository/org/apache/kafka/streams-quickstart-java/3.7.1-SNAPSHOT/streams-quickstart-java-3.7.1-SNAPSHOT.pom
[2024-03-11T21:27:44.970Z] [INFO] 
[2024-03-11T21:27:44.970Z] [INFO] --- archetype:2.2:update-local-catalog (default-update-local-catalog) @ streams-quickstart-java ---
[2024-03-11T21:27:44.970Z] [INFO] ------------------------------------------------------------------------
[2024-03-11T21:27:44.970Z] [INFO] Reactor Summary for Kafka Streams :: Quickstart 3.7.1-SNAPSHOT:
[2024-03-11T21:27:44.970Z] [INFO] 
[2024-03-11T21:27:44.970Z] [INFO] Kafka Streams :: Quickstart ........................ SUCCESS [  1.841 s]
[2024-03-11T21:27:44.970Z] [INFO] streams-quickstart-java ............................ SUCCESS [  0.544 s]
[2024-03-11T21:27:44.970Z] [INFO] ------------------------------------------------------------------------
[2024-03-11T21:27:44.970Z] [INFO] BUILD SUCCESS
[2024-03-11T21:27:44.970Z] [INFO] ------------------------------------------------------------------------
[2024-03-11T21:27:44.970Z] [INFO] Total time:  2.712 s
[2024-03-11T21:27:44.970Z] [INFO] Finished at: 2024-03-11T21:27:44Z
[2024-03-11T21:27:44.970Z] [INFO] ------------------------------------------------------------------------
[Pipeline] dir
[2024-03-11T21:27:45.655Z] Running in /home/jenkins/jenkins-agent/workspace/Kafka_kafka_3.7/streams/quickstart/test-streams-archetype
[Pipeline] {
[Pipeline] sh
[2024-03-11T21:27:47.841Z] + echo Y
[2024-03-11T21:27:47.841Z] + mvn archetype:generate -DarchetypeCatalog=local -DarchetypeGroupId=org.apache.kafka -DarchetypeArtifactId=streams-quickstart-java -DarchetypeVersion=3.7.1-SNAPSHOT -DgroupId=streams.examples -DartifactId=streams.examples -Dversion=0.1 -Dpackage=myapps
[2024-03-11T21:27:48.966Z] [INFO] Scanning for projects...
[2024-03-11T21:27:50.092Z] [INFO] 
[2024-03-11T21:27:50.092Z] [INFO] ------------------< org.apache.maven:standalone-pom >-------------------
[2024-03-11T21:27:50.092Z] [INFO] Building Maven Stub Project (No POM) 1
[2024-03-11T21:27:50.092Z] [INFO] --------------------------------[ pom ]---------------------------------
[2024-03-11T21:27:50.092Z] [INFO] 
[2024-03-11T21:27:50.092Z] [INFO] >>> archetype:3.2.1:generate (default-cli) > generate-sources @ standalone-pom >>>
[2024-03-11T21:27:50.092Z] [INFO] 
[2024-03-11T21:27:50.092Z] [INFO] <<< archetype:3.2.1:generate (default-cli) < generate-sources @ standalone-pom <<<
[2024-03-11T21:27:50.092Z] [INFO] 
[2024-03-11T21:27:50.092Z] [INFO] 
[2024-03-11T21:27:50.092Z] [INFO] --- archetype:3.2.1:generate (default-cli) @ standalone-pom ---
[2024-03-11T21:27:51.218Z] [INFO] Generating project in Interactive mode
[2024-03-11T21:27:51.218Z] [WARNING] Archetype not found in any catalog. Falling back to central repository.
[2024-03-11T21:27:51.218Z] [WARNING] Add a repository with id 'archetype' in your settings.xml if archetype's repository is elsewhere.
[2024-03-11T21:27:51.218Z] [INFO] Using property: groupId = streams.examples
[2024-03-11T21:27:51.218Z] [INFO] Using property: artifactId = streams.examples
[2024-03-11T21:27:51.218Z] [INFO] Using property: version = 0.1
[2024-03-11T21:27:51.218Z] [INFO] Using property: package = myapps
[2024-03-11T21:27:51.218Z] Confirm properties configuration:
[2024-03-11T21:27:51.218Z] groupId: streams.examples
[2024-03-11T21:27:51.218Z] artifactId: streams.examples
[2024-03-11T21:27:51.218Z] version: 0.1
[2024-03-11T21:27:51.218Z] package: myapps
[2024-03-11T21:27:51.218Z]  Y: : [INFO] ----------------------------------------------------------------------------
[2024-03-11T21:27:51.218Z] [INFO] Using following parameters for creating project from Archetype: streams-quickstart-java:3.7.1-SNAPSHOT
[2024-03-11T21:27:51.218Z] [INFO] ----------------------------------------------------------------------------
[2024-03-11T21:27:51.218Z] [INFO] Parameter: groupId, Value: streams.examples
[2024-03-11T21:27:51.218Z] [INFO] Parameter: artifactId, Value: streams.examples
[2024-03-11T21:27:51.218Z] [INFO] Parameter: version, Value: 0.1
[2024-03-11T21:27:51.218Z] [INFO] Parameter: package, Value: myapps
[2024-03-11T21:27:51.218Z] [INFO] Parameter: packageInPathFormat, Value: myapps
[2024-03-11T21:27:51.218Z] [INFO] Parameter: package, Value: myapps
[2024-03-11T21:27:51.218Z] [INFO] Parameter: version, Value: 0.1
[2024-03-11T21:27:51.218Z] [INFO] Parameter: groupId, Value: streams.examples
[2024-03-11T21:27:51.218Z] [INFO] Parameter: artifactId, Value: streams.examples
[2024-03-11T21:27:51.218Z] [INFO] Project created from Archetype in dir: /home/jenkins/jenkins-agent/workspace/Kafka_kafka_3.7/streams/quickstart/test-streams-archetype/streams.examples
[2024-03-11T21:27:51.218Z] [INFO] ------------------------------------------------------------------------
[2024-03-11T21:27:51.218Z] [INFO] BUILD SUCCESS
[2024-03-11T21:27:51.218Z] [INFO] ------------------------------------------------------------------------
[2024-03-11T21:27:51.218Z] [INFO] Total time:  1.621 s
[2024-03-11T21:27:51.218Z] [INFO] Finished at: 2024-03-11T21:27:50Z
[2024-03-11T21:27:51.218Z] [INFO] ------------------------------------------------------------------------
[Pipeline] dir
[2024-03-11T21:27:52.092Z] Running in /home/jenkins/jenkins-agent/workspace/Kafka_kafka_3.7/streams/quickstart/test-streams-archetype/streams.examples
[Pipeline] {
[Pipeline] sh
[2024-03-11T21:27:54.278Z] + mvn compile
[2024-03-11T21:27:55.403Z] [INFO] Scanning for projects...
[2024-03-11T21:27:56.610Z] [INFO] 
[2024-03-11T21:27:56.610Z] [INFO] -----------------< streams.examples:streams.examples >------------------
[2024-03-11T21:27:56.610Z] [INFO] Building Kafka Streams Quickstart :: Java 0.1
[2024-03-11T21:27:56.610Z] [INFO]   from pom.xml
[2024-03-11T21:27:56.610Z] [INFO] --------------------------------[ jar ]---------------------------------
[2024-03-11T21:27:56.610Z] [INFO] 
[2024-03-11T21:27:56.610Z] [INFO] --- resources:3.3.1:resources (default-resources) @ streams.examples ---
[2024-03-11T21:27:56.610Z] [INFO] Copying 1 resource from src/main/resources to target/classes
[2024-03-11T21:27:56.610Z] [INFO] 
[2024-03-11T21:27:56.610Z] [INFO] --- compiler:3.1:compile (default-compile) @ streams.examples ---
[2024-03-11T21:27:56.610Z] [INFO] Changes detected - recompiling the module!
[2024-03-11T21:27:56.610Z] [INFO] Compiling 3 source files to /home/jenkins/jenkins-agent/workspace/Kafka_kafka_3.7/streams/quickstart/test-streams-archetype/streams.examples/target/classes
[2024-03-11T21:27:57.735Z] [INFO] ------------------------------------------------------------------------
[2024-03-11T21:27:57.735Z] [INFO] BUILD SUCCESS
[2024-03-11T21:27:57.735Z] [INFO] ------------------------------------------------------------------------
[2024-03-11T21:27:57.735Z] [INFO] Total time:  2.026 s
[2024-03-11T21:27:57.735Z] [INFO] Finished at: 2024-03-11T21:27:57Z
[2024-03-11T21:27:57.735Z] [INFO] ------------------------------------------------------------------------
[Pipeline] }
[Pipeline] // dir
[Pipeline] }
[Pipeline] // dir
[Pipeline] }
[Pipeline] // dir
[Pipeline] }
[Pipeline] // withEnv
[Pipeline] }
[Pipeline] // withEnv
[Pipeline] }
[Pipeline] // withEnv
[Pipeline] }
[Pipeline] // node
[Pipeline] }
[Pipeline] // timestamps
[Pipeline] }
[Pipeline] // timeout
[Pipeline] }
[Pipeline] // stage
[Pipeline] }
[Pipeline] // parallel
[Pipeline] }
[Pipeline] // stage
[Pipeline] stage
[Pipeline] { (Declarative: Post Actions)
[Pipeline] script
[Pipeline] {
[Pipeline] node
Running on builds22 in /home/jenkins/jenkins-agent/workspace/Kafka_kafka_3.7
[Pipeline] {
[Pipeline] step