You are viewing a plain text version of this content. The canonical link for it is here.
Posted to dev@kafka.apache.org by Apache Jenkins Server <je...@builds.apache.org> on 2020/06/02 05:55:35 UTC
Build failed in Jenkins: kafka-trunk-jdk14 #156
See <https://builds.apache.org/job/kafka-trunk-jdk14/156/display/redirect>
Changes:
------------------------------------------
Started by an SCM change
Running as SYSTEM
[EnvInject] - Loading node environment variables.
Building remotely on H23 (ubuntu) in workspace <https://builds.apache.org/job/kafka-trunk-jdk14/ws/>
[WS-CLEANUP] Deleting project workspace...
[WS-CLEANUP] Deferred wipeout is used...
[WS-CLEANUP] Done
No credentials specified
Cloning the remote Git repository
Cloning repository https://github.com/apache/kafka.git
> git init <https://builds.apache.org/job/kafka-trunk-jdk14/ws/> # timeout=10
ERROR: Error cloning remote repo 'origin'
hudson.plugins.git.GitException: Could not init <https://builds.apache.org/job/kafka-trunk-jdk14/ws/>
at org.jenkinsci.plugins.gitclient.CliGitAPIImpl$5.execute(CliGitAPIImpl.java:916)
at org.jenkinsci.plugins.gitclient.CliGitAPIImpl$2.execute(CliGitAPIImpl.java:708)
at org.jenkinsci.plugins.gitclient.RemoteGitImpl$CommandInvocationHandler$1.call(RemoteGitImpl.java:153)
at org.jenkinsci.plugins.gitclient.RemoteGitImpl$CommandInvocationHandler$1.call(RemoteGitImpl.java:146)
at hudson.remoting.UserRequest.perform(UserRequest.java:212)
at hudson.remoting.UserRequest.perform(UserRequest.java:54)
at hudson.remoting.Request$2.run(Request.java:369)
at hudson.remoting.InterceptingExecutorService$1.call(InterceptingExecutorService.java:72)
at java.util.concurrent.FutureTask.run(FutureTask.java:266)
at java.util.concurrent.ThreadPoolExecutor.runWorker(ThreadPoolExecutor.java:1149)
at java.util.concurrent.ThreadPoolExecutor$Worker.run(ThreadPoolExecutor.java:624)
at java.lang.Thread.run(Thread.java:748)
Suppressed: hudson.remoting.Channel$CallSiteStackTrace: Remote call to H23
at hudson.remoting.Channel.attachCallSiteStackTrace(Channel.java:1743)
at hudson.remoting.UserRequest$ExceptionResponse.retrieve(UserRequest.java:357)
at hudson.remoting.Channel.call(Channel.java:957)
at org.jenkinsci.plugins.gitclient.RemoteGitImpl$CommandInvocationHandler.execute(RemoteGitImpl.java:146)
at sun.reflect.GeneratedMethodAccessor1196.invoke(Unknown Source)
at sun.reflect.DelegatingMethodAccessorImpl.invoke(DelegatingMethodAccessorImpl.java:43)
at java.lang.reflect.Method.invoke(Method.java:498)
at org.jenkinsci.plugins.gitclient.RemoteGitImpl$CommandInvocationHandler.invoke(RemoteGitImpl.java:132)
at com.sun.proxy.$Proxy137.execute(Unknown Source)
at hudson.plugins.git.GitSCM.retrieveChanges(GitSCM.java:1152)
at hudson.plugins.git.GitSCM.checkout(GitSCM.java:1192)
at hudson.scm.SCM.checkout(SCM.java:504)
at hudson.model.AbstractProject.checkout(AbstractProject.java:1208)
at hudson.model.AbstractBuild$AbstractBuildExecution.defaultCheckout(AbstractBuild.java:574)
at jenkins.scm.SCMCheckoutStrategy.checkout(SCMCheckoutStrategy.java:86)
at hudson.model.AbstractBuild$AbstractBuildExecution.run(AbstractBuild.java:499)
at hudson.model.Run.execute(Run.java:1815)
at hudson.model.FreeStyleBuild.run(FreeStyleBuild.java:43)
at hudson.model.ResourceController.execute(ResourceController.java:97)
at hudson.model.Executor.run(Executor.java:429)
Caused by: hudson.plugins.git.GitException: Error performing git command
at org.jenkinsci.plugins.gitclient.CliGitAPIImpl.launchCommandIn(CliGitAPIImpl.java:2181)
at org.jenkinsci.plugins.gitclient.CliGitAPIImpl.launchCommandIn(CliGitAPIImpl.java:2140)
at org.jenkinsci.plugins.gitclient.CliGitAPIImpl.launchCommandIn(CliGitAPIImpl.java:2136)
at org.jenkinsci.plugins.gitclient.CliGitAPIImpl.launchCommand(CliGitAPIImpl.java:1741)
at org.jenkinsci.plugins.gitclient.CliGitAPIImpl$5.execute(CliGitAPIImpl.java:914)
... 11 more
Caused by: java.lang.OutOfMemoryError: unable to create new native thread
at java.lang.Thread.start0(Native Method)
at java.lang.Thread.start(Thread.java:717)
at hudson.Proc$LocalProc.<init>(Proc.java:282)
at hudson.Proc$LocalProc.<init>(Proc.java:219)
at hudson.Launcher$LocalLauncher.launch(Launcher.java:937)
at hudson.Launcher$ProcStarter.start(Launcher.java:455)
at org.jenkinsci.plugins.gitclient.CliGitAPIImpl.launchCommandIn(CliGitAPIImpl.java:2168)
... 15 more
ERROR: Error cloning remote repo 'origin'
Retrying after 10 seconds
No credentials specified
> git rev-parse --is-inside-work-tree # timeout=10
ERROR: Workspace has a .git repository, but it appears to be corrupt.
hudson.plugins.git.GitException: Error performing git command
at org.jenkinsci.plugins.gitclient.CliGitAPIImpl.launchCommandIn(CliGitAPIImpl.java:2181)
at org.jenkinsci.plugins.gitclient.CliGitAPIImpl.launchCommandIn(CliGitAPIImpl.java:2140)
at org.jenkinsci.plugins.gitclient.CliGitAPIImpl.launchCommandIn(CliGitAPIImpl.java:2136)
at org.jenkinsci.plugins.gitclient.CliGitAPIImpl.launchCommand(CliGitAPIImpl.java:1741)
at org.jenkinsci.plugins.gitclient.CliGitAPIImpl.launchCommand(CliGitAPIImpl.java:1753)
at org.jenkinsci.plugins.gitclient.CliGitAPIImpl.hasGitRepo(CliGitAPIImpl.java:329)
at hudson.plugins.git.GitAPI.hasGitRepo(GitAPI.java:232)
at sun.reflect.GeneratedMethodAccessor39.invoke(Unknown Source)
at sun.reflect.DelegatingMethodAccessorImpl.invoke(DelegatingMethodAccessorImpl.java:43)
at java.lang.reflect.Method.invoke(Method.java:498)
at hudson.remoting.RemoteInvocationHandler$RPCRequest.perform(RemoteInvocationHandler.java:929)
at hudson.remoting.RemoteInvocationHandler$RPCRequest.call(RemoteInvocationHandler.java:903)
at hudson.remoting.RemoteInvocationHandler$RPCRequest.call(RemoteInvocationHandler.java:855)
at hudson.remoting.UserRequest.perform(UserRequest.java:212)
at hudson.remoting.UserRequest.perform(UserRequest.java:54)
at hudson.remoting.Request$2.run(Request.java:369)
at hudson.remoting.InterceptingExecutorService$1.call(InterceptingExecutorService.java:72)
at java.util.concurrent.FutureTask.run(FutureTask.java:266)
at java.util.concurrent.ThreadPoolExecutor.runWorker(ThreadPoolExecutor.java:1149)
at java.util.concurrent.ThreadPoolExecutor$Worker.run(ThreadPoolExecutor.java:624)
at java.lang.Thread.run(Thread.java:748)
Caused by: java.lang.OutOfMemoryError: unable to create new native thread
at java.lang.Thread.start0(Native Method)
at java.lang.Thread.start(Thread.java:717)
at hudson.Proc$LocalProc.<init>(Proc.java:270)
at hudson.Proc$LocalProc.<init>(Proc.java:219)
at hudson.Launcher$LocalLauncher.launch(Launcher.java:937)
at hudson.Launcher$ProcStarter.start(Launcher.java:455)
at org.jenkinsci.plugins.gitclient.CliGitAPIImpl.launchCommandIn(CliGitAPIImpl.java:2168)
... 20 more
Cloning the remote Git repository
Cloning repository https://github.com/apache/kafka.git
> git init <https://builds.apache.org/job/kafka-trunk-jdk14/ws/> # timeout=10
ERROR: Error cloning remote repo 'origin'
hudson.plugins.git.GitException: Could not init <https://builds.apache.org/job/kafka-trunk-jdk14/ws/>
at org.jenkinsci.plugins.gitclient.CliGitAPIImpl$5.execute(CliGitAPIImpl.java:916)
at org.jenkinsci.plugins.gitclient.CliGitAPIImpl$2.execute(CliGitAPIImpl.java:708)
at org.jenkinsci.plugins.gitclient.RemoteGitImpl$CommandInvocationHandler$1.call(RemoteGitImpl.java:153)
at org.jenkinsci.plugins.gitclient.RemoteGitImpl$CommandInvocationHandler$1.call(RemoteGitImpl.java:146)
at hudson.remoting.UserRequest.perform(UserRequest.java:212)
at hudson.remoting.UserRequest.perform(UserRequest.java:54)
at hudson.remoting.Request$2.run(Request.java:369)
at hudson.remoting.InterceptingExecutorService$1.call(InterceptingExecutorService.java:72)
at java.util.concurrent.FutureTask.run(FutureTask.java:266)
at java.util.concurrent.ThreadPoolExecutor.runWorker(ThreadPoolExecutor.java:1149)
at java.util.concurrent.ThreadPoolExecutor$Worker.run(ThreadPoolExecutor.java:624)
at java.lang.Thread.run(Thread.java:748)
Suppressed: hudson.remoting.Channel$CallSiteStackTrace: Remote call to H23
at hudson.remoting.Channel.attachCallSiteStackTrace(Channel.java:1743)
at hudson.remoting.UserRequest$ExceptionResponse.retrieve(UserRequest.java:357)
at hudson.remoting.Channel.call(Channel.java:957)
at org.jenkinsci.plugins.gitclient.RemoteGitImpl$CommandInvocationHandler.execute(RemoteGitImpl.java:146)
at sun.reflect.GeneratedMethodAccessor1196.invoke(Unknown Source)
at sun.reflect.DelegatingMethodAccessorImpl.invoke(DelegatingMethodAccessorImpl.java:43)
at java.lang.reflect.Method.invoke(Method.java:498)
at org.jenkinsci.plugins.gitclient.RemoteGitImpl$CommandInvocationHandler.invoke(RemoteGitImpl.java:132)
at com.sun.proxy.$Proxy137.execute(Unknown Source)
at hudson.plugins.git.GitSCM.retrieveChanges(GitSCM.java:1152)
at hudson.plugins.git.GitSCM.checkout(GitSCM.java:1192)
at hudson.scm.SCM.checkout(SCM.java:504)
at hudson.model.AbstractProject.checkout(AbstractProject.java:1208)
at hudson.model.AbstractBuild$AbstractBuildExecution.defaultCheckout(AbstractBuild.java:574)
at jenkins.scm.SCMCheckoutStrategy.checkout(SCMCheckoutStrategy.java:86)
at hudson.model.AbstractBuild$AbstractBuildExecution.run(AbstractBuild.java:499)
at hudson.model.Run.execute(Run.java:1815)
at hudson.model.FreeStyleBuild.run(FreeStyleBuild.java:43)
at hudson.model.ResourceController.execute(ResourceController.java:97)
at hudson.model.Executor.run(Executor.java:429)
Caused by: hudson.plugins.git.GitException: Error performing git command
at org.jenkinsci.plugins.gitclient.CliGitAPIImpl.launchCommandIn(CliGitAPIImpl.java:2181)
at org.jenkinsci.plugins.gitclient.CliGitAPIImpl.launchCommandIn(CliGitAPIImpl.java:2140)
at org.jenkinsci.plugins.gitclient.CliGitAPIImpl.launchCommandIn(CliGitAPIImpl.java:2136)
at org.jenkinsci.plugins.gitclient.CliGitAPIImpl.launchCommand(CliGitAPIImpl.java:1741)
at org.jenkinsci.plugins.gitclient.CliGitAPIImpl$5.execute(CliGitAPIImpl.java:914)
... 11 more
Caused by: java.lang.OutOfMemoryError: unable to create new native thread
at java.lang.Thread.start0(Native Method)
at java.lang.Thread.start(Thread.java:717)
at hudson.Proc$LocalProc.<init>(Proc.java:270)
at hudson.Proc$LocalProc.<init>(Proc.java:219)
at hudson.Launcher$LocalLauncher.launch(Launcher.java:937)
at hudson.Launcher$ProcStarter.start(Launcher.java:455)
at org.jenkinsci.plugins.gitclient.CliGitAPIImpl.launchCommandIn(CliGitAPIImpl.java:2168)
... 15 more
ERROR: Error cloning remote repo 'origin'
Retrying after 10 seconds
No credentials specified
> git rev-parse --is-inside-work-tree # timeout=10
ERROR: Workspace has a .git repository, but it appears to be corrupt.
hudson.plugins.git.GitException: Error performing git command
at org.jenkinsci.plugins.gitclient.CliGitAPIImpl.launchCommandIn(CliGitAPIImpl.java:2181)
at org.jenkinsci.plugins.gitclient.CliGitAPIImpl.launchCommandIn(CliGitAPIImpl.java:2140)
at org.jenkinsci.plugins.gitclient.CliGitAPIImpl.launchCommandIn(CliGitAPIImpl.java:2136)
at org.jenkinsci.plugins.gitclient.CliGitAPIImpl.launchCommand(CliGitAPIImpl.java:1741)
at org.jenkinsci.plugins.gitclient.CliGitAPIImpl.launchCommand(CliGitAPIImpl.java:1753)
at org.jenkinsci.plugins.gitclient.CliGitAPIImpl.hasGitRepo(CliGitAPIImpl.java:329)
at hudson.plugins.git.GitAPI.hasGitRepo(GitAPI.java:232)
at sun.reflect.GeneratedMethodAccessor39.invoke(Unknown Source)
at sun.reflect.DelegatingMethodAccessorImpl.invoke(DelegatingMethodAccessorImpl.java:43)
at java.lang.reflect.Method.invoke(Method.java:498)
at hudson.remoting.RemoteInvocationHandler$RPCRequest.perform(RemoteInvocationHandler.java:929)
at hudson.remoting.RemoteInvocationHandler$RPCRequest.call(RemoteInvocationHandler.java:903)
at hudson.remoting.RemoteInvocationHandler$RPCRequest.call(RemoteInvocationHandler.java:855)
at hudson.remoting.UserRequest.perform(UserRequest.java:212)
at hudson.remoting.UserRequest.perform(UserRequest.java:54)
at hudson.remoting.Request$2.run(Request.java:369)
at hudson.remoting.InterceptingExecutorService$1.call(InterceptingExecutorService.java:72)
at java.util.concurrent.FutureTask.run(FutureTask.java:266)
at java.util.concurrent.ThreadPoolExecutor.runWorker(ThreadPoolExecutor.java:1149)
at java.util.concurrent.ThreadPoolExecutor$Worker.run(ThreadPoolExecutor.java:624)
at java.lang.Thread.run(Thread.java:748)
Caused by: java.lang.OutOfMemoryError: unable to create new native thread
at java.lang.Thread.start0(Native Method)
at java.lang.Thread.start(Thread.java:717)
at hudson.Proc$LocalProc.<init>(Proc.java:270)
at hudson.Proc$LocalProc.<init>(Proc.java:219)
at hudson.Launcher$LocalLauncher.launch(Launcher.java:937)
at hudson.Launcher$ProcStarter.start(Launcher.java:455)
at org.jenkinsci.plugins.gitclient.CliGitAPIImpl.launchCommandIn(CliGitAPIImpl.java:2168)
... 20 more
Cloning the remote Git repository
Cloning repository https://github.com/apache/kafka.git
> git init <https://builds.apache.org/job/kafka-trunk-jdk14/ws/> # timeout=10
ERROR: Error cloning remote repo 'origin'
hudson.plugins.git.GitException: Could not init <https://builds.apache.org/job/kafka-trunk-jdk14/ws/>
at org.jenkinsci.plugins.gitclient.CliGitAPIImpl$5.execute(CliGitAPIImpl.java:916)
at org.jenkinsci.plugins.gitclient.CliGitAPIImpl$2.execute(CliGitAPIImpl.java:708)
at org.jenkinsci.plugins.gitclient.RemoteGitImpl$CommandInvocationHandler$1.call(RemoteGitImpl.java:153)
at org.jenkinsci.plugins.gitclient.RemoteGitImpl$CommandInvocationHandler$1.call(RemoteGitImpl.java:146)
at hudson.remoting.UserRequest.perform(UserRequest.java:212)
at hudson.remoting.UserRequest.perform(UserRequest.java:54)
at hudson.remoting.Request$2.run(Request.java:369)
at hudson.remoting.InterceptingExecutorService$1.call(InterceptingExecutorService.java:72)
at java.util.concurrent.FutureTask.run(FutureTask.java:266)
at java.util.concurrent.ThreadPoolExecutor.runWorker(ThreadPoolExecutor.java:1149)
at java.util.concurrent.ThreadPoolExecutor$Worker.run(ThreadPoolExecutor.java:624)
at java.lang.Thread.run(Thread.java:748)
Suppressed: hudson.remoting.Channel$CallSiteStackTrace: Remote call to H23
at hudson.remoting.Channel.attachCallSiteStackTrace(Channel.java:1743)
at hudson.remoting.UserRequest$ExceptionResponse.retrieve(UserRequest.java:357)
at hudson.remoting.Channel.call(Channel.java:957)
at org.jenkinsci.plugins.gitclient.RemoteGitImpl$CommandInvocationHandler.execute(RemoteGitImpl.java:146)
at sun.reflect.GeneratedMethodAccessor1196.invoke(Unknown Source)
at sun.reflect.DelegatingMethodAccessorImpl.invoke(DelegatingMethodAccessorImpl.java:43)
at java.lang.reflect.Method.invoke(Method.java:498)
at org.jenkinsci.plugins.gitclient.RemoteGitImpl$CommandInvocationHandler.invoke(RemoteGitImpl.java:132)
at com.sun.proxy.$Proxy137.execute(Unknown Source)
at hudson.plugins.git.GitSCM.retrieveChanges(GitSCM.java:1152)
at hudson.plugins.git.GitSCM.checkout(GitSCM.java:1192)
at hudson.scm.SCM.checkout(SCM.java:504)
at hudson.model.AbstractProject.checkout(AbstractProject.java:1208)
at hudson.model.AbstractBuild$AbstractBuildExecution.defaultCheckout(AbstractBuild.java:574)
at jenkins.scm.SCMCheckoutStrategy.checkout(SCMCheckoutStrategy.java:86)
at hudson.model.AbstractBuild$AbstractBuildExecution.run(AbstractBuild.java:499)
at hudson.model.Run.execute(Run.java:1815)
at hudson.model.FreeStyleBuild.run(FreeStyleBuild.java:43)
at hudson.model.ResourceController.execute(ResourceController.java:97)
at hudson.model.Executor.run(Executor.java:429)
Caused by: hudson.plugins.git.GitException: Error performing git command
at org.jenkinsci.plugins.gitclient.CliGitAPIImpl.launchCommandIn(CliGitAPIImpl.java:2181)
at org.jenkinsci.plugins.gitclient.CliGitAPIImpl.launchCommandIn(CliGitAPIImpl.java:2140)
at org.jenkinsci.plugins.gitclient.CliGitAPIImpl.launchCommandIn(CliGitAPIImpl.java:2136)
at org.jenkinsci.plugins.gitclient.CliGitAPIImpl.launchCommand(CliGitAPIImpl.java:1741)
at org.jenkinsci.plugins.gitclient.CliGitAPIImpl$5.execute(CliGitAPIImpl.java:914)
... 11 more
Caused by: java.lang.OutOfMemoryError: unable to create new native thread
at java.lang.Thread.start0(Native Method)
at java.lang.Thread.start(Thread.java:717)
at hudson.Proc$LocalProc.<init>(Proc.java:270)
at hudson.Proc$LocalProc.<init>(Proc.java:219)
at hudson.Launcher$LocalLauncher.launch(Launcher.java:937)
at hudson.Launcher$ProcStarter.start(Launcher.java:455)
at org.jenkinsci.plugins.gitclient.CliGitAPIImpl.launchCommandIn(CliGitAPIImpl.java:2168)
... 15 more
ERROR: Error cloning remote repo 'origin'
Recording test results
ERROR: Step ?Publish JUnit test result report? failed: No test report files were found. Configuration error?
Not sending mail to unregistered user noreply@github.com
Build failed in Jenkins: kafka-trunk-jdk14 #164
Posted by Apache Jenkins Server <je...@builds.apache.org>.
See <https://builds.apache.org/job/kafka-trunk-jdk14/164/display/redirect?page=changes>
Changes:
[github] KAFKA-10083: fix failed
------------------------------------------
[...truncated 2.63 MB...]
unit.kafka.cluster.AssignmentStateTest.testPartitionAssignmentStatus[7] failed, log available in /home/jenkins/jenkins-slave/workspace/kafka-trunk-jdk14/core/build/reports/testOutput/unit.kafka.cluster.AssignmentStateTest.testPartitionAssignmentStatus[7].test.stdout
unit.kafka.cluster.AssignmentStateTest > testPartitionAssignmentStatus[7] FAILED
[2007.091s][warning][os,thread] Failed to start thread - pthread_create failed (EAGAIN) for attributes: stacksize: 1024k, guardsize: 0k, detached.
java.lang.OutOfMemoryError: unable to create native thread: possibly out of memory or process/resource limits reached
at java.base/java.lang.Thread.start0(Native Method)
at java.base/java.lang.Thread.start(Thread.java:799)
at java.base/java.util.concurrent.ThreadPoolExecutor.addWorker(ThreadPoolExecutor.java:937)
at java.base/java.util.concurrent.ThreadPoolExecutor.execute(ThreadPoolExecutor.java:1343)
at java.base/java.util.concurrent.AbstractExecutorService.submit(AbstractExecutorService.java:118)
at kafka.log.LogManager.$anonfun$shutdown$9(LogManager.scala:461)
at scala.collection.TraversableLike.$anonfun$map$1(TraversableLike.scala:273)
at scala.collection.immutable.List.foreach(List.scala:392)
at scala.collection.TraversableLike.map(TraversableLike.scala:273)
at scala.collection.TraversableLike.map$(TraversableLike.scala:266)
at scala.collection.immutable.List.map(List.scala:298)
at kafka.log.LogManager.$anonfun$shutdown$4(LogManager.scala:461)
at kafka.log.LogManager.$anonfun$shutdown$4$adapted(LogManager.scala:444)
at scala.collection.immutable.List.foreach(List.scala:392)
at kafka.log.LogManager.shutdown(LogManager.scala:444)
at unit.kafka.cluster.AbstractPartitionTest.tearDown(AbstractPartitionTest.scala:91)
at java.base/jdk.internal.reflect.NativeMethodAccessorImpl.invoke0(Native Method)
at java.base/jdk.internal.reflect.NativeMethodAccessorImpl.invoke(NativeMethodAccessorImpl.java:62)
at java.base/jdk.internal.reflect.DelegatingMethodAccessorImpl.invoke(DelegatingMethodAccessorImpl.java:43)
at java.base/java.lang.reflect.Method.invoke(Method.java:564)
at org.junit.runners.model.FrameworkMethod$1.runReflectiveCall(FrameworkMethod.java:59)
at org.junit.internal.runners.model.ReflectiveCallable.run(ReflectiveCallable.java:12)
at org.junit.runners.model.FrameworkMethod.invokeExplosively(FrameworkMethod.java:56)
at org.junit.internal.runners.statements.RunAfters.invokeMethod(RunAfters.java:46)
at org.junit.internal.runners.statements.RunAfters.evaluate(RunAfters.java:33)
at org.junit.runners.ParentRunner$3.evaluate(ParentRunner.java:306)
at org.junit.runners.BlockJUnit4ClassRunner$1.evaluate(BlockJUnit4ClassRunner.java:100)
at org.junit.runners.ParentRunner.runLeaf(ParentRunner.java:366)
at org.junit.runners.BlockJUnit4ClassRunner.runChild(BlockJUnit4ClassRunner.java:103)
at org.junit.runners.BlockJUnit4ClassRunner.runChild(BlockJUnit4ClassRunner.java:63)
at org.junit.runners.ParentRunner$4.run(ParentRunner.java:331)
at org.junit.runners.ParentRunner$1.schedule(ParentRunner.java:79)
at org.junit.runners.ParentRunner.runChildren(ParentRunner.java:329)
at org.junit.runners.ParentRunner.access$100(ParentRunner.java:66)
at org.junit.runners.ParentRunner$2.evaluate(ParentRunner.java:293)
at org.junit.runners.ParentRunner.run(ParentRunner.java:413)
at org.junit.runners.Suite.runChild(Suite.java:128)
at org.junit.runners.Suite.runChild(Suite.java:27)
at org.junit.runners.ParentRunner$4.run(ParentRunner.java:331)
at org.junit.runners.ParentRunner$1.schedule(ParentRunner.java:79)
at org.junit.runners.ParentRunner.runChildren(ParentRunner.java:329)
at org.junit.runners.ParentRunner.access$100(ParentRunner.java:66)
at org.junit.runners.ParentRunner$2.evaluate(ParentRunner.java:293)
at org.junit.runners.ParentRunner$3.evaluate(ParentRunner.java:306)
at org.junit.runners.ParentRunner.run(ParentRunner.java:413)
at org.gradle.api.internal.tasks.testing.junit.JUnitTestClassExecutor.runTestClass(JUnitTestClassExecutor.java:110)
at org.gradle.api.internal.tasks.testing.junit.JUnitTestClassExecutor.execute(JUnitTestClassExecutor.java:58)
[2007.092s][warning][os,thread] Failed to start thread - pthread_create failed (EAGAIN) for attributes: stacksize: 1024k, guardsize: 0k, detached.
at org.gradle.api.internal.tasks.testing.junit.JUnitTestClassExecutor.execute(JUnitTestClassExecutor.java:38)
at org.gradle.api.internal.tasks.testing.junit.AbstractJUnitTestClassProcessor.processTestClass(AbstractJUnitTestClassProcessor.java:62)
at org.gradle.api.internal.tasks.testing.SuiteTestClassProcessor.processTestClass(SuiteTestClassProcessor.java:51)
at jdk.internal.reflect.GeneratedMethodAccessor15.invoke(Unknown Source)
at java.base/jdk.internal.reflect.DelegatingMethodAccessorImpl.invoke(DelegatingMethodAccessorImpl.java:43)
at java.base/java.lang.reflect.Method.invoke(Method.java:564)
at org.gradle.internal.dispatch.ReflectionDispatch.dispatch(ReflectionDispatch.java:36)
at org.gradle.internal.dispatch.ReflectionDispatch.dispatch(ReflectionDispatch.java:24)
at org.gradle.internal.dispatch.ContextClassLoaderDispatch.dispatch(ContextClassLoaderDispatch.java:33)
at org.gradle.internal.dispatch.ProxyDispatchAdapter$DispatchingInvocationHandler.invoke(ProxyDispatchAdapter.java:94)
at com.sun.proxy.$Proxy2.processTestClass(Unknown Source)
at org.gradle.api.internal.tasks.testing.worker.TestWorker.processTestClass(TestWorker.java:118)
at jdk.internal.reflect.GeneratedMethodAccessor14.invoke(Unknown Source)
at java.base/jdk.internal.reflect.DelegatingMethodAccessorImpl.invoke(DelegatingMethodAccessorImpl.java:43)
at java.base/java.lang.reflect.Method.invoke(Method.java:564)
at org.gradle.internal.dispatch.ReflectionDispatch.dispatch(ReflectionDispatch.java:36)
at org.gradle.internal.dispatch.ReflectionDispatch.dispatch(ReflectionDispatch.java:24)
at org.gradle.internal.remote.internal.hub.MessageHubBackedObjectConnection$DispatchWrapper.dispatch(MessageHubBackedObjectConnection.java:182)
at org.gradle.internal.remote.internal.hub.MessageHubBackedObjectConnection$DispatchWrapper.dispatch(MessageHubBackedObjectConnection.java:164)
at org.gradle.internal.remote.internal.hub.MessageHub$Handler.run(MessageHub.java:413)
at org.gradle.internal.concurrent.ExecutorPolicy$CatchAndRecordFailures.onExecute(ExecutorPolicy.java:64)
at org.gradle.internal.concurrent.ManagedExecutorImpl$1.run(ManagedExecutorImpl.java:48)
at java.base/java.util.concurrent.ThreadPoolExecutor.runWorker(ThreadPoolExecutor.java:1128)
at java.base/java.util.concurrent.ThreadPoolExecutor$Worker.run(ThreadPoolExecutor.java:628)
at org.gradle.internal.concurrent.ThreadFactoryImpl$ManagedThreadRunnable.run(ThreadFactoryImpl.java:56)
at java.base/java.lang.Thread.run(Thread.java:830)
unit.kafka.cluster.AssignmentStateTest > testPartitionAssignmentStatus[8] STARTED
[2007.095s][warning][os,thread] Failed to start thread - pthread_create failed (EAGAIN) for attributes: stacksize: 1024k, guardsize: 0k, detached.
[2007.098s][warning][os,thread] Failed to start thread - pthread_create failed (EAGAIN) for attributes: stacksize: 1024k, guardsize: 0k, detached.
[2007.126s][warning][os,thread] Failed to start thread - pthread_create failed (EAGAIN) for attributes: stacksize: 1024k, guardsize: 0k, detached.
[2007.128s][warning][os,thread] Failed to start thread - pthread_create failed (EAGAIN) for attributes: stacksize: 1024k, guardsize: 0k, detached.
unit.kafka.cluster.AssignmentStateTest.testPartitionAssignmentStatus[8] failed, log available in /home/jenkins/jenkins-slave/workspace/kafka-trunk-jdk14/core/build/reports/testOutput/unit.kafka.cluster.AssignmentStateTest.testPartitionAssignmentStatus[8].test.stdout
unit.kafka.cluster.AssignmentStateTest > testPartitionAssignmentStatus[8] FAILED
[2007.133s][warning][os,thread] Failed to start thread - pthread_create failed (EAGAIN) for attributes: stacksize: 1024k, guardsize: 0k, detached.
java.lang.OutOfMemoryError: unable to create native thread: possibly out of memory or process/resource limits reached
at java.base/java.lang.Thread.start0(Native Method)
at java.base/java.lang.Thread.start(Thread.java:799)
at java.base/java.util.concurrent.ThreadPoolExecutor.addWorker(ThreadPoolExecutor.java:937)
at java.base/java.util.concurrent.ThreadPoolExecutor.execute(ThreadPoolExecutor.java:1343)
at java.base/java.util.concurrent.AbstractExecutorService.submit(AbstractExecutorService.java:118)
at kafka.log.LogManager.$anonfun$shutdown$9(LogManager.scala:461)
at scala.collection.TraversableLike.$anonfun$map$1(TraversableLike.scala:273)
at scala.collection.immutable.List.foreach(List.scala:392)
at scala.collection.TraversableLike.map(TraversableLike.scala:273)
at scala.collection.TraversableLike.map$(TraversableLike.scala:266)
at scala.collection.immutable.List.map(List.scala:298)
at kafka.log.LogManager.$anonfun$shutdown$4(LogManager.scala:461)
at kafka.log.LogManager.$anonfun$shutdown$4$adapted(LogManager.scala:444)
at scala.collection.immutable.List.foreach(List.scala:392)
at kafka.log.LogManager.shutdown(LogManager.scala:444)
at unit.kafka.cluster.AbstractPartitionTest.tearDown(AbstractPartitionTest.scala:91)
at java.base/jdk.internal.reflect.NativeMethodAccessorImpl.invoke0(Native Method)
at java.base/jdk.internal.reflect.NativeMethodAccessorImpl.invoke(NativeMethodAccessorImpl.java:62)
at java.base/jdk.internal.reflect.DelegatingMethodAccessorImpl.invoke(DelegatingMethodAccessorImpl.java:43)
at java.base/java.lang.reflect.Method.invoke(Method.java:564)
at org.junit.runners.model.FrameworkMethod$1.runReflectiveCall(FrameworkMethod.java:59)
at org.junit.internal.runners.model.ReflectiveCallable.run(ReflectiveCallable.java:12)
at org.junit.runners.model.FrameworkMethod.invokeExplosively(FrameworkMethod.java:56)
at org.junit.internal.runners.statements.RunAfters.invokeMethod(RunAfters.java:46)
at org.junit.internal.runners.statements.RunAfters.evaluate(RunAfters.java:33)
at org.junit.runners.ParentRunner$3.evaluate(ParentRunner.java:306)
at org.junit.runners.BlockJUnit4ClassRunner$1.evaluate(BlockJUnit4ClassRunner.java:100)
at org.junit.runners.ParentRunner.runLeaf(ParentRunner.java:366)
at org.junit.runners.BlockJUnit4ClassRunner.runChild(BlockJUnit4ClassRunner.java:103)
at org.junit.runners.BlockJUnit4ClassRunner.runChild(BlockJUnit4ClassRunner.java:63)
at org.junit.runners.ParentRunner$4.run(ParentRunner.java:331)
at org.junit.runners.ParentRunner$1.schedule(ParentRunner.java:79)
at org.junit.runners.ParentRunner.runChildren(ParentRunner.java:329)
at org.junit.runners.ParentRunner.access$100(ParentRunner.java:66)
at org.junit.runners.ParentRunner$2.evaluate(ParentRunner.java:293)
at org.junit.runners.ParentRunner.run(ParentRunner.java:413)
at org.junit.runners.Suite.runChild(Suite.java:128)
at org.junit.runners.Suite.runChild(Suite.java:27)
at org.junit.runners.ParentRunner$4.run(ParentRunner.java:331)
at org.junit.runners.ParentRunner$1.schedule(ParentRunner.java:79)
at org.junit.runners.ParentRunner.runChildren(ParentRunner.java:329)
at org.junit.runners.ParentRunner.access$100(ParentRunner.java:66)
at org.junit.runners.ParentRunner$2.evaluate(ParentRunner.java:293)
at org.junit.runners.ParentRunner$3.evaluate(ParentRunner.java:306)
at org.junit.runners.ParentRunner.run(ParentRunner.java:413)
at org.gradle.api.internal.tasks.testing.junit.JUnitTestClassExecutor.runTestClass(JUnitTestClassExecutor.java:110)
at org.gradle.api.internal.tasks.testing.junit.JUnitTestClassExecutor.execute(JUnitTestClassExecutor.java:58)
at org.gradle.api.internal.tasks.testing.junit.JUnitTestClassExecutor.execute(JUnitTestClassExecutor.java:38)
at org.gradle.api.internal.tasks.testing.junit.AbstractJUnitTestClassProcessor.processTestClass(AbstractJUnitTestClassProcessor.java:62)
at org.gradle.api.internal.tasks.testing.SuiteTestClassProcessor.processTestClass(SuiteTestClassProcessor.java:51)
at jdk.internal.reflect.GeneratedMethodAccessor15.invoke(Unknown Source)
at java.base/jdk.internal.reflect.DelegatingMethodAccessorImpl.invoke(DelegatingMethodAccessorImpl.java:43)
at java.base/java.lang.reflect.Method.invoke(Method.java:564)
at org.gradle.internal.dispatch.ReflectionDispatch.dispatch(ReflectionDispatch.java:36)
at org.gradle.internal.dispatch.ReflectionDispatch.dispatch(ReflectionDispatch.java:24)
at org.gradle.internal.dispatch.ContextClassLoaderDispatch.dispatch(ContextClassLoaderDispatch.java:33)
at org.gradle.internal.dispatch.ProxyDispatchAdapter$DispatchingInvocationHandler.invoke(ProxyDispatchAdapter.java:94)
at com.sun.proxy.$Proxy2.processTestClass(Unknown Source)
at org.gradle.api.internal.tasks.testing.worker.TestWorker.processTestClass(TestWorker.java:118)
at jdk.internal.reflect.GeneratedMethodAccessor14.invoke(Unknown Source)
at java.base/jdk.internal.reflect.DelegatingMethodAccessorImpl.invoke(DelegatingMethodAccessorImpl.java:43)
at java.base/java.lang.reflect.Method.invoke(Method.java:564)
at org.gradle.internal.dispatch.ReflectionDispatch.dispatch(ReflectionDispatch.java:36)
at org.gradle.internal.dispatch.ReflectionDispatch.dispatch(ReflectionDispatch.java:24)
at org.gradle.internal.remote.internal.hub.MessageHubBackedObjectConnection$DispatchWrapper.dispatch(MessageHubBackedObjectConnection.java:182)
at org.gradle.internal.remote.internal.hub.MessageHubBackedObjectConnection$DispatchWrapper.dispatch(MessageHubBackedObjectConnection.java:164)
at org.gradle.internal.remote.internal.hub.MessageHub$Handler.run(MessageHub.java:413)
at org.gradle.internal.concurrent.ExecutorPolicy$CatchAndRecordFailures.onExecute(ExecutorPolicy.java:64)
at org.gradle.internal.concurrent.ManagedExecutorImpl$1.run(ManagedExecutorImpl.java:48)
at java.base/java.util.concurrent.ThreadPoolExecutor.runWorker(ThreadPoolExecutor.java:1128)
at java.base/java.util.concurrent.ThreadPoolExecutor$Worker.run(ThreadPoolExecutor.java:628)
at org.gradle.internal.concurrent.ThreadFactoryImpl$ManagedThreadRunnable.run(ThreadFactoryImpl.java:56)
at java.base/java.lang.Thread.run(Thread.java:830)
[2007.139s][warning][os,thread] Failed to start thread - pthread_create failed (EAGAIN) for attributes: stacksize: 1024k, guardsize: 0k, detached.
ERROR: No tool found matching GRADLE_4_10_2_HOME
ERROR: Could not install GRADLE_4_10_3_HOME
java.lang.NullPointerException
ERROR: No tool found matching GRADLE_4_10_2_HOME
ERROR: Could not install GRADLE_4_10_3_HOME
java.lang.NullPointerException
ERROR: No tool found matching GRADLE_4_10_2_HOME
ERROR: Could not install GRADLE_4_10_3_HOME
java.lang.NullPointerException
ERROR: No tool found matching GRADLE_4_10_2_HOME
ERROR: Could not install GRADLE_4_10_3_HOME
java.lang.NullPointerException
ERROR: No tool found matching GRADLE_4_10_2_HOME
ERROR: Could not install GRADLE_4_10_3_HOME
java.lang.NullPointerException
ERROR: No tool found matching GRADLE_4_10_2_HOME
ERROR: Could not install GRADLE_4_10_3_HOME
java.lang.NullPointerException
FATAL: command execution failed
java.io.EOFException
at java.io.ObjectInputStream$PeekInputStream.readFully(ObjectInputStream.java:2681)
at java.io.ObjectInputStream$BlockDataInputStream.readShort(ObjectInputStream.java:3156)
at java.io.ObjectInputStream.readStreamHeader(ObjectInputStream.java:862)
at java.io.ObjectInputStream.<init>(ObjectInputStream.java:358)
at hudson.remoting.ObjectInputStreamEx.<init>(ObjectInputStreamEx.java:49)
at hudson.remoting.Command.readFrom(Command.java:140)
at hudson.remoting.Command.readFrom(Command.java:126)
at hudson.remoting.AbstractSynchronousByteArrayCommandTransport.read(AbstractSynchronousByteArrayCommandTransport.java:36)
at hudson.remoting.SynchronousCommandTransport$ReaderThread.run(SynchronousCommandTransport.java:63)
Caused: java.io.IOException: Unexpected termination of the channel
at hudson.remoting.SynchronousCommandTransport$ReaderThread.run(SynchronousCommandTransport.java:77)
Caused: java.io.IOException: Backing channel 'H30' is disconnected.
at hudson.remoting.RemoteInvocationHandler.channelOrFail(RemoteInvocationHandler.java:214)
at hudson.remoting.RemoteInvocationHandler.invoke(RemoteInvocationHandler.java:283)
at com.sun.proxy.$Proxy141.isAlive(Unknown Source)
at hudson.Launcher$RemoteLauncher$ProcImpl.isAlive(Launcher.java:1150)
at hudson.Launcher$RemoteLauncher$ProcImpl.join(Launcher.java:1142)
at hudson.tasks.CommandInterpreter.join(CommandInterpreter.java:155)
at hudson.tasks.CommandInterpreter.perform(CommandInterpreter.java:109)
at hudson.tasks.CommandInterpreter.perform(CommandInterpreter.java:66)
at hudson.tasks.BuildStepMonitor$1.perform(BuildStepMonitor.java:20)
at hudson.model.AbstractBuild$AbstractBuildExecution.perform(AbstractBuild.java:741)
at hudson.model.Build$BuildExecution.build(Build.java:206)
at hudson.model.Build$BuildExecution.doRun(Build.java:163)
at hudson.model.AbstractBuild$AbstractBuildExecution.run(AbstractBuild.java:504)
at hudson.model.Run.execute(Run.java:1815)
at hudson.model.FreeStyleBuild.run(FreeStyleBuild.java:43)
at hudson.model.ResourceController.execute(ResourceController.java:97)
at hudson.model.Executor.run(Executor.java:429)
FATAL: Unable to delete script file /tmp/jenkins7042357161612690016.sh
java.io.EOFException
at java.io.ObjectInputStream$PeekInputStream.readFully(ObjectInputStream.java:2681)
at java.io.ObjectInputStream$BlockDataInputStream.readShort(ObjectInputStream.java:3156)
at java.io.ObjectInputStream.readStreamHeader(ObjectInputStream.java:862)
at java.io.ObjectInputStream.<init>(ObjectInputStream.java:358)
at hudson.remoting.ObjectInputStreamEx.<init>(ObjectInputStreamEx.java:49)
at hudson.remoting.Command.readFrom(Command.java:140)
at hudson.remoting.Command.readFrom(Command.java:126)
at hudson.remoting.AbstractSynchronousByteArrayCommandTransport.read(AbstractSynchronousByteArrayCommandTransport.java:36)
at hudson.remoting.SynchronousCommandTransport$ReaderThread.run(SynchronousCommandTransport.java:63)
Caused: java.io.IOException: Unexpected termination of the channel
at hudson.remoting.SynchronousCommandTransport$ReaderThread.run(SynchronousCommandTransport.java:77)
Caused: hudson.remoting.ChannelClosedException: Channel "unknown": Remote call on H30 failed. The channel is closing down or has closed down
at hudson.remoting.Channel.call(Channel.java:950)
at hudson.FilePath.act(FilePath.java:1072)
at hudson.FilePath.act(FilePath.java:1061)
at hudson.FilePath.delete(FilePath.java:1542)
at hudson.tasks.CommandInterpreter.perform(CommandInterpreter.java:123)
at hudson.tasks.CommandInterpreter.perform(CommandInterpreter.java:66)
at hudson.tasks.BuildStepMonitor$1.perform(BuildStepMonitor.java:20)
at hudson.model.AbstractBuild$AbstractBuildExecution.perform(AbstractBuild.java:741)
at hudson.model.Build$BuildExecution.build(Build.java:206)
at hudson.model.Build$BuildExecution.doRun(Build.java:163)
at hudson.model.AbstractBuild$AbstractBuildExecution.run(AbstractBuild.java:504)
at hudson.model.Run.execute(Run.java:1815)
at hudson.model.FreeStyleBuild.run(FreeStyleBuild.java:43)
at hudson.model.ResourceController.execute(ResourceController.java:97)
at hudson.model.Executor.run(Executor.java:429)
Build step 'Execute shell' marked build as failure
ERROR: Step ?Publish JUnit test result report? failed: no workspace for kafka-trunk-jdk14 #164
ERROR: H30 is offline; cannot locate JDK 14 (latest)
ERROR: No tool found matching GRADLE_4_10_2_HOME
ERROR: H30 is offline; cannot locate Gradle 4.10.3
Setting GRADLE_4_10_3_HOME=/home/jenkins/tools/gradle/4.10.3
Not sending mail to unregistered user noreply@github.com
Build failed in Jenkins: kafka-trunk-jdk14 #163
Posted by Apache Jenkins Server <je...@builds.apache.org>.
See <https://builds.apache.org/job/kafka-trunk-jdk14/163/display/redirect?page=changes>
Changes:
[github] KAFKA-9945: TopicCommand should support --if-exists and --if-not-exists
------------------------------------------
[...truncated 3.16 MB...]
org.apache.kafka.streams.TopologyTestDriverTest > shouldCaptureInternalTopicNamesIfWrittenInto[Eos enabled = false] STARTED
org.apache.kafka.streams.TopologyTestDriverTest > shouldCaptureInternalTopicNamesIfWrittenInto[Eos enabled = false] PASSED
org.apache.kafka.streams.TopologyTestDriverTest > shouldPunctuateOnWallClockTimeDeprecated[Eos enabled = false] STARTED
org.apache.kafka.streams.TopologyTestDriverTest > shouldPunctuateOnWallClockTimeDeprecated[Eos enabled = false] PASSED
org.apache.kafka.streams.TopologyTestDriverTest > shouldProcessRecordForTopic[Eos enabled = false] STARTED
org.apache.kafka.streams.TopologyTestDriverTest > shouldProcessRecordForTopic[Eos enabled = false] PASSED
org.apache.kafka.streams.TopologyTestDriverTest > shouldForwardRecordsFromSubtopologyToSubtopology[Eos enabled = false] STARTED
org.apache.kafka.streams.TopologyTestDriverTest > shouldForwardRecordsFromSubtopologyToSubtopology[Eos enabled = false] PASSED
org.apache.kafka.streams.TopologyTestDriverTest > shouldNotUpdateStoreForSmallerValue[Eos enabled = false] STARTED
org.apache.kafka.streams.TopologyTestDriverTest > shouldNotUpdateStoreForSmallerValue[Eos enabled = false] PASSED
org.apache.kafka.streams.TopologyTestDriverTest > shouldCreateStateDirectoryForStatefulTopology[Eos enabled = false] STARTED
org.apache.kafka.streams.TopologyTestDriverTest > shouldCreateStateDirectoryForStatefulTopology[Eos enabled = false] PASSED
org.apache.kafka.streams.TopologyTestDriverTest > shouldPunctuateIfWallClockTimeAdvances[Eos enabled = false] STARTED
org.apache.kafka.streams.TopologyTestDriverTest > shouldPunctuateIfWallClockTimeAdvances[Eos enabled = false] PASSED
org.apache.kafka.streams.MockTimeTest > shouldGetNanosAsMillis STARTED
org.apache.kafka.streams.MockTimeTest > shouldGetNanosAsMillis PASSED
org.apache.kafka.streams.MockTimeTest > shouldSetStartTime STARTED
org.apache.kafka.streams.MockTimeTest > shouldSetStartTime PASSED
org.apache.kafka.streams.MockTimeTest > shouldNotAllowNegativeSleep STARTED
org.apache.kafka.streams.MockTimeTest > shouldNotAllowNegativeSleep PASSED
org.apache.kafka.streams.MockTimeTest > shouldAdvanceTimeOnSleep STARTED
org.apache.kafka.streams.MockTimeTest > shouldAdvanceTimeOnSleep PASSED
org.apache.kafka.streams.internals.WindowStoreFacadeTest > shouldReturnIsOpen STARTED
org.apache.kafka.streams.internals.WindowStoreFacadeTest > shouldReturnIsOpen PASSED
org.apache.kafka.streams.internals.WindowStoreFacadeTest > shouldReturnName STARTED
org.apache.kafka.streams.internals.WindowStoreFacadeTest > shouldReturnName PASSED
org.apache.kafka.streams.internals.WindowStoreFacadeTest > shouldPutWithUnknownTimestamp STARTED
org.apache.kafka.streams.internals.WindowStoreFacadeTest > shouldPutWithUnknownTimestamp PASSED
org.apache.kafka.streams.internals.WindowStoreFacadeTest > shouldPutWindowStartTimestampWithUnknownTimestamp STARTED
org.apache.kafka.streams.internals.WindowStoreFacadeTest > shouldPutWindowStartTimestampWithUnknownTimestamp PASSED
org.apache.kafka.streams.internals.WindowStoreFacadeTest > shouldReturnIsPersistent STARTED
org.apache.kafka.streams.internals.WindowStoreFacadeTest > shouldReturnIsPersistent PASSED
org.apache.kafka.streams.internals.WindowStoreFacadeTest > shouldForwardClose STARTED
org.apache.kafka.streams.internals.WindowStoreFacadeTest > shouldForwardClose PASSED
org.apache.kafka.streams.internals.WindowStoreFacadeTest > shouldForwardFlush STARTED
org.apache.kafka.streams.internals.WindowStoreFacadeTest > shouldForwardFlush PASSED
org.apache.kafka.streams.internals.WindowStoreFacadeTest > shouldForwardInit STARTED
org.apache.kafka.streams.internals.WindowStoreFacadeTest > shouldForwardInit PASSED
org.apache.kafka.streams.test.TestRecordTest > testConsumerRecord STARTED
org.apache.kafka.streams.test.TestRecordTest > testConsumerRecord PASSED
org.apache.kafka.streams.test.TestRecordTest > testToString STARTED
org.apache.kafka.streams.test.TestRecordTest > testToString PASSED
org.apache.kafka.streams.test.TestRecordTest > testInvalidRecords STARTED
org.apache.kafka.streams.test.TestRecordTest > testInvalidRecords PASSED
org.apache.kafka.streams.test.TestRecordTest > testPartialConstructorEquals STARTED
org.apache.kafka.streams.test.TestRecordTest > testPartialConstructorEquals PASSED
org.apache.kafka.streams.test.TestRecordTest > testMultiFieldMatcher STARTED
org.apache.kafka.streams.test.TestRecordTest > testMultiFieldMatcher PASSED
org.apache.kafka.streams.test.TestRecordTest > testFields STARTED
org.apache.kafka.streams.test.TestRecordTest > testFields PASSED
org.apache.kafka.streams.test.TestRecordTest > testProducerRecord STARTED
org.apache.kafka.streams.test.TestRecordTest > testProducerRecord PASSED
org.apache.kafka.streams.test.TestRecordTest > testEqualsAndHashCode STARTED
org.apache.kafka.streams.test.TestRecordTest > testEqualsAndHashCode PASSED
> Task :streams:upgrade-system-tests-0100:processTestResources NO-SOURCE
> Task :streams:upgrade-system-tests-0100:testClasses
> Task :streams:upgrade-system-tests-0100:checkstyleTest
> Task :streams:upgrade-system-tests-0100:spotbugsMain NO-SOURCE
> Task :streams:upgrade-system-tests-0100:test
> Task :streams:upgrade-system-tests-0101:compileJava NO-SOURCE
> Task :streams:upgrade-system-tests-0101:processResources NO-SOURCE
> Task :streams:upgrade-system-tests-0101:classes UP-TO-DATE
> Task :streams:upgrade-system-tests-0101:checkstyleMain NO-SOURCE
> Task :streams:upgrade-system-tests-0101:compileTestJava
> Task :streams:upgrade-system-tests-0101:processTestResources NO-SOURCE
> Task :streams:upgrade-system-tests-0101:testClasses
> Task :streams:upgrade-system-tests-0101:checkstyleTest
> Task :streams:upgrade-system-tests-0101:spotbugsMain NO-SOURCE
> Task :streams:upgrade-system-tests-0101:test
> Task :streams:upgrade-system-tests-0102:compileJava NO-SOURCE
> Task :streams:upgrade-system-tests-0102:processResources NO-SOURCE
> Task :streams:upgrade-system-tests-0102:classes UP-TO-DATE
> Task :streams:upgrade-system-tests-0102:checkstyleMain NO-SOURCE
> Task :streams:upgrade-system-tests-0102:compileTestJava
> Task :streams:upgrade-system-tests-0102:processTestResources NO-SOURCE
> Task :streams:upgrade-system-tests-0102:testClasses
> Task :streams:upgrade-system-tests-0102:checkstyleTest
> Task :streams:upgrade-system-tests-0102:spotbugsMain NO-SOURCE
> Task :streams:upgrade-system-tests-0102:test
> Task :streams:upgrade-system-tests-0110:compileJava NO-SOURCE
> Task :streams:upgrade-system-tests-0110:processResources NO-SOURCE
> Task :streams:upgrade-system-tests-0110:classes UP-TO-DATE
> Task :streams:upgrade-system-tests-0110:checkstyleMain NO-SOURCE
> Task :streams:upgrade-system-tests-0110:compileTestJava
> Task :streams:upgrade-system-tests-0110:processTestResources NO-SOURCE
> Task :streams:upgrade-system-tests-0110:testClasses
> Task :streams:upgrade-system-tests-0110:checkstyleTest
> Task :streams:upgrade-system-tests-0110:spotbugsMain NO-SOURCE
> Task :streams:upgrade-system-tests-0110:test
> Task :streams:upgrade-system-tests-10:compileJava NO-SOURCE
> Task :streams:upgrade-system-tests-10:processResources NO-SOURCE
> Task :streams:upgrade-system-tests-10:classes UP-TO-DATE
> Task :streams:upgrade-system-tests-10:checkstyleMain NO-SOURCE
> Task :streams:upgrade-system-tests-10:compileTestJava
> Task :streams:upgrade-system-tests-10:processTestResources NO-SOURCE
> Task :streams:upgrade-system-tests-10:testClasses
> Task :streams:upgrade-system-tests-10:checkstyleTest
> Task :streams:upgrade-system-tests-10:spotbugsMain NO-SOURCE
> Task :streams:upgrade-system-tests-10:test
> Task :streams:upgrade-system-tests-11:compileJava NO-SOURCE
> Task :streams:upgrade-system-tests-11:processResources NO-SOURCE
> Task :streams:upgrade-system-tests-11:classes UP-TO-DATE
> Task :streams:upgrade-system-tests-11:checkstyleMain NO-SOURCE
> Task :streams:upgrade-system-tests-11:compileTestJava
> Task :streams:upgrade-system-tests-11:processTestResources NO-SOURCE
> Task :streams:upgrade-system-tests-11:testClasses
> Task :streams:upgrade-system-tests-11:checkstyleTest
> Task :streams:upgrade-system-tests-11:spotbugsMain NO-SOURCE
> Task :streams:upgrade-system-tests-11:test
> Task :streams:upgrade-system-tests-20:compileJava NO-SOURCE
> Task :streams:upgrade-system-tests-20:processResources NO-SOURCE
> Task :streams:upgrade-system-tests-20:classes UP-TO-DATE
> Task :streams:upgrade-system-tests-20:checkstyleMain NO-SOURCE
> Task :streams:upgrade-system-tests-20:compileTestJava
> Task :streams:upgrade-system-tests-20:processTestResources NO-SOURCE
> Task :streams:upgrade-system-tests-20:testClasses
> Task :streams:upgrade-system-tests-20:checkstyleTest
> Task :streams:upgrade-system-tests-20:spotbugsMain NO-SOURCE
> Task :streams:upgrade-system-tests-20:test
> Task :streams:upgrade-system-tests-21:compileJava NO-SOURCE
> Task :streams:upgrade-system-tests-21:processResources NO-SOURCE
> Task :streams:upgrade-system-tests-21:classes UP-TO-DATE
> Task :streams:upgrade-system-tests-21:checkstyleMain NO-SOURCE
> Task :streams:upgrade-system-tests-21:compileTestJava
> Task :streams:upgrade-system-tests-21:processTestResources NO-SOURCE
> Task :streams:upgrade-system-tests-21:testClasses
> Task :streams:upgrade-system-tests-21:checkstyleTest
> Task :streams:upgrade-system-tests-21:spotbugsMain NO-SOURCE
> Task :streams:upgrade-system-tests-21:test
> Task :streams:upgrade-system-tests-22:compileJava NO-SOURCE
> Task :streams:upgrade-system-tests-22:processResources NO-SOURCE
> Task :streams:upgrade-system-tests-22:classes UP-TO-DATE
> Task :streams:upgrade-system-tests-22:checkstyleMain NO-SOURCE
> Task :streams:upgrade-system-tests-22:compileTestJava
> Task :streams:upgrade-system-tests-22:processTestResources NO-SOURCE
> Task :streams:upgrade-system-tests-22:testClasses
> Task :streams:upgrade-system-tests-22:checkstyleTest
> Task :streams:upgrade-system-tests-22:spotbugsMain NO-SOURCE
> Task :streams:upgrade-system-tests-22:test
> Task :streams:upgrade-system-tests-23:compileJava NO-SOURCE
> Task :streams:upgrade-system-tests-23:processResources NO-SOURCE
> Task :streams:upgrade-system-tests-23:classes UP-TO-DATE
> Task :streams:upgrade-system-tests-23:checkstyleMain NO-SOURCE
> Task :streams:upgrade-system-tests-23:compileTestJava
> Task :streams:upgrade-system-tests-23:processTestResources NO-SOURCE
> Task :streams:upgrade-system-tests-23:testClasses
> Task :streams:upgrade-system-tests-23:checkstyleTest
> Task :streams:upgrade-system-tests-23:spotbugsMain NO-SOURCE
> Task :streams:upgrade-system-tests-23:test
> Task :streams:upgrade-system-tests-24:compileJava NO-SOURCE
> Task :streams:upgrade-system-tests-24:processResources NO-SOURCE
> Task :streams:upgrade-system-tests-24:classes UP-TO-DATE
> Task :streams:upgrade-system-tests-24:checkstyleMain NO-SOURCE
> Task :streams:upgrade-system-tests-24:compileTestJava
> Task :streams:upgrade-system-tests-24:processTestResources NO-SOURCE
> Task :streams:upgrade-system-tests-24:testClasses
> Task :streams:upgrade-system-tests-24:checkstyleTest
> Task :streams:upgrade-system-tests-24:spotbugsMain NO-SOURCE
> Task :streams:upgrade-system-tests-24:test
> Task :streams:upgrade-system-tests-25:compileJava NO-SOURCE
> Task :streams:upgrade-system-tests-25:processResources NO-SOURCE
> Task :streams:upgrade-system-tests-25:classes UP-TO-DATE
> Task :streams:upgrade-system-tests-25:checkstyleMain NO-SOURCE
> Task :streams:upgrade-system-tests-25:compileTestJava
> Task :streams:upgrade-system-tests-25:processTestResources NO-SOURCE
> Task :streams:upgrade-system-tests-25:testClasses
> Task :streams:upgrade-system-tests-25:checkstyleTest
> Task :streams:upgrade-system-tests-25:spotbugsMain NO-SOURCE
> Task :streams:upgrade-system-tests-25:test
FAILURE: Build failed with an exception.
* What went wrong:
Execution failed for task ':clients:test'.
> There were failing tests. See the report at: file://<https://builds.apache.org/job/kafka-trunk-jdk14/ws/clients/build/reports/tests/test/index.html>
* Try:
Run with --stacktrace option to get the stack trace. Run with --info or --debug option to get more log output. Run with --scan to get full insights.
* Get more help at https://help.gradle.org
Deprecated Gradle features were used in this build, making it incompatible with Gradle 7.0.
Use '--warning-mode all' to show the individual deprecation warnings.
See https://docs.gradle.org/6.4.1/userguide/command_line_interface.html#sec:command_line_warnings
BUILD FAILED in 1h 46m 10s
215 actionable tasks: 183 executed, 32 up-to-date
Build step 'Execute shell' marked build as failure
Recording test results
ERROR: No tool found matching GRADLE_4_10_2_HOME
Setting GRADLE_4_10_3_HOME=/home/jenkins/tools/gradle/4.10.3
ERROR: No tool found matching GRADLE_4_10_2_HOME
Setting GRADLE_4_10_3_HOME=/home/jenkins/tools/gradle/4.10.3
Not sending mail to unregistered user noreply@github.com
Build failed in Jenkins: kafka-trunk-jdk14 #162
Posted by Apache Jenkins Server <je...@builds.apache.org>.
See <https://builds.apache.org/job/kafka-trunk-jdk14/162/display/redirect?page=changes>
Changes:
[github] KAFKA-9320: Enable TLSv1.3 by default (KIP-573) (#8695)
------------------------------------------
[...truncated 3.16 MB...]
org.apache.kafka.streams.TopologyTestDriverTest > shouldInitProcessor[Eos enabled = false] PASSED
org.apache.kafka.streams.TopologyTestDriverTest > shouldThrowForUnknownTopic[Eos enabled = false] STARTED
org.apache.kafka.streams.TopologyTestDriverTest > shouldThrowForUnknownTopic[Eos enabled = false] PASSED
org.apache.kafka.streams.TopologyTestDriverTest > shouldPunctuateOnStreamsTime[Eos enabled = false] STARTED
org.apache.kafka.streams.TopologyTestDriverTest > shouldPunctuateOnStreamsTime[Eos enabled = false] PASSED
org.apache.kafka.streams.TopologyTestDriverTest > shouldCaptureGlobalTopicNameIfWrittenInto[Eos enabled = false] STARTED
org.apache.kafka.streams.TopologyTestDriverTest > shouldCaptureGlobalTopicNameIfWrittenInto[Eos enabled = false] PASSED
org.apache.kafka.streams.TopologyTestDriverTest > shouldThrowIfInMemoryBuiltInStoreIsAccessedWithUntypedMethod[Eos enabled = false] STARTED
org.apache.kafka.streams.TopologyTestDriverTest > shouldThrowIfInMemoryBuiltInStoreIsAccessedWithUntypedMethod[Eos enabled = false] PASSED
org.apache.kafka.streams.TopologyTestDriverTest > shouldProcessFromSourcesThatMatchMultiplePattern[Eos enabled = false] STARTED
org.apache.kafka.streams.TopologyTestDriverTest > shouldProcessFromSourcesThatMatchMultiplePattern[Eos enabled = false] PASSED
org.apache.kafka.streams.TopologyTestDriverTest > shouldPopulateGlobalStore[Eos enabled = false] STARTED
org.apache.kafka.streams.TopologyTestDriverTest > shouldPopulateGlobalStore[Eos enabled = false] PASSED
org.apache.kafka.streams.TopologyTestDriverTest > shouldThrowIfPersistentBuiltInStoreIsAccessedWithUntypedMethod[Eos enabled = false] STARTED
org.apache.kafka.streams.TopologyTestDriverTest > shouldThrowIfPersistentBuiltInStoreIsAccessedWithUntypedMethod[Eos enabled = false] PASSED
org.apache.kafka.streams.TopologyTestDriverTest > shouldAllowPrePopulatingStatesStoresWithCachingEnabled[Eos enabled = false] STARTED
org.apache.kafka.streams.TopologyTestDriverTest > shouldAllowPrePopulatingStatesStoresWithCachingEnabled[Eos enabled = false] PASSED
org.apache.kafka.streams.TopologyTestDriverTest > shouldReturnCorrectPersistentStoreTypeOnly[Eos enabled = false] STARTED
org.apache.kafka.streams.TopologyTestDriverTest > shouldReturnCorrectPersistentStoreTypeOnly[Eos enabled = false] PASSED
org.apache.kafka.streams.TopologyTestDriverTest > shouldRespectTaskIdling[Eos enabled = false] STARTED
org.apache.kafka.streams.TopologyTestDriverTest > shouldRespectTaskIdling[Eos enabled = false] PASSED
org.apache.kafka.streams.TopologyTestDriverTest > shouldUseSourceSpecificDeserializers[Eos enabled = false] STARTED
org.apache.kafka.streams.TopologyTestDriverTest > shouldUseSourceSpecificDeserializers[Eos enabled = false] PASSED
org.apache.kafka.streams.TopologyTestDriverTest > shouldReturnAllStores[Eos enabled = false] STARTED
org.apache.kafka.streams.TopologyTestDriverTest > shouldReturnAllStores[Eos enabled = false] PASSED
org.apache.kafka.streams.TopologyTestDriverTest > shouldNotCreateStateDirectoryForStatelessTopology[Eos enabled = false] STARTED
org.apache.kafka.streams.TopologyTestDriverTest > shouldNotCreateStateDirectoryForStatelessTopology[Eos enabled = false] PASSED
org.apache.kafka.streams.TopologyTestDriverTest > shouldApplyGlobalUpdatesCorrectlyInRecursiveTopologies[Eos enabled = false] STARTED
org.apache.kafka.streams.TopologyTestDriverTest > shouldApplyGlobalUpdatesCorrectlyInRecursiveTopologies[Eos enabled = false] PASSED
org.apache.kafka.streams.TopologyTestDriverTest > shouldReturnAllStoresNames[Eos enabled = false] STARTED
org.apache.kafka.streams.TopologyTestDriverTest > shouldReturnAllStoresNames[Eos enabled = false] PASSED
org.apache.kafka.streams.TopologyTestDriverTest > shouldProcessConsumerRecordList[Eos enabled = false] STARTED
org.apache.kafka.streams.TopologyTestDriverTest > shouldProcessConsumerRecordList[Eos enabled = false] PASSED
org.apache.kafka.streams.TopologyTestDriverTest > shouldUseSinkSpecificSerializers[Eos enabled = false] STARTED
org.apache.kafka.streams.TopologyTestDriverTest > shouldUseSinkSpecificSerializers[Eos enabled = false] PASSED
org.apache.kafka.streams.TopologyTestDriverTest > shouldFlushStoreForFirstInput[Eos enabled = false] STARTED
org.apache.kafka.streams.TopologyTestDriverTest > shouldFlushStoreForFirstInput[Eos enabled = false] PASSED
org.apache.kafka.streams.TopologyTestDriverTest > shouldProcessFromSourceThatMatchPattern[Eos enabled = false] STARTED
org.apache.kafka.streams.TopologyTestDriverTest > shouldProcessFromSourceThatMatchPattern[Eos enabled = false] PASSED
org.apache.kafka.streams.TopologyTestDriverTest > shouldCaptureSinkTopicNamesIfWrittenInto[Eos enabled = false] STARTED
org.apache.kafka.streams.TopologyTestDriverTest > shouldCaptureSinkTopicNamesIfWrittenInto[Eos enabled = false] PASSED
org.apache.kafka.streams.TopologyTestDriverTest > shouldUpdateStoreForNewKey[Eos enabled = false] STARTED
org.apache.kafka.streams.TopologyTestDriverTest > shouldUpdateStoreForNewKey[Eos enabled = false] PASSED
org.apache.kafka.streams.TopologyTestDriverTest > shouldSendRecordViaCorrectSourceTopicDeprecated[Eos enabled = false] STARTED
org.apache.kafka.streams.TopologyTestDriverTest > shouldSendRecordViaCorrectSourceTopicDeprecated[Eos enabled = false] PASSED
org.apache.kafka.streams.TopologyTestDriverTest > shouldPunctuateOnWallClockTime[Eos enabled = false] STARTED
org.apache.kafka.streams.TopologyTestDriverTest > shouldPunctuateOnWallClockTime[Eos enabled = false] PASSED
org.apache.kafka.streams.TopologyTestDriverTest > shouldSetRecordMetadata[Eos enabled = false] STARTED
org.apache.kafka.streams.TopologyTestDriverTest > shouldSetRecordMetadata[Eos enabled = false] PASSED
org.apache.kafka.streams.TopologyTestDriverTest > shouldNotUpdateStoreForLargerValue[Eos enabled = false] STARTED
org.apache.kafka.streams.TopologyTestDriverTest > shouldNotUpdateStoreForLargerValue[Eos enabled = false] PASSED
org.apache.kafka.streams.TopologyTestDriverTest > shouldReturnCorrectInMemoryStoreTypeOnly[Eos enabled = false] STARTED
org.apache.kafka.streams.TopologyTestDriverTest > shouldReturnCorrectInMemoryStoreTypeOnly[Eos enabled = false] PASSED
org.apache.kafka.streams.TopologyTestDriverTest > shouldThrowForMissingTime[Eos enabled = false] STARTED
org.apache.kafka.streams.TopologyTestDriverTest > shouldThrowForMissingTime[Eos enabled = false] PASSED
org.apache.kafka.streams.TopologyTestDriverTest > shouldCaptureInternalTopicNamesIfWrittenInto[Eos enabled = false] STARTED
org.apache.kafka.streams.TopologyTestDriverTest > shouldCaptureInternalTopicNamesIfWrittenInto[Eos enabled = false] PASSED
org.apache.kafka.streams.TopologyTestDriverTest > shouldPunctuateOnWallClockTimeDeprecated[Eos enabled = false] STARTED
org.apache.kafka.streams.TopologyTestDriverTest > shouldPunctuateOnWallClockTimeDeprecated[Eos enabled = false] PASSED
org.apache.kafka.streams.TopologyTestDriverTest > shouldProcessRecordForTopic[Eos enabled = false] STARTED
org.apache.kafka.streams.TopologyTestDriverTest > shouldProcessRecordForTopic[Eos enabled = false] PASSED
org.apache.kafka.streams.TopologyTestDriverTest > shouldForwardRecordsFromSubtopologyToSubtopology[Eos enabled = false] STARTED
org.apache.kafka.streams.TopologyTestDriverTest > shouldForwardRecordsFromSubtopologyToSubtopology[Eos enabled = false] PASSED
org.apache.kafka.streams.TopologyTestDriverTest > shouldNotUpdateStoreForSmallerValue[Eos enabled = false] STARTED
org.apache.kafka.streams.TopologyTestDriverTest > shouldNotUpdateStoreForSmallerValue[Eos enabled = false] PASSED
org.apache.kafka.streams.TopologyTestDriverTest > shouldCreateStateDirectoryForStatefulTopology[Eos enabled = false] STARTED
org.apache.kafka.streams.TopologyTestDriverTest > shouldCreateStateDirectoryForStatefulTopology[Eos enabled = false] PASSED
org.apache.kafka.streams.TopologyTestDriverTest > shouldPunctuateIfWallClockTimeAdvances[Eos enabled = false] STARTED
org.apache.kafka.streams.TopologyTestDriverTest > shouldPunctuateIfWallClockTimeAdvances[Eos enabled = false] PASSED
> Task :streams:upgrade-system-tests-0110:processTestResources NO-SOURCE
> Task :streams:upgrade-system-tests-0110:testClasses
> Task :streams:upgrade-system-tests-0110:checkstyleTest
> Task :streams:upgrade-system-tests-0110:spotbugsMain NO-SOURCE
> Task :streams:upgrade-system-tests-0110:test
> Task :streams:upgrade-system-tests-10:compileJava NO-SOURCE
> Task :streams:upgrade-system-tests-10:processResources NO-SOURCE
> Task :streams:upgrade-system-tests-10:classes UP-TO-DATE
> Task :streams:upgrade-system-tests-10:checkstyleMain NO-SOURCE
> Task :streams:upgrade-system-tests-10:compileTestJava
> Task :streams:upgrade-system-tests-10:processTestResources NO-SOURCE
> Task :streams:upgrade-system-tests-10:testClasses
> Task :streams:upgrade-system-tests-10:checkstyleTest
> Task :streams:upgrade-system-tests-10:spotbugsMain NO-SOURCE
> Task :streams:upgrade-system-tests-10:test
> Task :streams:upgrade-system-tests-11:compileJava NO-SOURCE
> Task :streams:upgrade-system-tests-11:processResources NO-SOURCE
> Task :streams:upgrade-system-tests-11:classes UP-TO-DATE
> Task :streams:upgrade-system-tests-11:checkstyleMain NO-SOURCE
> Task :streams:upgrade-system-tests-11:compileTestJava
> Task :streams:upgrade-system-tests-11:processTestResources NO-SOURCE
> Task :streams:upgrade-system-tests-11:testClasses
> Task :streams:upgrade-system-tests-11:checkstyleTest
> Task :streams:upgrade-system-tests-11:spotbugsMain NO-SOURCE
> Task :streams:upgrade-system-tests-11:test
> Task :streams:upgrade-system-tests-20:compileJava NO-SOURCE
> Task :streams:upgrade-system-tests-20:processResources NO-SOURCE
> Task :streams:upgrade-system-tests-20:classes UP-TO-DATE
> Task :streams:upgrade-system-tests-20:checkstyleMain NO-SOURCE
> Task :streams:upgrade-system-tests-20:compileTestJava
> Task :streams:upgrade-system-tests-20:processTestResources NO-SOURCE
> Task :streams:upgrade-system-tests-20:testClasses
> Task :streams:upgrade-system-tests-20:checkstyleTest
> Task :streams:upgrade-system-tests-20:spotbugsMain NO-SOURCE
> Task :streams:upgrade-system-tests-20:test
> Task :streams:upgrade-system-tests-21:compileJava NO-SOURCE
> Task :streams:upgrade-system-tests-21:processResources NO-SOURCE
> Task :streams:upgrade-system-tests-21:classes UP-TO-DATE
> Task :streams:upgrade-system-tests-21:checkstyleMain NO-SOURCE
> Task :streams:upgrade-system-tests-21:compileTestJava
> Task :streams:upgrade-system-tests-21:processTestResources NO-SOURCE
> Task :streams:upgrade-system-tests-21:testClasses
> Task :streams:upgrade-system-tests-21:checkstyleTest
> Task :streams:upgrade-system-tests-21:spotbugsMain NO-SOURCE
> Task :streams:upgrade-system-tests-21:test
> Task :streams:upgrade-system-tests-22:compileJava NO-SOURCE
> Task :streams:upgrade-system-tests-22:processResources NO-SOURCE
> Task :streams:upgrade-system-tests-22:classes UP-TO-DATE
> Task :streams:upgrade-system-tests-22:checkstyleMain NO-SOURCE
> Task :streams:upgrade-system-tests-22:compileTestJava
> Task :streams:upgrade-system-tests-22:processTestResources NO-SOURCE
> Task :streams:upgrade-system-tests-22:testClasses
> Task :streams:upgrade-system-tests-22:checkstyleTest
> Task :streams:upgrade-system-tests-22:spotbugsMain NO-SOURCE
> Task :streams:upgrade-system-tests-22:test
> Task :streams:upgrade-system-tests-23:compileJava NO-SOURCE
> Task :streams:upgrade-system-tests-23:processResources NO-SOURCE
> Task :streams:upgrade-system-tests-23:classes UP-TO-DATE
> Task :streams:upgrade-system-tests-23:checkstyleMain NO-SOURCE
> Task :streams:upgrade-system-tests-23:compileTestJava
> Task :streams:upgrade-system-tests-23:processTestResources NO-SOURCE
> Task :streams:upgrade-system-tests-23:testClasses
> Task :streams:upgrade-system-tests-23:checkstyleTest
> Task :streams:upgrade-system-tests-23:spotbugsMain NO-SOURCE
> Task :streams:upgrade-system-tests-23:test
> Task :streams:upgrade-system-tests-24:compileJava NO-SOURCE
> Task :streams:upgrade-system-tests-24:processResources NO-SOURCE
> Task :streams:upgrade-system-tests-24:classes UP-TO-DATE
> Task :streams:upgrade-system-tests-24:checkstyleMain NO-SOURCE
> Task :streams:upgrade-system-tests-24:compileTestJava
> Task :streams:upgrade-system-tests-24:processTestResources NO-SOURCE
> Task :streams:upgrade-system-tests-24:testClasses
> Task :streams:upgrade-system-tests-24:checkstyleTest
> Task :streams:upgrade-system-tests-24:spotbugsMain NO-SOURCE
> Task :streams:upgrade-system-tests-24:test
> Task :streams:upgrade-system-tests-25:compileJava NO-SOURCE
> Task :streams:upgrade-system-tests-25:processResources NO-SOURCE
> Task :streams:upgrade-system-tests-25:classes UP-TO-DATE
> Task :streams:upgrade-system-tests-25:checkstyleMain NO-SOURCE
> Task :streams:upgrade-system-tests-25:compileTestJava
> Task :streams:upgrade-system-tests-25:processTestResources NO-SOURCE
> Task :streams:upgrade-system-tests-25:testClasses
> Task :streams:upgrade-system-tests-25:checkstyleTest
> Task :streams:upgrade-system-tests-25:spotbugsMain NO-SOURCE
> Task :streams:upgrade-system-tests-25:test
FAILURE: Build failed with an exception.
* What went wrong:
Execution failed for task ':clients:test'.
> There were failing tests. See the report at: file://<https://builds.apache.org/job/kafka-trunk-jdk14/ws/clients/build/reports/tests/test/index.html>
* Try:
Run with --stacktrace option to get the stack trace. Run with --info or --debug option to get more log output. Run with --scan to get full insights.
* Get more help at https://help.gradle.org
Deprecated Gradle features were used in this build, making it incompatible with Gradle 7.0.
Use '--warning-mode all' to show the individual deprecation warnings.
See https://docs.gradle.org/6.4.1/userguide/command_line_interface.html#sec:command_line_warnings
BUILD FAILED in 1h 54m 21s
215 actionable tasks: 183 executed, 32 up-to-date
Build step 'Execute shell' marked build as failure
Recording test results
ERROR: No tool found matching GRADLE_4_10_2_HOME
Setting GRADLE_4_10_3_HOME=/home/jenkins/tools/gradle/4.10.3
ERROR: No tool found matching GRADLE_4_10_2_HOME
Setting GRADLE_4_10_3_HOME=/home/jenkins/tools/gradle/4.10.3
Not sending mail to unregistered user noreply@github.com
Build failed in Jenkins: kafka-trunk-jdk14 #161
Posted by Apache Jenkins Server <je...@builds.apache.org>.
See <https://builds.apache.org/job/kafka-trunk-jdk14/161/display/redirect?page=changes>
Changes:
[github] MINOR: Remove unused variable to fix spotBugs failure (#8779)
[github] KAFKA-10082: Fix the failed testMultiConsumerStickyAssignment (#8777)
------------------------------------------
[...truncated 3.15 MB...]
org.apache.kafka.streams.TopologyTestDriverTest > shouldCaptureGlobalTopicNameIfWrittenInto[Eos enabled = false] STARTED
org.apache.kafka.streams.TopologyTestDriverTest > shouldCaptureGlobalTopicNameIfWrittenInto[Eos enabled = false] PASSED
org.apache.kafka.streams.TopologyTestDriverTest > shouldThrowIfInMemoryBuiltInStoreIsAccessedWithUntypedMethod[Eos enabled = false] STARTED
org.apache.kafka.streams.TopologyTestDriverTest > shouldThrowIfInMemoryBuiltInStoreIsAccessedWithUntypedMethod[Eos enabled = false] PASSED
org.apache.kafka.streams.TopologyTestDriverTest > shouldProcessFromSourcesThatMatchMultiplePattern[Eos enabled = false] STARTED
org.apache.kafka.streams.TopologyTestDriverTest > shouldProcessFromSourcesThatMatchMultiplePattern[Eos enabled = false] PASSED
org.apache.kafka.streams.TopologyTestDriverTest > shouldPopulateGlobalStore[Eos enabled = false] STARTED
org.apache.kafka.streams.TopologyTestDriverTest > shouldPopulateGlobalStore[Eos enabled = false] PASSED
org.apache.kafka.streams.TopologyTestDriverTest > shouldThrowIfPersistentBuiltInStoreIsAccessedWithUntypedMethod[Eos enabled = false] STARTED
org.apache.kafka.streams.TopologyTestDriverTest > shouldThrowIfPersistentBuiltInStoreIsAccessedWithUntypedMethod[Eos enabled = false] PASSED
org.apache.kafka.streams.TopologyTestDriverTest > shouldAllowPrePopulatingStatesStoresWithCachingEnabled[Eos enabled = false] STARTED
org.apache.kafka.streams.TopologyTestDriverTest > shouldAllowPrePopulatingStatesStoresWithCachingEnabled[Eos enabled = false] PASSED
org.apache.kafka.streams.TopologyTestDriverTest > shouldReturnCorrectPersistentStoreTypeOnly[Eos enabled = false] STARTED
org.apache.kafka.streams.TopologyTestDriverTest > shouldReturnCorrectPersistentStoreTypeOnly[Eos enabled = false] PASSED
org.apache.kafka.streams.TopologyTestDriverTest > shouldRespectTaskIdling[Eos enabled = false] STARTED
org.apache.kafka.streams.TopologyTestDriverTest > shouldRespectTaskIdling[Eos enabled = false] PASSED
org.apache.kafka.streams.TopologyTestDriverTest > shouldUseSourceSpecificDeserializers[Eos enabled = false] STARTED
org.apache.kafka.streams.TopologyTestDriverTest > shouldUseSourceSpecificDeserializers[Eos enabled = false] PASSED
org.apache.kafka.streams.TopologyTestDriverTest > shouldReturnAllStores[Eos enabled = false] STARTED
org.apache.kafka.streams.TopologyTestDriverTest > shouldReturnAllStores[Eos enabled = false] PASSED
org.apache.kafka.streams.TopologyTestDriverTest > shouldNotCreateStateDirectoryForStatelessTopology[Eos enabled = false] STARTED
org.apache.kafka.streams.TopologyTestDriverTest > shouldNotCreateStateDirectoryForStatelessTopology[Eos enabled = false] PASSED
org.apache.kafka.streams.TopologyTestDriverTest > shouldApplyGlobalUpdatesCorrectlyInRecursiveTopologies[Eos enabled = false] STARTED
org.apache.kafka.streams.TopologyTestDriverTest > shouldApplyGlobalUpdatesCorrectlyInRecursiveTopologies[Eos enabled = false] PASSED
org.apache.kafka.streams.TopologyTestDriverTest > shouldReturnAllStoresNames[Eos enabled = false] STARTED
org.apache.kafka.streams.TopologyTestDriverTest > shouldReturnAllStoresNames[Eos enabled = false] PASSED
org.apache.kafka.streams.TopologyTestDriverTest > shouldProcessConsumerRecordList[Eos enabled = false] STARTED
org.apache.kafka.streams.TopologyTestDriverTest > shouldProcessConsumerRecordList[Eos enabled = false] PASSED
org.apache.kafka.streams.TopologyTestDriverTest > shouldUseSinkSpecificSerializers[Eos enabled = false] STARTED
org.apache.kafka.streams.TopologyTestDriverTest > shouldUseSinkSpecificSerializers[Eos enabled = false] PASSED
org.apache.kafka.streams.TopologyTestDriverTest > shouldFlushStoreForFirstInput[Eos enabled = false] STARTED
org.apache.kafka.streams.TopologyTestDriverTest > shouldFlushStoreForFirstInput[Eos enabled = false] PASSED
org.apache.kafka.streams.TopologyTestDriverTest > shouldProcessFromSourceThatMatchPattern[Eos enabled = false] STARTED
org.apache.kafka.streams.TopologyTestDriverTest > shouldProcessFromSourceThatMatchPattern[Eos enabled = false] PASSED
org.apache.kafka.streams.TopologyTestDriverTest > shouldCaptureSinkTopicNamesIfWrittenInto[Eos enabled = false] STARTED
org.apache.kafka.streams.TopologyTestDriverTest > shouldCaptureSinkTopicNamesIfWrittenInto[Eos enabled = false] PASSED
org.apache.kafka.streams.TopologyTestDriverTest > shouldUpdateStoreForNewKey[Eos enabled = false] STARTED
org.apache.kafka.streams.TopologyTestDriverTest > shouldUpdateStoreForNewKey[Eos enabled = false] PASSED
org.apache.kafka.streams.TopologyTestDriverTest > shouldSendRecordViaCorrectSourceTopicDeprecated[Eos enabled = false] STARTED
org.apache.kafka.streams.TopologyTestDriverTest > shouldSendRecordViaCorrectSourceTopicDeprecated[Eos enabled = false] PASSED
org.apache.kafka.streams.TopologyTestDriverTest > shouldPunctuateOnWallClockTime[Eos enabled = false] STARTED
org.apache.kafka.streams.TopologyTestDriverTest > shouldPunctuateOnWallClockTime[Eos enabled = false] PASSED
org.apache.kafka.streams.TopologyTestDriverTest > shouldSetRecordMetadata[Eos enabled = false] STARTED
org.apache.kafka.streams.TopologyTestDriverTest > shouldSetRecordMetadata[Eos enabled = false] PASSED
org.apache.kafka.streams.TopologyTestDriverTest > shouldNotUpdateStoreForLargerValue[Eos enabled = false] STARTED
org.apache.kafka.streams.TopologyTestDriverTest > shouldNotUpdateStoreForLargerValue[Eos enabled = false] PASSED
org.apache.kafka.streams.TopologyTestDriverTest > shouldReturnCorrectInMemoryStoreTypeOnly[Eos enabled = false] STARTED
org.apache.kafka.streams.TopologyTestDriverTest > shouldReturnCorrectInMemoryStoreTypeOnly[Eos enabled = false] PASSED
org.apache.kafka.streams.TopologyTestDriverTest > shouldThrowForMissingTime[Eos enabled = false] STARTED
org.apache.kafka.streams.TopologyTestDriverTest > shouldThrowForMissingTime[Eos enabled = false] PASSED
org.apache.kafka.streams.TopologyTestDriverTest > shouldCaptureInternalTopicNamesIfWrittenInto[Eos enabled = false] STARTED
org.apache.kafka.streams.TopologyTestDriverTest > shouldCaptureInternalTopicNamesIfWrittenInto[Eos enabled = false] PASSED
org.apache.kafka.streams.TopologyTestDriverTest > shouldPunctuateOnWallClockTimeDeprecated[Eos enabled = false] STARTED
org.apache.kafka.streams.TopologyTestDriverTest > shouldPunctuateOnWallClockTimeDeprecated[Eos enabled = false] PASSED
org.apache.kafka.streams.TopologyTestDriverTest > shouldProcessRecordForTopic[Eos enabled = false] STARTED
org.apache.kafka.streams.TopologyTestDriverTest > shouldProcessRecordForTopic[Eos enabled = false] PASSED
org.apache.kafka.streams.TopologyTestDriverTest > shouldForwardRecordsFromSubtopologyToSubtopology[Eos enabled = false] STARTED
org.apache.kafka.streams.TopologyTestDriverTest > shouldForwardRecordsFromSubtopologyToSubtopology[Eos enabled = false] PASSED
org.apache.kafka.streams.TopologyTestDriverTest > shouldNotUpdateStoreForSmallerValue[Eos enabled = false] STARTED
org.apache.kafka.streams.TopologyTestDriverTest > shouldNotUpdateStoreForSmallerValue[Eos enabled = false] PASSED
org.apache.kafka.streams.TopologyTestDriverTest > shouldCreateStateDirectoryForStatefulTopology[Eos enabled = false] STARTED
org.apache.kafka.streams.TopologyTestDriverTest > shouldCreateStateDirectoryForStatefulTopology[Eos enabled = false] PASSED
org.apache.kafka.streams.TopologyTestDriverTest > shouldPunctuateIfWallClockTimeAdvances[Eos enabled = false] STARTED
org.apache.kafka.streams.TopologyTestDriverTest > shouldPunctuateIfWallClockTimeAdvances[Eos enabled = false] PASSED
> Task :streams:upgrade-system-tests-0102:processTestResources NO-SOURCE
> Task :streams:upgrade-system-tests-0102:testClasses
> Task :streams:upgrade-system-tests-0102:checkstyleTest
> Task :streams:upgrade-system-tests-0102:spotbugsMain NO-SOURCE
> Task :streams:upgrade-system-tests-0102:test
> Task :streams:upgrade-system-tests-0110:compileJava NO-SOURCE
> Task :streams:upgrade-system-tests-0110:processResources NO-SOURCE
> Task :streams:upgrade-system-tests-0110:classes UP-TO-DATE
> Task :streams:upgrade-system-tests-0110:checkstyleMain NO-SOURCE
> Task :streams:upgrade-system-tests-0110:compileTestJava
> Task :streams:upgrade-system-tests-0110:processTestResources NO-SOURCE
> Task :streams:upgrade-system-tests-0110:testClasses
> Task :streams:upgrade-system-tests-0110:checkstyleTest
> Task :streams:upgrade-system-tests-0110:spotbugsMain NO-SOURCE
> Task :streams:upgrade-system-tests-0110:test
> Task :streams:upgrade-system-tests-10:compileJava NO-SOURCE
> Task :streams:upgrade-system-tests-10:processResources NO-SOURCE
> Task :streams:upgrade-system-tests-10:classes UP-TO-DATE
> Task :streams:upgrade-system-tests-10:checkstyleMain NO-SOURCE
> Task :streams:upgrade-system-tests-10:compileTestJava
> Task :streams:upgrade-system-tests-10:processTestResources NO-SOURCE
> Task :streams:upgrade-system-tests-10:testClasses
> Task :streams:upgrade-system-tests-10:checkstyleTest
> Task :streams:upgrade-system-tests-10:spotbugsMain NO-SOURCE
> Task :streams:upgrade-system-tests-10:test
> Task :streams:upgrade-system-tests-11:compileJava NO-SOURCE
> Task :streams:upgrade-system-tests-11:processResources NO-SOURCE
> Task :streams:upgrade-system-tests-11:classes UP-TO-DATE
> Task :streams:upgrade-system-tests-11:checkstyleMain NO-SOURCE
> Task :streams:upgrade-system-tests-11:compileTestJava
> Task :streams:upgrade-system-tests-11:processTestResources NO-SOURCE
> Task :streams:upgrade-system-tests-11:testClasses
> Task :streams:upgrade-system-tests-11:checkstyleTest
> Task :streams:upgrade-system-tests-11:spotbugsMain NO-SOURCE
> Task :streams:upgrade-system-tests-11:test
> Task :streams:upgrade-system-tests-20:compileJava NO-SOURCE
> Task :streams:upgrade-system-tests-20:processResources NO-SOURCE
> Task :streams:upgrade-system-tests-20:classes UP-TO-DATE
> Task :streams:upgrade-system-tests-20:checkstyleMain NO-SOURCE
> Task :streams:upgrade-system-tests-20:compileTestJava
> Task :streams:upgrade-system-tests-20:processTestResources NO-SOURCE
> Task :streams:upgrade-system-tests-20:testClasses
> Task :streams:upgrade-system-tests-20:checkstyleTest
> Task :streams:upgrade-system-tests-20:spotbugsMain NO-SOURCE
> Task :streams:upgrade-system-tests-20:test
> Task :streams:upgrade-system-tests-21:compileJava NO-SOURCE
> Task :streams:upgrade-system-tests-21:processResources NO-SOURCE
> Task :streams:upgrade-system-tests-21:classes UP-TO-DATE
> Task :streams:upgrade-system-tests-21:checkstyleMain NO-SOURCE
> Task :streams:upgrade-system-tests-21:compileTestJava
> Task :streams:upgrade-system-tests-21:processTestResources NO-SOURCE
> Task :streams:upgrade-system-tests-21:testClasses
> Task :streams:upgrade-system-tests-21:checkstyleTest
> Task :streams:upgrade-system-tests-21:spotbugsMain NO-SOURCE
> Task :streams:upgrade-system-tests-21:test
> Task :streams:upgrade-system-tests-22:compileJava NO-SOURCE
> Task :streams:upgrade-system-tests-22:processResources NO-SOURCE
> Task :streams:upgrade-system-tests-22:classes UP-TO-DATE
> Task :streams:upgrade-system-tests-22:checkstyleMain NO-SOURCE
> Task :streams:upgrade-system-tests-22:compileTestJava
> Task :streams:upgrade-system-tests-22:processTestResources NO-SOURCE
> Task :streams:upgrade-system-tests-22:testClasses
> Task :streams:upgrade-system-tests-22:checkstyleTest
> Task :streams:upgrade-system-tests-22:spotbugsMain NO-SOURCE
> Task :streams:upgrade-system-tests-22:test
> Task :streams:upgrade-system-tests-23:compileJava NO-SOURCE
> Task :streams:upgrade-system-tests-23:processResources NO-SOURCE
> Task :streams:upgrade-system-tests-23:classes UP-TO-DATE
> Task :streams:upgrade-system-tests-23:checkstyleMain NO-SOURCE
> Task :streams:upgrade-system-tests-23:compileTestJava
> Task :streams:upgrade-system-tests-23:processTestResources NO-SOURCE
> Task :streams:upgrade-system-tests-23:testClasses
> Task :streams:upgrade-system-tests-23:checkstyleTest
> Task :streams:upgrade-system-tests-23:spotbugsMain NO-SOURCE
> Task :streams:upgrade-system-tests-23:test
> Task :streams:upgrade-system-tests-24:compileJava NO-SOURCE
> Task :streams:upgrade-system-tests-24:processResources NO-SOURCE
> Task :streams:upgrade-system-tests-24:classes UP-TO-DATE
> Task :streams:upgrade-system-tests-24:checkstyleMain NO-SOURCE
> Task :streams:upgrade-system-tests-24:compileTestJava
> Task :streams:upgrade-system-tests-24:processTestResources NO-SOURCE
> Task :streams:upgrade-system-tests-24:testClasses
> Task :streams:upgrade-system-tests-24:checkstyleTest
> Task :streams:upgrade-system-tests-24:spotbugsMain NO-SOURCE
> Task :streams:upgrade-system-tests-24:test
> Task :streams:upgrade-system-tests-25:compileJava NO-SOURCE
> Task :streams:upgrade-system-tests-25:processResources NO-SOURCE
> Task :streams:upgrade-system-tests-25:classes UP-TO-DATE
> Task :streams:upgrade-system-tests-25:checkstyleMain NO-SOURCE
> Task :streams:upgrade-system-tests-25:compileTestJava
> Task :streams:upgrade-system-tests-25:processTestResources NO-SOURCE
> Task :streams:upgrade-system-tests-25:testClasses
> Task :streams:upgrade-system-tests-25:checkstyleTest
> Task :streams:upgrade-system-tests-25:spotbugsMain NO-SOURCE
> Task :streams:upgrade-system-tests-25:test
FAILURE: Build failed with an exception.
* What went wrong:
Execution failed for task ':clients:test'.
> There were failing tests. See the report at: file://<https://builds.apache.org/job/kafka-trunk-jdk14/ws/clients/build/reports/tests/test/index.html>
* Try:
Run with --stacktrace option to get the stack trace. Run with --info or --debug option to get more log output. Run with --scan to get full insights.
* Get more help at https://help.gradle.org
Deprecated Gradle features were used in this build, making it incompatible with Gradle 7.0.
Use '--warning-mode all' to show the individual deprecation warnings.
See https://docs.gradle.org/6.4.1/userguide/command_line_interface.html#sec:command_line_warnings
BUILD FAILED in 2h 1m 31s
215 actionable tasks: 183 executed, 32 up-to-date
Build step 'Execute shell' marked build as failure
Recording test results
ERROR: No tool found matching GRADLE_4_10_2_HOME
Setting GRADLE_4_10_3_HOME=/home/jenkins/tools/gradle/4.10.3
ERROR: No tool found matching GRADLE_4_10_2_HOME
Setting GRADLE_4_10_3_HOME=/home/jenkins/tools/gradle/4.10.3
Not sending mail to unregistered user noreply@github.com
Build failed in Jenkins: kafka-trunk-jdk14 #160
Posted by Apache Jenkins Server <je...@builds.apache.org>.
See <https://builds.apache.org/job/kafka-trunk-jdk14/160/display/redirect?page=changes>
Changes:
[github] MINOR: ChangelogReader should poll for duration 0 for standby restore
------------------------------------------
[...truncated 1.74 MB...]
org.apache.kafka.streams.TopologyTestDriverTest > shouldRespectTaskIdling[Eos enabled = false] PASSED
org.apache.kafka.streams.TopologyTestDriverTest > shouldUseSourceSpecificDeserializers[Eos enabled = false] STARTED
org.apache.kafka.streams.TopologyTestDriverTest > shouldUseSourceSpecificDeserializers[Eos enabled = false] PASSED
org.apache.kafka.streams.TopologyTestDriverTest > shouldReturnAllStores[Eos enabled = false] STARTED
org.apache.kafka.streams.TopologyTestDriverTest > shouldReturnAllStores[Eos enabled = false] PASSED
org.apache.kafka.streams.TopologyTestDriverTest > shouldNotCreateStateDirectoryForStatelessTopology[Eos enabled = false] STARTED
org.apache.kafka.streams.TopologyTestDriverTest > shouldNotCreateStateDirectoryForStatelessTopology[Eos enabled = false] PASSED
org.apache.kafka.streams.TopologyTestDriverTest > shouldApplyGlobalUpdatesCorrectlyInRecursiveTopologies[Eos enabled = false] STARTED
org.apache.kafka.streams.TopologyTestDriverTest > shouldApplyGlobalUpdatesCorrectlyInRecursiveTopologies[Eos enabled = false] PASSED
org.apache.kafka.streams.TopologyTestDriverTest > shouldReturnAllStoresNames[Eos enabled = false] STARTED
org.apache.kafka.streams.TopologyTestDriverTest > shouldReturnAllStoresNames[Eos enabled = false] PASSED
org.apache.kafka.streams.TopologyTestDriverTest > shouldProcessConsumerRecordList[Eos enabled = false] STARTED
org.apache.kafka.streams.TopologyTestDriverTest > shouldProcessConsumerRecordList[Eos enabled = false] PASSED
org.apache.kafka.streams.TopologyTestDriverTest > shouldUseSinkSpecificSerializers[Eos enabled = false] STARTED
org.apache.kafka.streams.TopologyTestDriverTest > shouldUseSinkSpecificSerializers[Eos enabled = false] PASSED
org.apache.kafka.streams.TopologyTestDriverTest > shouldFlushStoreForFirstInput[Eos enabled = false] STARTED
org.apache.kafka.streams.TopologyTestDriverTest > shouldFlushStoreForFirstInput[Eos enabled = false] PASSED
org.apache.kafka.streams.TopologyTestDriverTest > shouldProcessFromSourceThatMatchPattern[Eos enabled = false] STARTED
org.apache.kafka.streams.TopologyTestDriverTest > shouldProcessFromSourceThatMatchPattern[Eos enabled = false] PASSED
org.apache.kafka.streams.TopologyTestDriverTest > shouldCaptureSinkTopicNamesIfWrittenInto[Eos enabled = false] STARTED
org.apache.kafka.streams.TopologyTestDriverTest > shouldCaptureSinkTopicNamesIfWrittenInto[Eos enabled = false] PASSED
org.apache.kafka.streams.TopologyTestDriverTest > shouldUpdateStoreForNewKey[Eos enabled = false] STARTED
org.apache.kafka.streams.TopologyTestDriverTest > shouldUpdateStoreForNewKey[Eos enabled = false] PASSED
org.apache.kafka.streams.TopologyTestDriverTest > shouldSendRecordViaCorrectSourceTopicDeprecated[Eos enabled = false] STARTED
org.apache.kafka.streams.TopologyTestDriverTest > shouldSendRecordViaCorrectSourceTopicDeprecated[Eos enabled = false] PASSED
org.apache.kafka.streams.TopologyTestDriverTest > shouldPunctuateOnWallClockTime[Eos enabled = false] STARTED
org.apache.kafka.streams.TopologyTestDriverTest > shouldPunctuateOnWallClockTime[Eos enabled = false] PASSED
org.apache.kafka.streams.TopologyTestDriverTest > shouldSetRecordMetadata[Eos enabled = false] STARTED
org.apache.kafka.streams.TopologyTestDriverTest > shouldSetRecordMetadata[Eos enabled = false] PASSED
org.apache.kafka.streams.TopologyTestDriverTest > shouldNotUpdateStoreForLargerValue[Eos enabled = false] STARTED
org.apache.kafka.streams.TopologyTestDriverTest > shouldNotUpdateStoreForLargerValue[Eos enabled = false] PASSED
org.apache.kafka.streams.TopologyTestDriverTest > shouldReturnCorrectInMemoryStoreTypeOnly[Eos enabled = false] STARTED
org.apache.kafka.streams.TopologyTestDriverTest > shouldReturnCorrectInMemoryStoreTypeOnly[Eos enabled = false] PASSED
org.apache.kafka.streams.TopologyTestDriverTest > shouldThrowForMissingTime[Eos enabled = false] STARTED
org.apache.kafka.streams.TopologyTestDriverTest > shouldThrowForMissingTime[Eos enabled = false] PASSED
org.apache.kafka.streams.TopologyTestDriverTest > shouldCaptureInternalTopicNamesIfWrittenInto[Eos enabled = false] STARTED
org.apache.kafka.streams.TopologyTestDriverTest > shouldCaptureInternalTopicNamesIfWrittenInto[Eos enabled = false] PASSED
org.apache.kafka.streams.TopologyTestDriverTest > shouldPunctuateOnWallClockTimeDeprecated[Eos enabled = false] STARTED
org.apache.kafka.streams.TopologyTestDriverTest > shouldPunctuateOnWallClockTimeDeprecated[Eos enabled = false] PASSED
org.apache.kafka.streams.TopologyTestDriverTest > shouldProcessRecordForTopic[Eos enabled = false] STARTED
org.apache.kafka.streams.TopologyTestDriverTest > shouldProcessRecordForTopic[Eos enabled = false] PASSED
org.apache.kafka.streams.TopologyTestDriverTest > shouldForwardRecordsFromSubtopologyToSubtopology[Eos enabled = false] STARTED
org.apache.kafka.streams.TopologyTestDriverTest > shouldForwardRecordsFromSubtopologyToSubtopology[Eos enabled = false] PASSED
org.apache.kafka.streams.TopologyTestDriverTest > shouldNotUpdateStoreForSmallerValue[Eos enabled = false] STARTED
org.apache.kafka.streams.TopologyTestDriverTest > shouldNotUpdateStoreForSmallerValue[Eos enabled = false] PASSED
org.apache.kafka.streams.TopologyTestDriverTest > shouldCreateStateDirectoryForStatefulTopology[Eos enabled = false] STARTED
org.apache.kafka.streams.TopologyTestDriverTest > shouldCreateStateDirectoryForStatefulTopology[Eos enabled = false] PASSED
org.apache.kafka.streams.TopologyTestDriverTest > shouldPunctuateIfWallClockTimeAdvances[Eos enabled = false] STARTED
org.apache.kafka.streams.TopologyTestDriverTest > shouldPunctuateIfWallClockTimeAdvances[Eos enabled = false] PASSED
> Task :streams:upgrade-system-tests-0100:spotbugsMain NO-SOURCE
> Task :streams:upgrade-system-tests-0100:test
> Task :streams:upgrade-system-tests-0101:compileJava NO-SOURCE
> Task :streams:upgrade-system-tests-0101:processResources NO-SOURCE
> Task :streams:upgrade-system-tests-0101:classes UP-TO-DATE
> Task :streams:upgrade-system-tests-0101:checkstyleMain NO-SOURCE
> Task :streams:upgrade-system-tests-0101:compileTestJava
> Task :streams:upgrade-system-tests-0101:processTestResources NO-SOURCE
> Task :streams:upgrade-system-tests-0101:testClasses
> Task :streams:upgrade-system-tests-0101:checkstyleTest
> Task :streams:upgrade-system-tests-0101:spotbugsMain NO-SOURCE
> Task :streams:upgrade-system-tests-0101:test
> Task :streams:upgrade-system-tests-0102:compileJava NO-SOURCE
> Task :streams:upgrade-system-tests-0102:processResources NO-SOURCE
> Task :streams:upgrade-system-tests-0102:classes UP-TO-DATE
> Task :streams:upgrade-system-tests-0102:checkstyleMain NO-SOURCE
> Task :streams:upgrade-system-tests-0102:compileTestJava
> Task :streams:upgrade-system-tests-0102:processTestResources NO-SOURCE
> Task :streams:upgrade-system-tests-0102:testClasses
> Task :streams:upgrade-system-tests-0102:checkstyleTest
> Task :streams:upgrade-system-tests-0102:spotbugsMain NO-SOURCE
> Task :streams:upgrade-system-tests-0102:test
> Task :streams:upgrade-system-tests-0110:compileJava NO-SOURCE
> Task :streams:upgrade-system-tests-0110:processResources NO-SOURCE
> Task :streams:upgrade-system-tests-0110:classes UP-TO-DATE
> Task :streams:upgrade-system-tests-0110:checkstyleMain NO-SOURCE
> Task :streams:upgrade-system-tests-0110:compileTestJava
> Task :streams:upgrade-system-tests-0110:processTestResources NO-SOURCE
> Task :streams:upgrade-system-tests-0110:testClasses
> Task :streams:upgrade-system-tests-0110:checkstyleTest
> Task :streams:upgrade-system-tests-0110:spotbugsMain NO-SOURCE
> Task :streams:upgrade-system-tests-0110:test
> Task :streams:upgrade-system-tests-10:compileJava NO-SOURCE
> Task :streams:upgrade-system-tests-10:processResources NO-SOURCE
> Task :streams:upgrade-system-tests-10:classes UP-TO-DATE
> Task :streams:upgrade-system-tests-10:checkstyleMain NO-SOURCE
> Task :streams:upgrade-system-tests-10:compileTestJava
> Task :streams:upgrade-system-tests-10:processTestResources NO-SOURCE
> Task :streams:upgrade-system-tests-10:testClasses
> Task :streams:upgrade-system-tests-10:checkstyleTest
> Task :streams:upgrade-system-tests-10:spotbugsMain NO-SOURCE
> Task :streams:upgrade-system-tests-10:test
> Task :streams:upgrade-system-tests-11:compileJava NO-SOURCE
> Task :streams:upgrade-system-tests-11:processResources NO-SOURCE
> Task :streams:upgrade-system-tests-11:classes UP-TO-DATE
> Task :streams:upgrade-system-tests-11:checkstyleMain NO-SOURCE
> Task :streams:upgrade-system-tests-11:compileTestJava
> Task :streams:upgrade-system-tests-11:processTestResources NO-SOURCE
> Task :streams:upgrade-system-tests-11:testClasses
> Task :streams:upgrade-system-tests-11:checkstyleTest
> Task :streams:upgrade-system-tests-11:spotbugsMain NO-SOURCE
> Task :streams:upgrade-system-tests-11:test
> Task :streams:upgrade-system-tests-20:compileJava NO-SOURCE
> Task :streams:upgrade-system-tests-20:processResources NO-SOURCE
> Task :streams:upgrade-system-tests-20:classes UP-TO-DATE
> Task :streams:upgrade-system-tests-20:checkstyleMain NO-SOURCE
> Task :streams:upgrade-system-tests-20:compileTestJava
> Task :streams:upgrade-system-tests-20:processTestResources NO-SOURCE
> Task :streams:upgrade-system-tests-20:testClasses
> Task :streams:upgrade-system-tests-20:checkstyleTest
> Task :streams:upgrade-system-tests-20:spotbugsMain NO-SOURCE
> Task :streams:upgrade-system-tests-20:test
> Task :streams:upgrade-system-tests-21:compileJava NO-SOURCE
> Task :streams:upgrade-system-tests-21:processResources NO-SOURCE
> Task :streams:upgrade-system-tests-21:classes UP-TO-DATE
> Task :streams:upgrade-system-tests-21:checkstyleMain NO-SOURCE
> Task :streams:upgrade-system-tests-21:compileTestJava
> Task :streams:upgrade-system-tests-21:processTestResources NO-SOURCE
> Task :streams:upgrade-system-tests-21:testClasses
> Task :streams:upgrade-system-tests-21:checkstyleTest
> Task :streams:upgrade-system-tests-21:spotbugsMain NO-SOURCE
> Task :streams:upgrade-system-tests-21:test
> Task :streams:upgrade-system-tests-22:compileJava NO-SOURCE
> Task :streams:upgrade-system-tests-22:processResources NO-SOURCE
> Task :streams:upgrade-system-tests-22:classes UP-TO-DATE
> Task :streams:upgrade-system-tests-22:checkstyleMain NO-SOURCE
> Task :streams:upgrade-system-tests-22:compileTestJava
> Task :streams:upgrade-system-tests-22:processTestResources NO-SOURCE
> Task :streams:upgrade-system-tests-22:testClasses
> Task :streams:upgrade-system-tests-22:checkstyleTest
> Task :streams:upgrade-system-tests-22:spotbugsMain NO-SOURCE
> Task :streams:upgrade-system-tests-22:test
> Task :streams:upgrade-system-tests-23:compileJava NO-SOURCE
> Task :streams:upgrade-system-tests-23:processResources NO-SOURCE
> Task :streams:upgrade-system-tests-23:classes UP-TO-DATE
> Task :streams:upgrade-system-tests-23:checkstyleMain NO-SOURCE
> Task :streams:upgrade-system-tests-23:compileTestJava
> Task :streams:upgrade-system-tests-23:processTestResources NO-SOURCE
> Task :streams:upgrade-system-tests-23:testClasses
> Task :streams:upgrade-system-tests-23:checkstyleTest
> Task :streams:upgrade-system-tests-23:spotbugsMain NO-SOURCE
> Task :streams:upgrade-system-tests-23:test
> Task :streams:upgrade-system-tests-24:compileJava NO-SOURCE
> Task :streams:upgrade-system-tests-24:processResources NO-SOURCE
> Task :streams:upgrade-system-tests-24:classes UP-TO-DATE
> Task :streams:upgrade-system-tests-24:checkstyleMain NO-SOURCE
> Task :streams:upgrade-system-tests-24:compileTestJava
> Task :streams:upgrade-system-tests-24:processTestResources NO-SOURCE
> Task :streams:upgrade-system-tests-24:testClasses
> Task :streams:upgrade-system-tests-24:checkstyleTest
> Task :streams:upgrade-system-tests-24:spotbugsMain NO-SOURCE
> Task :streams:upgrade-system-tests-24:test
> Task :streams:upgrade-system-tests-25:compileJava NO-SOURCE
> Task :streams:upgrade-system-tests-25:processResources NO-SOURCE
> Task :streams:upgrade-system-tests-25:classes UP-TO-DATE
> Task :streams:upgrade-system-tests-25:checkstyleMain NO-SOURCE
> Task :streams:upgrade-system-tests-25:compileTestJava
> Task :streams:upgrade-system-tests-25:processTestResources NO-SOURCE
> Task :streams:upgrade-system-tests-25:testClasses
> Task :streams:upgrade-system-tests-25:checkstyleTest
> Task :streams:upgrade-system-tests-25:spotbugsMain NO-SOURCE
> Task :streams:upgrade-system-tests-25:test
FAILURE: Build completed with 2 failures.
1: Task failed with an exception.
-----------
* What went wrong:
Execution failed for task ':clients:spotbugsMain'.
> A failure occurred while executing com.github.spotbugs.snom.internal.SpotBugsRunnerForWorker$SpotBugsExecutor
> Verification failed: SpotBugs execution thrown exception
* Try:
Run with --stacktrace option to get the stack trace. Run with --info or --debug option to get more log output. Run with --scan to get full insights.
==============================================================================
2: Task failed with an exception.
-----------
* What went wrong:
Execution failed for task ':core:test'.
> There were failing tests. See the report at: file://<https://builds.apache.org/job/kafka-trunk-jdk14/ws/core/build/reports/tests/test/index.html>
* Try:
Run with --stacktrace option to get the stack trace. Run with --info or --debug option to get more log output. Run with --scan to get full insights.
==============================================================================
* Get more help at https://help.gradle.org
Deprecated Gradle features were used in this build, making it incompatible with Gradle 7.0.
Use '--warning-mode all' to show the individual deprecation warnings.
See https://docs.gradle.org/6.4.1/userguide/command_line_interface.html#sec:command_line_warnings
BUILD FAILED in 1h 41m 22s
214 actionable tasks: 182 executed, 32 up-to-date
Build step 'Execute shell' marked build as failure
Recording test results
ERROR: No tool found matching GRADLE_4_10_2_HOME
Setting GRADLE_4_10_3_HOME=/home/jenkins/tools/gradle/4.10.3
ERROR: No tool found matching GRADLE_4_10_2_HOME
Setting GRADLE_4_10_3_HOME=/home/jenkins/tools/gradle/4.10.3
Not sending mail to unregistered user noreply@github.com
Build failed in Jenkins: kafka-trunk-jdk14 #159
Posted by Apache Jenkins Server <je...@builds.apache.org>.
See <https://builds.apache.org/job/kafka-trunk-jdk14/159/display/redirect>
Changes:
------------------------------------------
Started by an SCM change
Running as SYSTEM
[EnvInject] - Loading node environment variables.
Building remotely on H23 (ubuntu) in workspace <https://builds.apache.org/job/kafka-trunk-jdk14/ws/>
[WS-CLEANUP] Deleting project workspace...
[WS-CLEANUP] Deferred wipeout is used...
[WS-CLEANUP] Done
No credentials specified
Cloning the remote Git repository
Cloning repository https://github.com/apache/kafka.git
> git init <https://builds.apache.org/job/kafka-trunk-jdk14/ws/> # timeout=10
ERROR: Error cloning remote repo 'origin'
hudson.plugins.git.GitException: Could not init <https://builds.apache.org/job/kafka-trunk-jdk14/ws/>
at org.jenkinsci.plugins.gitclient.CliGitAPIImpl$5.execute(CliGitAPIImpl.java:916)
at org.jenkinsci.plugins.gitclient.CliGitAPIImpl$2.execute(CliGitAPIImpl.java:708)
at org.jenkinsci.plugins.gitclient.RemoteGitImpl$CommandInvocationHandler$1.call(RemoteGitImpl.java:153)
at org.jenkinsci.plugins.gitclient.RemoteGitImpl$CommandInvocationHandler$1.call(RemoteGitImpl.java:146)
at hudson.remoting.UserRequest.perform(UserRequest.java:212)
at hudson.remoting.UserRequest.perform(UserRequest.java:54)
at hudson.remoting.Request$2.run(Request.java:369)
at hudson.remoting.InterceptingExecutorService$1.call(InterceptingExecutorService.java:72)
at java.util.concurrent.FutureTask.run(FutureTask.java:266)
at java.util.concurrent.ThreadPoolExecutor.runWorker(ThreadPoolExecutor.java:1149)
at java.util.concurrent.ThreadPoolExecutor$Worker.run(ThreadPoolExecutor.java:624)
at java.lang.Thread.run(Thread.java:748)
Suppressed: hudson.remoting.Channel$CallSiteStackTrace: Remote call to H23
at hudson.remoting.Channel.attachCallSiteStackTrace(Channel.java:1743)
at hudson.remoting.UserRequest$ExceptionResponse.retrieve(UserRequest.java:357)
at hudson.remoting.Channel.call(Channel.java:957)
at org.jenkinsci.plugins.gitclient.RemoteGitImpl$CommandInvocationHandler.execute(RemoteGitImpl.java:146)
at sun.reflect.GeneratedMethodAccessor1196.invoke(Unknown Source)
at sun.reflect.DelegatingMethodAccessorImpl.invoke(DelegatingMethodAccessorImpl.java:43)
at java.lang.reflect.Method.invoke(Method.java:498)
at org.jenkinsci.plugins.gitclient.RemoteGitImpl$CommandInvocationHandler.invoke(RemoteGitImpl.java:132)
at com.sun.proxy.$Proxy137.execute(Unknown Source)
at hudson.plugins.git.GitSCM.retrieveChanges(GitSCM.java:1152)
at hudson.plugins.git.GitSCM.checkout(GitSCM.java:1192)
at hudson.scm.SCM.checkout(SCM.java:504)
at hudson.model.AbstractProject.checkout(AbstractProject.java:1208)
at hudson.model.AbstractBuild$AbstractBuildExecution.defaultCheckout(AbstractBuild.java:574)
at jenkins.scm.SCMCheckoutStrategy.checkout(SCMCheckoutStrategy.java:86)
at hudson.model.AbstractBuild$AbstractBuildExecution.run(AbstractBuild.java:499)
at hudson.model.Run.execute(Run.java:1815)
at hudson.model.FreeStyleBuild.run(FreeStyleBuild.java:43)
at hudson.model.ResourceController.execute(ResourceController.java:97)
at hudson.model.Executor.run(Executor.java:429)
Caused by: hudson.plugins.git.GitException: Error performing git command
at org.jenkinsci.plugins.gitclient.CliGitAPIImpl.launchCommandIn(CliGitAPIImpl.java:2181)
at org.jenkinsci.plugins.gitclient.CliGitAPIImpl.launchCommandIn(CliGitAPIImpl.java:2140)
at org.jenkinsci.plugins.gitclient.CliGitAPIImpl.launchCommandIn(CliGitAPIImpl.java:2136)
at org.jenkinsci.plugins.gitclient.CliGitAPIImpl.launchCommand(CliGitAPIImpl.java:1741)
at org.jenkinsci.plugins.gitclient.CliGitAPIImpl$5.execute(CliGitAPIImpl.java:914)
... 11 more
Caused by: java.lang.OutOfMemoryError: unable to create new native thread
at java.lang.Thread.start0(Native Method)
at java.lang.Thread.start(Thread.java:717)
at java.util.concurrent.ThreadPoolExecutor.addWorker(ThreadPoolExecutor.java:957)
at java.util.concurrent.ThreadPoolExecutor.execute(ThreadPoolExecutor.java:1378)
at java.util.concurrent.AbstractExecutorService.submit(AbstractExecutorService.java:112)
at hudson.Proc.joinWithTimeout(Proc.java:158)
at org.jenkinsci.plugins.gitclient.CliGitAPIImpl.launchCommandIn(CliGitAPIImpl.java:2168)
... 15 more
ERROR: Error cloning remote repo 'origin'
Retrying after 10 seconds
No credentials specified
> git rev-parse --is-inside-work-tree # timeout=10
ERROR: Workspace has a .git repository, but it appears to be corrupt.
hudson.plugins.git.GitException: Error performing git command
at org.jenkinsci.plugins.gitclient.CliGitAPIImpl.launchCommandIn(CliGitAPIImpl.java:2181)
at org.jenkinsci.plugins.gitclient.CliGitAPIImpl.launchCommandIn(CliGitAPIImpl.java:2140)
at org.jenkinsci.plugins.gitclient.CliGitAPIImpl.launchCommandIn(CliGitAPIImpl.java:2136)
at org.jenkinsci.plugins.gitclient.CliGitAPIImpl.launchCommand(CliGitAPIImpl.java:1741)
at org.jenkinsci.plugins.gitclient.CliGitAPIImpl.launchCommand(CliGitAPIImpl.java:1753)
at org.jenkinsci.plugins.gitclient.CliGitAPIImpl.hasGitRepo(CliGitAPIImpl.java:329)
at hudson.plugins.git.GitAPI.hasGitRepo(GitAPI.java:232)
at sun.reflect.GeneratedMethodAccessor39.invoke(Unknown Source)
at sun.reflect.DelegatingMethodAccessorImpl.invoke(DelegatingMethodAccessorImpl.java:43)
at java.lang.reflect.Method.invoke(Method.java:498)
at hudson.remoting.RemoteInvocationHandler$RPCRequest.perform(RemoteInvocationHandler.java:929)
at hudson.remoting.RemoteInvocationHandler$RPCRequest.call(RemoteInvocationHandler.java:903)
at hudson.remoting.RemoteInvocationHandler$RPCRequest.call(RemoteInvocationHandler.java:855)
at hudson.remoting.UserRequest.perform(UserRequest.java:212)
at hudson.remoting.UserRequest.perform(UserRequest.java:54)
at hudson.remoting.Request$2.run(Request.java:369)
at hudson.remoting.InterceptingExecutorService$1.call(InterceptingExecutorService.java:72)
at java.util.concurrent.FutureTask.run(FutureTask.java:266)
at java.util.concurrent.ThreadPoolExecutor.runWorker(ThreadPoolExecutor.java:1149)
at java.util.concurrent.ThreadPoolExecutor$Worker.run(ThreadPoolExecutor.java:624)
at java.lang.Thread.run(Thread.java:748)
Caused by: java.lang.OutOfMemoryError: unable to create new native thread
at java.lang.Thread.start0(Native Method)
at java.lang.Thread.start(Thread.java:717)
at hudson.Proc$LocalProc.<init>(Proc.java:282)
at hudson.Proc$LocalProc.<init>(Proc.java:219)
at hudson.Launcher$LocalLauncher.launch(Launcher.java:937)
at hudson.Launcher$ProcStarter.start(Launcher.java:455)
at org.jenkinsci.plugins.gitclient.CliGitAPIImpl.launchCommandIn(CliGitAPIImpl.java:2168)
... 20 more
Cloning the remote Git repository
Cloning repository https://github.com/apache/kafka.git
> git init <https://builds.apache.org/job/kafka-trunk-jdk14/ws/> # timeout=10
ERROR: Error cloning remote repo 'origin'
hudson.plugins.git.GitException: Could not init <https://builds.apache.org/job/kafka-trunk-jdk14/ws/>
at org.jenkinsci.plugins.gitclient.CliGitAPIImpl$5.execute(CliGitAPIImpl.java:916)
at org.jenkinsci.plugins.gitclient.CliGitAPIImpl$2.execute(CliGitAPIImpl.java:708)
at org.jenkinsci.plugins.gitclient.RemoteGitImpl$CommandInvocationHandler$1.call(RemoteGitImpl.java:153)
at org.jenkinsci.plugins.gitclient.RemoteGitImpl$CommandInvocationHandler$1.call(RemoteGitImpl.java:146)
at hudson.remoting.UserRequest.perform(UserRequest.java:212)
at hudson.remoting.UserRequest.perform(UserRequest.java:54)
at hudson.remoting.Request$2.run(Request.java:369)
at hudson.remoting.InterceptingExecutorService$1.call(InterceptingExecutorService.java:72)
at java.util.concurrent.FutureTask.run(FutureTask.java:266)
at java.util.concurrent.ThreadPoolExecutor.runWorker(ThreadPoolExecutor.java:1149)
at java.util.concurrent.ThreadPoolExecutor$Worker.run(ThreadPoolExecutor.java:624)
at java.lang.Thread.run(Thread.java:748)
Suppressed: hudson.remoting.Channel$CallSiteStackTrace: Remote call to H23
at hudson.remoting.Channel.attachCallSiteStackTrace(Channel.java:1743)
at hudson.remoting.UserRequest$ExceptionResponse.retrieve(UserRequest.java:357)
at hudson.remoting.Channel.call(Channel.java:957)
at org.jenkinsci.plugins.gitclient.RemoteGitImpl$CommandInvocationHandler.execute(RemoteGitImpl.java:146)
at sun.reflect.GeneratedMethodAccessor1196.invoke(Unknown Source)
at sun.reflect.DelegatingMethodAccessorImpl.invoke(DelegatingMethodAccessorImpl.java:43)
at java.lang.reflect.Method.invoke(Method.java:498)
at org.jenkinsci.plugins.gitclient.RemoteGitImpl$CommandInvocationHandler.invoke(RemoteGitImpl.java:132)
at com.sun.proxy.$Proxy137.execute(Unknown Source)
at hudson.plugins.git.GitSCM.retrieveChanges(GitSCM.java:1152)
at hudson.plugins.git.GitSCM.checkout(GitSCM.java:1192)
at hudson.scm.SCM.checkout(SCM.java:504)
at hudson.model.AbstractProject.checkout(AbstractProject.java:1208)
at hudson.model.AbstractBuild$AbstractBuildExecution.defaultCheckout(AbstractBuild.java:574)
at jenkins.scm.SCMCheckoutStrategy.checkout(SCMCheckoutStrategy.java:86)
at hudson.model.AbstractBuild$AbstractBuildExecution.run(AbstractBuild.java:499)
at hudson.model.Run.execute(Run.java:1815)
at hudson.model.FreeStyleBuild.run(FreeStyleBuild.java:43)
at hudson.model.ResourceController.execute(ResourceController.java:97)
at hudson.model.Executor.run(Executor.java:429)
Caused by: hudson.plugins.git.GitException: Error performing git command
at org.jenkinsci.plugins.gitclient.CliGitAPIImpl.launchCommandIn(CliGitAPIImpl.java:2181)
at org.jenkinsci.plugins.gitclient.CliGitAPIImpl.launchCommandIn(CliGitAPIImpl.java:2140)
at org.jenkinsci.plugins.gitclient.CliGitAPIImpl.launchCommandIn(CliGitAPIImpl.java:2136)
at org.jenkinsci.plugins.gitclient.CliGitAPIImpl.launchCommand(CliGitAPIImpl.java:1741)
at org.jenkinsci.plugins.gitclient.CliGitAPIImpl$5.execute(CliGitAPIImpl.java:914)
... 11 more
Caused by: java.lang.OutOfMemoryError: unable to create new native thread
at java.lang.Thread.start0(Native Method)
at java.lang.Thread.start(Thread.java:717)
at hudson.Proc$LocalProc.<init>(Proc.java:282)
at hudson.Proc$LocalProc.<init>(Proc.java:219)
at hudson.Launcher$LocalLauncher.launch(Launcher.java:937)
at hudson.Launcher$ProcStarter.start(Launcher.java:455)
at org.jenkinsci.plugins.gitclient.CliGitAPIImpl.launchCommandIn(CliGitAPIImpl.java:2168)
... 15 more
ERROR: Error cloning remote repo 'origin'
Retrying after 10 seconds
No credentials specified
> git rev-parse --is-inside-work-tree # timeout=10
ERROR: Workspace has a .git repository, but it appears to be corrupt.
hudson.plugins.git.GitException: Error performing git command
at org.jenkinsci.plugins.gitclient.CliGitAPIImpl.launchCommandIn(CliGitAPIImpl.java:2181)
at org.jenkinsci.plugins.gitclient.CliGitAPIImpl.launchCommandIn(CliGitAPIImpl.java:2140)
at org.jenkinsci.plugins.gitclient.CliGitAPIImpl.launchCommandIn(CliGitAPIImpl.java:2136)
at org.jenkinsci.plugins.gitclient.CliGitAPIImpl.launchCommand(CliGitAPIImpl.java:1741)
at org.jenkinsci.plugins.gitclient.CliGitAPIImpl.launchCommand(CliGitAPIImpl.java:1753)
at org.jenkinsci.plugins.gitclient.CliGitAPIImpl.hasGitRepo(CliGitAPIImpl.java:329)
at hudson.plugins.git.GitAPI.hasGitRepo(GitAPI.java:232)
at sun.reflect.GeneratedMethodAccessor39.invoke(Unknown Source)
at sun.reflect.DelegatingMethodAccessorImpl.invoke(DelegatingMethodAccessorImpl.java:43)
at java.lang.reflect.Method.invoke(Method.java:498)
at hudson.remoting.RemoteInvocationHandler$RPCRequest.perform(RemoteInvocationHandler.java:929)
at hudson.remoting.RemoteInvocationHandler$RPCRequest.call(RemoteInvocationHandler.java:903)
at hudson.remoting.RemoteInvocationHandler$RPCRequest.call(RemoteInvocationHandler.java:855)
at hudson.remoting.UserRequest.perform(UserRequest.java:212)
at hudson.remoting.UserRequest.perform(UserRequest.java:54)
at hudson.remoting.Request$2.run(Request.java:369)
at hudson.remoting.InterceptingExecutorService$1.call(InterceptingExecutorService.java:72)
at java.util.concurrent.FutureTask.run(FutureTask.java:266)
at java.util.concurrent.ThreadPoolExecutor.runWorker(ThreadPoolExecutor.java:1149)
at java.util.concurrent.ThreadPoolExecutor$Worker.run(ThreadPoolExecutor.java:624)
at java.lang.Thread.run(Thread.java:748)
Caused by: java.lang.OutOfMemoryError: unable to create new native thread
at java.lang.Thread.start0(Native Method)
at java.lang.Thread.start(Thread.java:717)
at hudson.Proc$LocalProc.<init>(Proc.java:270)
at hudson.Proc$LocalProc.<init>(Proc.java:219)
at hudson.Launcher$LocalLauncher.launch(Launcher.java:937)
at hudson.Launcher$ProcStarter.start(Launcher.java:455)
at org.jenkinsci.plugins.gitclient.CliGitAPIImpl.launchCommandIn(CliGitAPIImpl.java:2168)
... 20 more
Cloning the remote Git repository
Cloning repository https://github.com/apache/kafka.git
> git init <https://builds.apache.org/job/kafka-trunk-jdk14/ws/> # timeout=10
ERROR: Error cloning remote repo 'origin'
hudson.plugins.git.GitException: Could not init <https://builds.apache.org/job/kafka-trunk-jdk14/ws/>
at org.jenkinsci.plugins.gitclient.CliGitAPIImpl$5.execute(CliGitAPIImpl.java:916)
at org.jenkinsci.plugins.gitclient.CliGitAPIImpl$2.execute(CliGitAPIImpl.java:708)
at org.jenkinsci.plugins.gitclient.RemoteGitImpl$CommandInvocationHandler$1.call(RemoteGitImpl.java:153)
at org.jenkinsci.plugins.gitclient.RemoteGitImpl$CommandInvocationHandler$1.call(RemoteGitImpl.java:146)
at hudson.remoting.UserRequest.perform(UserRequest.java:212)
at hudson.remoting.UserRequest.perform(UserRequest.java:54)
at hudson.remoting.Request$2.run(Request.java:369)
at hudson.remoting.InterceptingExecutorService$1.call(InterceptingExecutorService.java:72)
at java.util.concurrent.FutureTask.run(FutureTask.java:266)
at java.util.concurrent.ThreadPoolExecutor.runWorker(ThreadPoolExecutor.java:1149)
at java.util.concurrent.ThreadPoolExecutor$Worker.run(ThreadPoolExecutor.java:624)
at java.lang.Thread.run(Thread.java:748)
Suppressed: hudson.remoting.Channel$CallSiteStackTrace: Remote call to H23
at hudson.remoting.Channel.attachCallSiteStackTrace(Channel.java:1743)
at hudson.remoting.UserRequest$ExceptionResponse.retrieve(UserRequest.java:357)
at hudson.remoting.Channel.call(Channel.java:957)
at org.jenkinsci.plugins.gitclient.RemoteGitImpl$CommandInvocationHandler.execute(RemoteGitImpl.java:146)
at sun.reflect.GeneratedMethodAccessor1196.invoke(Unknown Source)
at sun.reflect.DelegatingMethodAccessorImpl.invoke(DelegatingMethodAccessorImpl.java:43)
at java.lang.reflect.Method.invoke(Method.java:498)
at org.jenkinsci.plugins.gitclient.RemoteGitImpl$CommandInvocationHandler.invoke(RemoteGitImpl.java:132)
at com.sun.proxy.$Proxy137.execute(Unknown Source)
at hudson.plugins.git.GitSCM.retrieveChanges(GitSCM.java:1152)
at hudson.plugins.git.GitSCM.checkout(GitSCM.java:1192)
at hudson.scm.SCM.checkout(SCM.java:504)
at hudson.model.AbstractProject.checkout(AbstractProject.java:1208)
at hudson.model.AbstractBuild$AbstractBuildExecution.defaultCheckout(AbstractBuild.java:574)
at jenkins.scm.SCMCheckoutStrategy.checkout(SCMCheckoutStrategy.java:86)
at hudson.model.AbstractBuild$AbstractBuildExecution.run(AbstractBuild.java:499)
at hudson.model.Run.execute(Run.java:1815)
at hudson.model.FreeStyleBuild.run(FreeStyleBuild.java:43)
at hudson.model.ResourceController.execute(ResourceController.java:97)
at hudson.model.Executor.run(Executor.java:429)
Caused by: hudson.plugins.git.GitException: Error performing git command
at org.jenkinsci.plugins.gitclient.CliGitAPIImpl.launchCommandIn(CliGitAPIImpl.java:2181)
at org.jenkinsci.plugins.gitclient.CliGitAPIImpl.launchCommandIn(CliGitAPIImpl.java:2140)
at org.jenkinsci.plugins.gitclient.CliGitAPIImpl.launchCommandIn(CliGitAPIImpl.java:2136)
at org.jenkinsci.plugins.gitclient.CliGitAPIImpl.launchCommand(CliGitAPIImpl.java:1741)
at org.jenkinsci.plugins.gitclient.CliGitAPIImpl$5.execute(CliGitAPIImpl.java:914)
... 11 more
Caused by: java.lang.OutOfMemoryError: unable to create new native thread
at java.lang.Thread.start0(Native Method)
at java.lang.Thread.start(Thread.java:717)
at hudson.Proc$LocalProc.<init>(Proc.java:270)
at hudson.Proc$LocalProc.<init>(Proc.java:219)
at hudson.Launcher$LocalLauncher.launch(Launcher.java:937)
at hudson.Launcher$ProcStarter.start(Launcher.java:455)
at org.jenkinsci.plugins.gitclient.CliGitAPIImpl.launchCommandIn(CliGitAPIImpl.java:2168)
... 15 more
ERROR: Error cloning remote repo 'origin'
Recording test results
ERROR: Step ?Publish JUnit test result report? failed: No test report files were found. Configuration error?
Not sending mail to unregistered user noreply@github.com
Build failed in Jenkins: kafka-trunk-jdk14 #158
Posted by Apache Jenkins Server <je...@builds.apache.org>.
See <https://builds.apache.org/job/kafka-trunk-jdk14/158/display/redirect>
Changes:
------------------------------------------
Started by an SCM change
Running as SYSTEM
[EnvInject] - Loading node environment variables.
Building remotely on H23 (ubuntu) in workspace <https://builds.apache.org/job/kafka-trunk-jdk14/ws/>
[WS-CLEANUP] Deleting project workspace...
[WS-CLEANUP] Deferred wipeout is used...
[WS-CLEANUP] Done
No credentials specified
Cloning the remote Git repository
Cloning repository https://github.com/apache/kafka.git
> git init <https://builds.apache.org/job/kafka-trunk-jdk14/ws/> # timeout=10
ERROR: Error cloning remote repo 'origin'
hudson.plugins.git.GitException: Could not init <https://builds.apache.org/job/kafka-trunk-jdk14/ws/>
at org.jenkinsci.plugins.gitclient.CliGitAPIImpl$5.execute(CliGitAPIImpl.java:916)
at org.jenkinsci.plugins.gitclient.CliGitAPIImpl$2.execute(CliGitAPIImpl.java:708)
at org.jenkinsci.plugins.gitclient.RemoteGitImpl$CommandInvocationHandler$1.call(RemoteGitImpl.java:153)
at org.jenkinsci.plugins.gitclient.RemoteGitImpl$CommandInvocationHandler$1.call(RemoteGitImpl.java:146)
at hudson.remoting.UserRequest.perform(UserRequest.java:212)
at hudson.remoting.UserRequest.perform(UserRequest.java:54)
at hudson.remoting.Request$2.run(Request.java:369)
at hudson.remoting.InterceptingExecutorService$1.call(InterceptingExecutorService.java:72)
at java.util.concurrent.FutureTask.run(FutureTask.java:266)
at java.util.concurrent.ThreadPoolExecutor.runWorker(ThreadPoolExecutor.java:1149)
at java.util.concurrent.ThreadPoolExecutor$Worker.run(ThreadPoolExecutor.java:624)
at java.lang.Thread.run(Thread.java:748)
Suppressed: hudson.remoting.Channel$CallSiteStackTrace: Remote call to H23
at hudson.remoting.Channel.attachCallSiteStackTrace(Channel.java:1743)
at hudson.remoting.UserRequest$ExceptionResponse.retrieve(UserRequest.java:357)
at hudson.remoting.Channel.call(Channel.java:957)
at org.jenkinsci.plugins.gitclient.RemoteGitImpl$CommandInvocationHandler.execute(RemoteGitImpl.java:146)
at sun.reflect.GeneratedMethodAccessor1196.invoke(Unknown Source)
at sun.reflect.DelegatingMethodAccessorImpl.invoke(DelegatingMethodAccessorImpl.java:43)
at java.lang.reflect.Method.invoke(Method.java:498)
at org.jenkinsci.plugins.gitclient.RemoteGitImpl$CommandInvocationHandler.invoke(RemoteGitImpl.java:132)
at com.sun.proxy.$Proxy137.execute(Unknown Source)
at hudson.plugins.git.GitSCM.retrieveChanges(GitSCM.java:1152)
at hudson.plugins.git.GitSCM.checkout(GitSCM.java:1192)
at hudson.scm.SCM.checkout(SCM.java:504)
at hudson.model.AbstractProject.checkout(AbstractProject.java:1208)
at hudson.model.AbstractBuild$AbstractBuildExecution.defaultCheckout(AbstractBuild.java:574)
at jenkins.scm.SCMCheckoutStrategy.checkout(SCMCheckoutStrategy.java:86)
at hudson.model.AbstractBuild$AbstractBuildExecution.run(AbstractBuild.java:499)
at hudson.model.Run.execute(Run.java:1815)
at hudson.model.FreeStyleBuild.run(FreeStyleBuild.java:43)
at hudson.model.ResourceController.execute(ResourceController.java:97)
at hudson.model.Executor.run(Executor.java:429)
Caused by: hudson.plugins.git.GitException: Error performing git command
at org.jenkinsci.plugins.gitclient.CliGitAPIImpl.launchCommandIn(CliGitAPIImpl.java:2181)
at org.jenkinsci.plugins.gitclient.CliGitAPIImpl.launchCommandIn(CliGitAPIImpl.java:2140)
at org.jenkinsci.plugins.gitclient.CliGitAPIImpl.launchCommandIn(CliGitAPIImpl.java:2136)
at org.jenkinsci.plugins.gitclient.CliGitAPIImpl.launchCommand(CliGitAPIImpl.java:1741)
at org.jenkinsci.plugins.gitclient.CliGitAPIImpl$5.execute(CliGitAPIImpl.java:914)
... 11 more
Caused by: java.lang.OutOfMemoryError: unable to create new native thread
at java.lang.Thread.start0(Native Method)
at java.lang.Thread.start(Thread.java:717)
at hudson.Proc$LocalProc.<init>(Proc.java:282)
at hudson.Proc$LocalProc.<init>(Proc.java:219)
at hudson.Launcher$LocalLauncher.launch(Launcher.java:937)
at hudson.Launcher$ProcStarter.start(Launcher.java:455)
at org.jenkinsci.plugins.gitclient.CliGitAPIImpl.launchCommandIn(CliGitAPIImpl.java:2168)
... 15 more
ERROR: Error cloning remote repo 'origin'
Retrying after 10 seconds
No credentials specified
> git rev-parse --is-inside-work-tree # timeout=10
ERROR: Workspace has a .git repository, but it appears to be corrupt.
hudson.plugins.git.GitException: Error performing git command
at org.jenkinsci.plugins.gitclient.CliGitAPIImpl.launchCommandIn(CliGitAPIImpl.java:2181)
at org.jenkinsci.plugins.gitclient.CliGitAPIImpl.launchCommandIn(CliGitAPIImpl.java:2140)
at org.jenkinsci.plugins.gitclient.CliGitAPIImpl.launchCommandIn(CliGitAPIImpl.java:2136)
at org.jenkinsci.plugins.gitclient.CliGitAPIImpl.launchCommand(CliGitAPIImpl.java:1741)
at org.jenkinsci.plugins.gitclient.CliGitAPIImpl.launchCommand(CliGitAPIImpl.java:1753)
at org.jenkinsci.plugins.gitclient.CliGitAPIImpl.hasGitRepo(CliGitAPIImpl.java:329)
at hudson.plugins.git.GitAPI.hasGitRepo(GitAPI.java:232)
at sun.reflect.GeneratedMethodAccessor39.invoke(Unknown Source)
at sun.reflect.DelegatingMethodAccessorImpl.invoke(DelegatingMethodAccessorImpl.java:43)
at java.lang.reflect.Method.invoke(Method.java:498)
at hudson.remoting.RemoteInvocationHandler$RPCRequest.perform(RemoteInvocationHandler.java:929)
at hudson.remoting.RemoteInvocationHandler$RPCRequest.call(RemoteInvocationHandler.java:903)
at hudson.remoting.RemoteInvocationHandler$RPCRequest.call(RemoteInvocationHandler.java:855)
at hudson.remoting.UserRequest.perform(UserRequest.java:212)
at hudson.remoting.UserRequest.perform(UserRequest.java:54)
at hudson.remoting.Request$2.run(Request.java:369)
at hudson.remoting.InterceptingExecutorService$1.call(InterceptingExecutorService.java:72)
at java.util.concurrent.FutureTask.run(FutureTask.java:266)
at java.util.concurrent.ThreadPoolExecutor.runWorker(ThreadPoolExecutor.java:1149)
at java.util.concurrent.ThreadPoolExecutor$Worker.run(ThreadPoolExecutor.java:624)
at java.lang.Thread.run(Thread.java:748)
Caused by: java.lang.OutOfMemoryError: unable to create new native thread
at java.lang.Thread.start0(Native Method)
at java.lang.Thread.start(Thread.java:717)
at hudson.Proc$LocalProc.<init>(Proc.java:270)
at hudson.Proc$LocalProc.<init>(Proc.java:219)
at hudson.Launcher$LocalLauncher.launch(Launcher.java:937)
at hudson.Launcher$ProcStarter.start(Launcher.java:455)
at org.jenkinsci.plugins.gitclient.CliGitAPIImpl.launchCommandIn(CliGitAPIImpl.java:2168)
... 20 more
Cloning the remote Git repository
Cloning repository https://github.com/apache/kafka.git
> git init <https://builds.apache.org/job/kafka-trunk-jdk14/ws/> # timeout=10
ERROR: Error cloning remote repo 'origin'
hudson.plugins.git.GitException: Could not init <https://builds.apache.org/job/kafka-trunk-jdk14/ws/>
at org.jenkinsci.plugins.gitclient.CliGitAPIImpl$5.execute(CliGitAPIImpl.java:916)
at org.jenkinsci.plugins.gitclient.CliGitAPIImpl$2.execute(CliGitAPIImpl.java:708)
at org.jenkinsci.plugins.gitclient.RemoteGitImpl$CommandInvocationHandler$1.call(RemoteGitImpl.java:153)
at org.jenkinsci.plugins.gitclient.RemoteGitImpl$CommandInvocationHandler$1.call(RemoteGitImpl.java:146)
at hudson.remoting.UserRequest.perform(UserRequest.java:212)
at hudson.remoting.UserRequest.perform(UserRequest.java:54)
at hudson.remoting.Request$2.run(Request.java:369)
at hudson.remoting.InterceptingExecutorService$1.call(InterceptingExecutorService.java:72)
at java.util.concurrent.FutureTask.run(FutureTask.java:266)
at java.util.concurrent.ThreadPoolExecutor.runWorker(ThreadPoolExecutor.java:1149)
at java.util.concurrent.ThreadPoolExecutor$Worker.run(ThreadPoolExecutor.java:624)
at java.lang.Thread.run(Thread.java:748)
Suppressed: hudson.remoting.Channel$CallSiteStackTrace: Remote call to H23
at hudson.remoting.Channel.attachCallSiteStackTrace(Channel.java:1743)
at hudson.remoting.UserRequest$ExceptionResponse.retrieve(UserRequest.java:357)
at hudson.remoting.Channel.call(Channel.java:957)
at org.jenkinsci.plugins.gitclient.RemoteGitImpl$CommandInvocationHandler.execute(RemoteGitImpl.java:146)
at sun.reflect.GeneratedMethodAccessor1196.invoke(Unknown Source)
at sun.reflect.DelegatingMethodAccessorImpl.invoke(DelegatingMethodAccessorImpl.java:43)
at java.lang.reflect.Method.invoke(Method.java:498)
at org.jenkinsci.plugins.gitclient.RemoteGitImpl$CommandInvocationHandler.invoke(RemoteGitImpl.java:132)
at com.sun.proxy.$Proxy137.execute(Unknown Source)
at hudson.plugins.git.GitSCM.retrieveChanges(GitSCM.java:1152)
at hudson.plugins.git.GitSCM.checkout(GitSCM.java:1192)
at hudson.scm.SCM.checkout(SCM.java:504)
at hudson.model.AbstractProject.checkout(AbstractProject.java:1208)
at hudson.model.AbstractBuild$AbstractBuildExecution.defaultCheckout(AbstractBuild.java:574)
at jenkins.scm.SCMCheckoutStrategy.checkout(SCMCheckoutStrategy.java:86)
at hudson.model.AbstractBuild$AbstractBuildExecution.run(AbstractBuild.java:499)
at hudson.model.Run.execute(Run.java:1815)
at hudson.model.FreeStyleBuild.run(FreeStyleBuild.java:43)
at hudson.model.ResourceController.execute(ResourceController.java:97)
at hudson.model.Executor.run(Executor.java:429)
Caused by: hudson.plugins.git.GitException: Error performing git command
at org.jenkinsci.plugins.gitclient.CliGitAPIImpl.launchCommandIn(CliGitAPIImpl.java:2181)
at org.jenkinsci.plugins.gitclient.CliGitAPIImpl.launchCommandIn(CliGitAPIImpl.java:2140)
at org.jenkinsci.plugins.gitclient.CliGitAPIImpl.launchCommandIn(CliGitAPIImpl.java:2136)
at org.jenkinsci.plugins.gitclient.CliGitAPIImpl.launchCommand(CliGitAPIImpl.java:1741)
at org.jenkinsci.plugins.gitclient.CliGitAPIImpl$5.execute(CliGitAPIImpl.java:914)
... 11 more
Caused by: java.lang.OutOfMemoryError: unable to create new native thread
at java.lang.Thread.start0(Native Method)
at java.lang.Thread.start(Thread.java:717)
at hudson.Proc$LocalProc.<init>(Proc.java:270)
at hudson.Proc$LocalProc.<init>(Proc.java:219)
at hudson.Launcher$LocalLauncher.launch(Launcher.java:937)
at hudson.Launcher$ProcStarter.start(Launcher.java:455)
at org.jenkinsci.plugins.gitclient.CliGitAPIImpl.launchCommandIn(CliGitAPIImpl.java:2168)
... 15 more
ERROR: Error cloning remote repo 'origin'
Retrying after 10 seconds
No credentials specified
> git rev-parse --is-inside-work-tree # timeout=10
ERROR: Workspace has a .git repository, but it appears to be corrupt.
hudson.plugins.git.GitException: Error performing git command
at org.jenkinsci.plugins.gitclient.CliGitAPIImpl.launchCommandIn(CliGitAPIImpl.java:2181)
at org.jenkinsci.plugins.gitclient.CliGitAPIImpl.launchCommandIn(CliGitAPIImpl.java:2140)
at org.jenkinsci.plugins.gitclient.CliGitAPIImpl.launchCommandIn(CliGitAPIImpl.java:2136)
at org.jenkinsci.plugins.gitclient.CliGitAPIImpl.launchCommand(CliGitAPIImpl.java:1741)
at org.jenkinsci.plugins.gitclient.CliGitAPIImpl.launchCommand(CliGitAPIImpl.java:1753)
at org.jenkinsci.plugins.gitclient.CliGitAPIImpl.hasGitRepo(CliGitAPIImpl.java:329)
at hudson.plugins.git.GitAPI.hasGitRepo(GitAPI.java:232)
at sun.reflect.GeneratedMethodAccessor39.invoke(Unknown Source)
at sun.reflect.DelegatingMethodAccessorImpl.invoke(DelegatingMethodAccessorImpl.java:43)
at java.lang.reflect.Method.invoke(Method.java:498)
at hudson.remoting.RemoteInvocationHandler$RPCRequest.perform(RemoteInvocationHandler.java:929)
at hudson.remoting.RemoteInvocationHandler$RPCRequest.call(RemoteInvocationHandler.java:903)
at hudson.remoting.RemoteInvocationHandler$RPCRequest.call(RemoteInvocationHandler.java:855)
at hudson.remoting.UserRequest.perform(UserRequest.java:212)
at hudson.remoting.UserRequest.perform(UserRequest.java:54)
at hudson.remoting.Request$2.run(Request.java:369)
at hudson.remoting.InterceptingExecutorService$1.call(InterceptingExecutorService.java:72)
at java.util.concurrent.FutureTask.run(FutureTask.java:266)
at java.util.concurrent.ThreadPoolExecutor.runWorker(ThreadPoolExecutor.java:1149)
at java.util.concurrent.ThreadPoolExecutor$Worker.run(ThreadPoolExecutor.java:624)
at java.lang.Thread.run(Thread.java:748)
Caused by: java.lang.OutOfMemoryError: unable to create new native thread
at java.lang.Thread.start0(Native Method)
at java.lang.Thread.start(Thread.java:717)
at hudson.Proc$LocalProc.<init>(Proc.java:270)
at hudson.Proc$LocalProc.<init>(Proc.java:219)
at hudson.Launcher$LocalLauncher.launch(Launcher.java:937)
at hudson.Launcher$ProcStarter.start(Launcher.java:455)
at org.jenkinsci.plugins.gitclient.CliGitAPIImpl.launchCommandIn(CliGitAPIImpl.java:2168)
... 20 more
Cloning the remote Git repository
Cloning repository https://github.com/apache/kafka.git
> git init <https://builds.apache.org/job/kafka-trunk-jdk14/ws/> # timeout=10
ERROR: Error cloning remote repo 'origin'
hudson.plugins.git.GitException: Could not init <https://builds.apache.org/job/kafka-trunk-jdk14/ws/>
at org.jenkinsci.plugins.gitclient.CliGitAPIImpl$5.execute(CliGitAPIImpl.java:916)
at org.jenkinsci.plugins.gitclient.CliGitAPIImpl$2.execute(CliGitAPIImpl.java:708)
at org.jenkinsci.plugins.gitclient.RemoteGitImpl$CommandInvocationHandler$1.call(RemoteGitImpl.java:153)
at org.jenkinsci.plugins.gitclient.RemoteGitImpl$CommandInvocationHandler$1.call(RemoteGitImpl.java:146)
at hudson.remoting.UserRequest.perform(UserRequest.java:212)
at hudson.remoting.UserRequest.perform(UserRequest.java:54)
at hudson.remoting.Request$2.run(Request.java:369)
at hudson.remoting.InterceptingExecutorService$1.call(InterceptingExecutorService.java:72)
at java.util.concurrent.FutureTask.run(FutureTask.java:266)
at java.util.concurrent.ThreadPoolExecutor.runWorker(ThreadPoolExecutor.java:1149)
at java.util.concurrent.ThreadPoolExecutor$Worker.run(ThreadPoolExecutor.java:624)
at java.lang.Thread.run(Thread.java:748)
Suppressed: hudson.remoting.Channel$CallSiteStackTrace: Remote call to H23
at hudson.remoting.Channel.attachCallSiteStackTrace(Channel.java:1743)
at hudson.remoting.UserRequest$ExceptionResponse.retrieve(UserRequest.java:357)
at hudson.remoting.Channel.call(Channel.java:957)
at org.jenkinsci.plugins.gitclient.RemoteGitImpl$CommandInvocationHandler.execute(RemoteGitImpl.java:146)
at sun.reflect.GeneratedMethodAccessor1196.invoke(Unknown Source)
at sun.reflect.DelegatingMethodAccessorImpl.invoke(DelegatingMethodAccessorImpl.java:43)
at java.lang.reflect.Method.invoke(Method.java:498)
at org.jenkinsci.plugins.gitclient.RemoteGitImpl$CommandInvocationHandler.invoke(RemoteGitImpl.java:132)
at com.sun.proxy.$Proxy137.execute(Unknown Source)
at hudson.plugins.git.GitSCM.retrieveChanges(GitSCM.java:1152)
at hudson.plugins.git.GitSCM.checkout(GitSCM.java:1192)
at hudson.scm.SCM.checkout(SCM.java:504)
at hudson.model.AbstractProject.checkout(AbstractProject.java:1208)
at hudson.model.AbstractBuild$AbstractBuildExecution.defaultCheckout(AbstractBuild.java:574)
at jenkins.scm.SCMCheckoutStrategy.checkout(SCMCheckoutStrategy.java:86)
at hudson.model.AbstractBuild$AbstractBuildExecution.run(AbstractBuild.java:499)
at hudson.model.Run.execute(Run.java:1815)
at hudson.model.FreeStyleBuild.run(FreeStyleBuild.java:43)
at hudson.model.ResourceController.execute(ResourceController.java:97)
at hudson.model.Executor.run(Executor.java:429)
Caused by: hudson.plugins.git.GitException: Error performing git command
at org.jenkinsci.plugins.gitclient.CliGitAPIImpl.launchCommandIn(CliGitAPIImpl.java:2181)
at org.jenkinsci.plugins.gitclient.CliGitAPIImpl.launchCommandIn(CliGitAPIImpl.java:2140)
at org.jenkinsci.plugins.gitclient.CliGitAPIImpl.launchCommandIn(CliGitAPIImpl.java:2136)
at org.jenkinsci.plugins.gitclient.CliGitAPIImpl.launchCommand(CliGitAPIImpl.java:1741)
at org.jenkinsci.plugins.gitclient.CliGitAPIImpl$5.execute(CliGitAPIImpl.java:914)
... 11 more
Caused by: java.lang.OutOfMemoryError: unable to create new native thread
at java.lang.Thread.start0(Native Method)
at java.lang.Thread.start(Thread.java:717)
at hudson.Proc$LocalProc.<init>(Proc.java:270)
at hudson.Proc$LocalProc.<init>(Proc.java:219)
at hudson.Launcher$LocalLauncher.launch(Launcher.java:937)
at hudson.Launcher$ProcStarter.start(Launcher.java:455)
at org.jenkinsci.plugins.gitclient.CliGitAPIImpl.launchCommandIn(CliGitAPIImpl.java:2168)
... 15 more
ERROR: Error cloning remote repo 'origin'
Recording test results
ERROR: Step ?Publish JUnit test result report? failed: No test report files were found. Configuration error?
Not sending mail to unregistered user noreply@github.com
Build failed in Jenkins: kafka-trunk-jdk14 #157
Posted by Apache Jenkins Server <je...@builds.apache.org>.
See <https://builds.apache.org/job/kafka-trunk-jdk14/157/display/redirect>
Changes:
------------------------------------------
Started by an SCM change
Running as SYSTEM
[EnvInject] - Loading node environment variables.
Building remotely on H23 (ubuntu) in workspace <https://builds.apache.org/job/kafka-trunk-jdk14/ws/>
[WS-CLEANUP] Deleting project workspace...
[WS-CLEANUP] Deferred wipeout is used...
[WS-CLEANUP] Done
No credentials specified
Cloning the remote Git repository
Cloning repository https://github.com/apache/kafka.git
> git init <https://builds.apache.org/job/kafka-trunk-jdk14/ws/> # timeout=10
ERROR: Error cloning remote repo 'origin'
hudson.plugins.git.GitException: Could not init <https://builds.apache.org/job/kafka-trunk-jdk14/ws/>
at org.jenkinsci.plugins.gitclient.CliGitAPIImpl$5.execute(CliGitAPIImpl.java:916)
at org.jenkinsci.plugins.gitclient.CliGitAPIImpl$2.execute(CliGitAPIImpl.java:708)
at org.jenkinsci.plugins.gitclient.RemoteGitImpl$CommandInvocationHandler$1.call(RemoteGitImpl.java:153)
at org.jenkinsci.plugins.gitclient.RemoteGitImpl$CommandInvocationHandler$1.call(RemoteGitImpl.java:146)
at hudson.remoting.UserRequest.perform(UserRequest.java:212)
at hudson.remoting.UserRequest.perform(UserRequest.java:54)
at hudson.remoting.Request$2.run(Request.java:369)
at hudson.remoting.InterceptingExecutorService$1.call(InterceptingExecutorService.java:72)
at java.util.concurrent.FutureTask.run(FutureTask.java:266)
at java.util.concurrent.ThreadPoolExecutor.runWorker(ThreadPoolExecutor.java:1149)
at java.util.concurrent.ThreadPoolExecutor$Worker.run(ThreadPoolExecutor.java:624)
at java.lang.Thread.run(Thread.java:748)
Suppressed: hudson.remoting.Channel$CallSiteStackTrace: Remote call to H23
at hudson.remoting.Channel.attachCallSiteStackTrace(Channel.java:1743)
at hudson.remoting.UserRequest$ExceptionResponse.retrieve(UserRequest.java:357)
at hudson.remoting.Channel.call(Channel.java:957)
at org.jenkinsci.plugins.gitclient.RemoteGitImpl$CommandInvocationHandler.execute(RemoteGitImpl.java:146)
at sun.reflect.GeneratedMethodAccessor1196.invoke(Unknown Source)
at sun.reflect.DelegatingMethodAccessorImpl.invoke(DelegatingMethodAccessorImpl.java:43)
at java.lang.reflect.Method.invoke(Method.java:498)
at org.jenkinsci.plugins.gitclient.RemoteGitImpl$CommandInvocationHandler.invoke(RemoteGitImpl.java:132)
at com.sun.proxy.$Proxy137.execute(Unknown Source)
at hudson.plugins.git.GitSCM.retrieveChanges(GitSCM.java:1152)
at hudson.plugins.git.GitSCM.checkout(GitSCM.java:1192)
at hudson.scm.SCM.checkout(SCM.java:504)
at hudson.model.AbstractProject.checkout(AbstractProject.java:1208)
at hudson.model.AbstractBuild$AbstractBuildExecution.defaultCheckout(AbstractBuild.java:574)
at jenkins.scm.SCMCheckoutStrategy.checkout(SCMCheckoutStrategy.java:86)
at hudson.model.AbstractBuild$AbstractBuildExecution.run(AbstractBuild.java:499)
at hudson.model.Run.execute(Run.java:1815)
at hudson.model.FreeStyleBuild.run(FreeStyleBuild.java:43)
at hudson.model.ResourceController.execute(ResourceController.java:97)
at hudson.model.Executor.run(Executor.java:429)
Caused by: hudson.plugins.git.GitException: Error performing git command
at org.jenkinsci.plugins.gitclient.CliGitAPIImpl.launchCommandIn(CliGitAPIImpl.java:2181)
at org.jenkinsci.plugins.gitclient.CliGitAPIImpl.launchCommandIn(CliGitAPIImpl.java:2140)
at org.jenkinsci.plugins.gitclient.CliGitAPIImpl.launchCommandIn(CliGitAPIImpl.java:2136)
at org.jenkinsci.plugins.gitclient.CliGitAPIImpl.launchCommand(CliGitAPIImpl.java:1741)
at org.jenkinsci.plugins.gitclient.CliGitAPIImpl$5.execute(CliGitAPIImpl.java:914)
... 11 more
Caused by: java.lang.OutOfMemoryError: unable to create new native thread
at java.lang.Thread.start0(Native Method)
at java.lang.Thread.start(Thread.java:717)
at hudson.Proc$LocalProc.<init>(Proc.java:270)
at hudson.Proc$LocalProc.<init>(Proc.java:219)
at hudson.Launcher$LocalLauncher.launch(Launcher.java:937)
at hudson.Launcher$ProcStarter.start(Launcher.java:455)
at org.jenkinsci.plugins.gitclient.CliGitAPIImpl.launchCommandIn(CliGitAPIImpl.java:2168)
... 15 more
ERROR: Error cloning remote repo 'origin'
Retrying after 10 seconds
No credentials specified
> git rev-parse --is-inside-work-tree # timeout=10
ERROR: Workspace has a .git repository, but it appears to be corrupt.
hudson.plugins.git.GitException: Error performing git command
at org.jenkinsci.plugins.gitclient.CliGitAPIImpl.launchCommandIn(CliGitAPIImpl.java:2181)
at org.jenkinsci.plugins.gitclient.CliGitAPIImpl.launchCommandIn(CliGitAPIImpl.java:2140)
at org.jenkinsci.plugins.gitclient.CliGitAPIImpl.launchCommandIn(CliGitAPIImpl.java:2136)
at org.jenkinsci.plugins.gitclient.CliGitAPIImpl.launchCommand(CliGitAPIImpl.java:1741)
at org.jenkinsci.plugins.gitclient.CliGitAPIImpl.launchCommand(CliGitAPIImpl.java:1753)
at org.jenkinsci.plugins.gitclient.CliGitAPIImpl.hasGitRepo(CliGitAPIImpl.java:329)
at hudson.plugins.git.GitAPI.hasGitRepo(GitAPI.java:232)
at sun.reflect.GeneratedMethodAccessor39.invoke(Unknown Source)
at sun.reflect.DelegatingMethodAccessorImpl.invoke(DelegatingMethodAccessorImpl.java:43)
at java.lang.reflect.Method.invoke(Method.java:498)
at hudson.remoting.RemoteInvocationHandler$RPCRequest.perform(RemoteInvocationHandler.java:929)
at hudson.remoting.RemoteInvocationHandler$RPCRequest.call(RemoteInvocationHandler.java:903)
at hudson.remoting.RemoteInvocationHandler$RPCRequest.call(RemoteInvocationHandler.java:855)
at hudson.remoting.UserRequest.perform(UserRequest.java:212)
at hudson.remoting.UserRequest.perform(UserRequest.java:54)
at hudson.remoting.Request$2.run(Request.java:369)
at hudson.remoting.InterceptingExecutorService$1.call(InterceptingExecutorService.java:72)
at java.util.concurrent.FutureTask.run(FutureTask.java:266)
at java.util.concurrent.ThreadPoolExecutor.runWorker(ThreadPoolExecutor.java:1149)
at java.util.concurrent.ThreadPoolExecutor$Worker.run(ThreadPoolExecutor.java:624)
at java.lang.Thread.run(Thread.java:748)
Caused by: java.lang.OutOfMemoryError: unable to create new native thread
at java.lang.Thread.start0(Native Method)
at java.lang.Thread.start(Thread.java:717)
at hudson.Proc$LocalProc.<init>(Proc.java:258)
at hudson.Proc$LocalProc.<init>(Proc.java:219)
at hudson.Launcher$LocalLauncher.launch(Launcher.java:937)
at hudson.Launcher$ProcStarter.start(Launcher.java:455)
at org.jenkinsci.plugins.gitclient.CliGitAPIImpl.launchCommandIn(CliGitAPIImpl.java:2168)
... 20 more
Cloning the remote Git repository
Cloning repository https://github.com/apache/kafka.git
> git init <https://builds.apache.org/job/kafka-trunk-jdk14/ws/> # timeout=10
ERROR: Error cloning remote repo 'origin'
hudson.plugins.git.GitException: Could not init <https://builds.apache.org/job/kafka-trunk-jdk14/ws/>
at org.jenkinsci.plugins.gitclient.CliGitAPIImpl$5.execute(CliGitAPIImpl.java:916)
at org.jenkinsci.plugins.gitclient.CliGitAPIImpl$2.execute(CliGitAPIImpl.java:708)
at org.jenkinsci.plugins.gitclient.RemoteGitImpl$CommandInvocationHandler$1.call(RemoteGitImpl.java:153)
at org.jenkinsci.plugins.gitclient.RemoteGitImpl$CommandInvocationHandler$1.call(RemoteGitImpl.java:146)
at hudson.remoting.UserRequest.perform(UserRequest.java:212)
at hudson.remoting.UserRequest.perform(UserRequest.java:54)
at hudson.remoting.Request$2.run(Request.java:369)
at hudson.remoting.InterceptingExecutorService$1.call(InterceptingExecutorService.java:72)
at java.util.concurrent.FutureTask.run(FutureTask.java:266)
at java.util.concurrent.ThreadPoolExecutor.runWorker(ThreadPoolExecutor.java:1149)
at java.util.concurrent.ThreadPoolExecutor$Worker.run(ThreadPoolExecutor.java:624)
at java.lang.Thread.run(Thread.java:748)
Suppressed: hudson.remoting.Channel$CallSiteStackTrace: Remote call to H23
at hudson.remoting.Channel.attachCallSiteStackTrace(Channel.java:1743)
at hudson.remoting.UserRequest$ExceptionResponse.retrieve(UserRequest.java:357)
at hudson.remoting.Channel.call(Channel.java:957)
at org.jenkinsci.plugins.gitclient.RemoteGitImpl$CommandInvocationHandler.execute(RemoteGitImpl.java:146)
at sun.reflect.GeneratedMethodAccessor1196.invoke(Unknown Source)
at sun.reflect.DelegatingMethodAccessorImpl.invoke(DelegatingMethodAccessorImpl.java:43)
at java.lang.reflect.Method.invoke(Method.java:498)
at org.jenkinsci.plugins.gitclient.RemoteGitImpl$CommandInvocationHandler.invoke(RemoteGitImpl.java:132)
at com.sun.proxy.$Proxy137.execute(Unknown Source)
at hudson.plugins.git.GitSCM.retrieveChanges(GitSCM.java:1152)
at hudson.plugins.git.GitSCM.checkout(GitSCM.java:1192)
at hudson.scm.SCM.checkout(SCM.java:504)
at hudson.model.AbstractProject.checkout(AbstractProject.java:1208)
at hudson.model.AbstractBuild$AbstractBuildExecution.defaultCheckout(AbstractBuild.java:574)
at jenkins.scm.SCMCheckoutStrategy.checkout(SCMCheckoutStrategy.java:86)
at hudson.model.AbstractBuild$AbstractBuildExecution.run(AbstractBuild.java:499)
at hudson.model.Run.execute(Run.java:1815)
at hudson.model.FreeStyleBuild.run(FreeStyleBuild.java:43)
at hudson.model.ResourceController.execute(ResourceController.java:97)
at hudson.model.Executor.run(Executor.java:429)
Caused by: hudson.plugins.git.GitException: Error performing git command
at org.jenkinsci.plugins.gitclient.CliGitAPIImpl.launchCommandIn(CliGitAPIImpl.java:2181)
at org.jenkinsci.plugins.gitclient.CliGitAPIImpl.launchCommandIn(CliGitAPIImpl.java:2140)
at org.jenkinsci.plugins.gitclient.CliGitAPIImpl.launchCommandIn(CliGitAPIImpl.java:2136)
at org.jenkinsci.plugins.gitclient.CliGitAPIImpl.launchCommand(CliGitAPIImpl.java:1741)
at org.jenkinsci.plugins.gitclient.CliGitAPIImpl$5.execute(CliGitAPIImpl.java:914)
... 11 more
Caused by: java.lang.OutOfMemoryError: unable to create new native thread
at java.lang.Thread.start0(Native Method)
at java.lang.Thread.start(Thread.java:717)
at hudson.Proc$LocalProc.<init>(Proc.java:258)
at hudson.Proc$LocalProc.<init>(Proc.java:219)
at hudson.Launcher$LocalLauncher.launch(Launcher.java:937)
at hudson.Launcher$ProcStarter.start(Launcher.java:455)
at org.jenkinsci.plugins.gitclient.CliGitAPIImpl.launchCommandIn(CliGitAPIImpl.java:2168)
... 15 more
ERROR: Error cloning remote repo 'origin'
Retrying after 10 seconds
No credentials specified
> git rev-parse --is-inside-work-tree # timeout=10
ERROR: Workspace has a .git repository, but it appears to be corrupt.
hudson.plugins.git.GitException: Error performing git command
at org.jenkinsci.plugins.gitclient.CliGitAPIImpl.launchCommandIn(CliGitAPIImpl.java:2181)
at org.jenkinsci.plugins.gitclient.CliGitAPIImpl.launchCommandIn(CliGitAPIImpl.java:2140)
at org.jenkinsci.plugins.gitclient.CliGitAPIImpl.launchCommandIn(CliGitAPIImpl.java:2136)
at org.jenkinsci.plugins.gitclient.CliGitAPIImpl.launchCommand(CliGitAPIImpl.java:1741)
at org.jenkinsci.plugins.gitclient.CliGitAPIImpl.launchCommand(CliGitAPIImpl.java:1753)
at org.jenkinsci.plugins.gitclient.CliGitAPIImpl.hasGitRepo(CliGitAPIImpl.java:329)
at hudson.plugins.git.GitAPI.hasGitRepo(GitAPI.java:232)
at sun.reflect.GeneratedMethodAccessor39.invoke(Unknown Source)
at sun.reflect.DelegatingMethodAccessorImpl.invoke(DelegatingMethodAccessorImpl.java:43)
at java.lang.reflect.Method.invoke(Method.java:498)
at hudson.remoting.RemoteInvocationHandler$RPCRequest.perform(RemoteInvocationHandler.java:929)
at hudson.remoting.RemoteInvocationHandler$RPCRequest.call(RemoteInvocationHandler.java:903)
at hudson.remoting.RemoteInvocationHandler$RPCRequest.call(RemoteInvocationHandler.java:855)
at hudson.remoting.UserRequest.perform(UserRequest.java:212)
at hudson.remoting.UserRequest.perform(UserRequest.java:54)
at hudson.remoting.Request$2.run(Request.java:369)
at hudson.remoting.InterceptingExecutorService$1.call(InterceptingExecutorService.java:72)
at java.util.concurrent.FutureTask.run(FutureTask.java:266)
at java.util.concurrent.ThreadPoolExecutor.runWorker(ThreadPoolExecutor.java:1149)
at java.util.concurrent.ThreadPoolExecutor$Worker.run(ThreadPoolExecutor.java:624)
at java.lang.Thread.run(Thread.java:748)
Caused by: java.lang.OutOfMemoryError: unable to create new native thread
at java.lang.Thread.start0(Native Method)
at java.lang.Thread.start(Thread.java:717)
at hudson.Proc$LocalProc.<init>(Proc.java:258)
at hudson.Proc$LocalProc.<init>(Proc.java:219)
at hudson.Launcher$LocalLauncher.launch(Launcher.java:937)
at hudson.Launcher$ProcStarter.start(Launcher.java:455)
at org.jenkinsci.plugins.gitclient.CliGitAPIImpl.launchCommandIn(CliGitAPIImpl.java:2168)
... 20 more
Cloning the remote Git repository
Cloning repository https://github.com/apache/kafka.git
> git init <https://builds.apache.org/job/kafka-trunk-jdk14/ws/> # timeout=10
ERROR: Error cloning remote repo 'origin'
hudson.plugins.git.GitException: Could not init <https://builds.apache.org/job/kafka-trunk-jdk14/ws/>
at org.jenkinsci.plugins.gitclient.CliGitAPIImpl$5.execute(CliGitAPIImpl.java:916)
at org.jenkinsci.plugins.gitclient.CliGitAPIImpl$2.execute(CliGitAPIImpl.java:708)
at org.jenkinsci.plugins.gitclient.RemoteGitImpl$CommandInvocationHandler$1.call(RemoteGitImpl.java:153)
at org.jenkinsci.plugins.gitclient.RemoteGitImpl$CommandInvocationHandler$1.call(RemoteGitImpl.java:146)
at hudson.remoting.UserRequest.perform(UserRequest.java:212)
at hudson.remoting.UserRequest.perform(UserRequest.java:54)
at hudson.remoting.Request$2.run(Request.java:369)
at hudson.remoting.InterceptingExecutorService$1.call(InterceptingExecutorService.java:72)
at java.util.concurrent.FutureTask.run(FutureTask.java:266)
at java.util.concurrent.ThreadPoolExecutor.runWorker(ThreadPoolExecutor.java:1149)
at java.util.concurrent.ThreadPoolExecutor$Worker.run(ThreadPoolExecutor.java:624)
at java.lang.Thread.run(Thread.java:748)
Suppressed: hudson.remoting.Channel$CallSiteStackTrace: Remote call to H23
at hudson.remoting.Channel.attachCallSiteStackTrace(Channel.java:1743)
at hudson.remoting.UserRequest$ExceptionResponse.retrieve(UserRequest.java:357)
at hudson.remoting.Channel.call(Channel.java:957)
at org.jenkinsci.plugins.gitclient.RemoteGitImpl$CommandInvocationHandler.execute(RemoteGitImpl.java:146)
at sun.reflect.GeneratedMethodAccessor1196.invoke(Unknown Source)
at sun.reflect.DelegatingMethodAccessorImpl.invoke(DelegatingMethodAccessorImpl.java:43)
at java.lang.reflect.Method.invoke(Method.java:498)
at org.jenkinsci.plugins.gitclient.RemoteGitImpl$CommandInvocationHandler.invoke(RemoteGitImpl.java:132)
at com.sun.proxy.$Proxy137.execute(Unknown Source)
at hudson.plugins.git.GitSCM.retrieveChanges(GitSCM.java:1152)
at hudson.plugins.git.GitSCM.checkout(GitSCM.java:1192)
at hudson.scm.SCM.checkout(SCM.java:504)
at hudson.model.AbstractProject.checkout(AbstractProject.java:1208)
at hudson.model.AbstractBuild$AbstractBuildExecution.defaultCheckout(AbstractBuild.java:574)
at jenkins.scm.SCMCheckoutStrategy.checkout(SCMCheckoutStrategy.java:86)
at hudson.model.AbstractBuild$AbstractBuildExecution.run(AbstractBuild.java:499)
at hudson.model.Run.execute(Run.java:1815)
at hudson.model.FreeStyleBuild.run(FreeStyleBuild.java:43)
at hudson.model.ResourceController.execute(ResourceController.java:97)
at hudson.model.Executor.run(Executor.java:429)
Caused by: hudson.plugins.git.GitException: Error performing git command
at org.jenkinsci.plugins.gitclient.CliGitAPIImpl.launchCommandIn(CliGitAPIImpl.java:2181)
at org.jenkinsci.plugins.gitclient.CliGitAPIImpl.launchCommandIn(CliGitAPIImpl.java:2140)
at org.jenkinsci.plugins.gitclient.CliGitAPIImpl.launchCommandIn(CliGitAPIImpl.java:2136)
at org.jenkinsci.plugins.gitclient.CliGitAPIImpl.launchCommand(CliGitAPIImpl.java:1741)
at org.jenkinsci.plugins.gitclient.CliGitAPIImpl$5.execute(CliGitAPIImpl.java:914)
... 11 more
Caused by: java.lang.OutOfMemoryError: unable to create new native thread
at java.lang.Thread.start0(Native Method)
at java.lang.Thread.start(Thread.java:717)
at hudson.Proc$LocalProc.<init>(Proc.java:258)
at hudson.Proc$LocalProc.<init>(Proc.java:219)
at hudson.Launcher$LocalLauncher.launch(Launcher.java:937)
at hudson.Launcher$ProcStarter.start(Launcher.java:455)
at org.jenkinsci.plugins.gitclient.CliGitAPIImpl.launchCommandIn(CliGitAPIImpl.java:2168)
... 15 more
ERROR: Error cloning remote repo 'origin'
Recording test results
ERROR: Step ?Publish JUnit test result report? failed: No test report files were found. Configuration error?
Not sending mail to unregistered user noreply@github.com