You are viewing a plain text version of this content. The canonical link for it is here.
Posted to issues@tez.apache.org by Apache Jenkins Server <je...@builds.apache.org> on 2015/10/08 04:00:52 UTC

Failed: TEZ-604 PreCommit Build #1196

Jira: https://issues.apache.org/jira/browse/TEZ-604
Build: https://builds.apache.org/job/PreCommit-TEZ-Build/1196/

###################################################################################
########################## LAST 60 LINES OF THE CONSOLE ###########################
[...truncated 2926 lines...]
[ERROR] 
[ERROR] After correcting the problems, you can resume the build with the command
[ERROR]   mvn <goals> -rf :tez-tests




{color:red}-1 overall{color}.  Here are the results of testing the latest attachment
  http://issues.apache.org/jira/secure/attachment/12732686/TEZ-604.1.patch
  against master revision 92e8927.

    {color:green}+1 @author{color}.  The patch does not contain any @author tags.

    {color:red}-1 tests included{color}.  The patch doesn't appear to include any new or modified tests.
                        Please justify why no new tests are needed for this patch.
                        Also please list what manual steps were performed to verify this patch.

    {color:green}+1 javac{color}.  The applied patch does not increase the total number of javac compiler warnings.

    {color:green}+1 javadoc{color}.  There were no new javadoc warning messages.

    {color:green}+1 findbugs{color}.  The patch does not introduce any new Findbugs (version 3.0.1) warnings.

    {color:green}+1 release audit{color}.  The applied patch does not increase the total number of release audit warnings.

    {color:red}-1 core tests{color}.  The following test timeouts occurred in :
 org.apache.tez.test.TestDAGRecovery2

Test results: https://builds.apache.org/job/PreCommit-TEZ-Build/1196//testReport/
Console output: https://builds.apache.org/job/PreCommit-TEZ-Build/1196//console

This message is automatically generated.


======================================================================
======================================================================
    Adding comment to Jira.
======================================================================
======================================================================


Comment added.
b62c9e9c33c110416cfd82dfde30536229dff0b3 logged out


======================================================================
======================================================================
    Finished build.
======================================================================
======================================================================


Build step 'Execute shell' marked build as failure
Archiving artifacts
Compressed 3.10 MB of artifacts by 10.1% relative to #1190
[description-setter] Could not determine description.
Recording test results
Email was triggered for: Failure - Any
Sending email for trigger: Failure - Any



###################################################################################
############################## FAILED TESTS (if any) ##############################
All tests passed