You are viewing a plain text version of this content. The canonical link for it is here.
Posted to dev@kafka.apache.org by Apache Jenkins Server <je...@builds.apache.org> on 2019/07/30 04:39:38 UTC

Build failed in Jenkins: kafka-trunk-jdk8 #3817

See <https://builds.apache.org/job/kafka-trunk-jdk8/3817/display/redirect?page=changes>

Changes:

[cmccabe] KAFKA-8345: KIP-455 Protocol changes (part 1) (#7114)

------------------------------------------
[...truncated 6.47 MB...]

org.apache.kafka.connect.data.SchemaProjectorTest > testStructAddField PASSED

org.apache.kafka.connect.data.SchemaProjectorTest > testStructRemoveField STARTED

org.apache.kafka.connect.data.SchemaProjectorTest > testStructRemoveField PASSED

org.apache.kafka.connect.data.SchemaProjectorTest > testStructDefaultValue STARTED

org.apache.kafka.connect.data.SchemaProjectorTest > testStructDefaultValue PASSED

org.apache.kafka.connect.data.SchemaProjectorTest > testProjectMissingDefaultValuedStructField STARTED

org.apache.kafka.connect.data.SchemaProjectorTest > testProjectMissingDefaultValuedStructField PASSED

org.apache.kafka.connect.data.SchemaProjectorTest > testPrimitiveOptionalProjection STARTED

org.apache.kafka.connect.data.SchemaProjectorTest > testPrimitiveOptionalProjection PASSED

org.apache.kafka.connect.data.SchemaProjectorTest > testProjectMissingOptionalStructField STARTED

org.apache.kafka.connect.data.SchemaProjectorTest > testProjectMissingOptionalStructField PASSED

org.apache.kafka.connect.data.SchemaProjectorTest > testMaybeCompatible STARTED

org.apache.kafka.connect.data.SchemaProjectorTest > testMaybeCompatible PASSED

org.apache.kafka.connect.data.FieldTest > testEquality STARTED

org.apache.kafka.connect.data.FieldTest > testEquality PASSED

org.apache.kafka.connect.storage.StringConverterTest > testBytesNullToString STARTED

org.apache.kafka.connect.storage.StringConverterTest > testBytesNullToString PASSED

org.apache.kafka.connect.storage.StringConverterTest > testToBytesNonUtf8Encoding STARTED

org.apache.kafka.connect.storage.StringConverterTest > testToBytesNonUtf8Encoding PASSED

org.apache.kafka.connect.storage.StringConverterTest > testNonStringToBytes STARTED

org.apache.kafka.connect.storage.StringConverterTest > testNonStringToBytes PASSED

org.apache.kafka.connect.storage.StringConverterTest > testBytesToStringNonUtf8Encoding STARTED

org.apache.kafka.connect.storage.StringConverterTest > testBytesToStringNonUtf8Encoding PASSED

org.apache.kafka.connect.storage.StringConverterTest > testNullToBytes STARTED

org.apache.kafka.connect.storage.StringConverterTest > testNullToBytes PASSED

org.apache.kafka.connect.storage.StringConverterTest > testNullHeaderValueToBytes STARTED

org.apache.kafka.connect.storage.StringConverterTest > testNullHeaderValueToBytes PASSED

org.apache.kafka.connect.storage.StringConverterTest > testStringHeaderValueToBytes STARTED

org.apache.kafka.connect.storage.StringConverterTest > testStringHeaderValueToBytes PASSED

org.apache.kafka.connect.storage.StringConverterTest > testToBytesIgnoresSchema STARTED

org.apache.kafka.connect.storage.StringConverterTest > testToBytesIgnoresSchema PASSED

org.apache.kafka.connect.storage.StringConverterTest > testNonStringHeaderValueToBytes STARTED

org.apache.kafka.connect.storage.StringConverterTest > testNonStringHeaderValueToBytes PASSED

org.apache.kafka.connect.storage.StringConverterTest > testStringToBytes STARTED

org.apache.kafka.connect.storage.StringConverterTest > testStringToBytes PASSED

org.apache.kafka.connect.storage.StringConverterTest > testBytesToString STARTED

org.apache.kafka.connect.storage.StringConverterTest > testBytesToString PASSED

org.apache.kafka.connect.storage.SimpleHeaderConverterTest > shouldConvertEmptyListToListWithoutSchema STARTED

org.apache.kafka.connect.storage.SimpleHeaderConverterTest > shouldConvertEmptyListToListWithoutSchema PASSED

org.apache.kafka.connect.storage.SimpleHeaderConverterTest > shouldConvertStringWithQuotesAndOtherDelimiterCharacters STARTED

org.apache.kafka.connect.storage.SimpleHeaderConverterTest > shouldConvertStringWithQuotesAndOtherDelimiterCharacters PASSED

org.apache.kafka.connect.storage.SimpleHeaderConverterTest > shouldConvertListWithMixedValuesToListWithoutSchema STARTED

org.apache.kafka.connect.storage.SimpleHeaderConverterTest > shouldConvertListWithMixedValuesToListWithoutSchema PASSED

org.apache.kafka.connect.storage.SimpleHeaderConverterTest > shouldConvertMapWithStringKeys STARTED

org.apache.kafka.connect.storage.SimpleHeaderConverterTest > shouldConvertMapWithStringKeys PASSED

org.apache.kafka.connect.storage.SimpleHeaderConverterTest > shouldParseStringOfMapWithStringValuesWithWhitespaceAsMap STARTED

org.apache.kafka.connect.storage.SimpleHeaderConverterTest > shouldParseStringOfMapWithStringValuesWithWhitespaceAsMap PASSED

org.apache.kafka.connect.storage.SimpleHeaderConverterTest > shouldConvertMapWithStringKeysAndShortValues STARTED

org.apache.kafka.connect.storage.SimpleHeaderConverterTest > shouldConvertMapWithStringKeysAndShortValues PASSED

org.apache.kafka.connect.storage.SimpleHeaderConverterTest > shouldParseStringOfMapWithStringValuesWithoutWhitespaceAsMap STARTED

org.apache.kafka.connect.storage.SimpleHeaderConverterTest > shouldParseStringOfMapWithStringValuesWithoutWhitespaceAsMap PASSED

org.apache.kafka.connect.storage.SimpleHeaderConverterTest > shouldConvertSimpleString STARTED

org.apache.kafka.connect.storage.SimpleHeaderConverterTest > shouldConvertSimpleString PASSED

org.apache.kafka.connect.storage.SimpleHeaderConverterTest > shouldConvertEmptyMapToMapWithoutSchema STARTED

org.apache.kafka.connect.storage.SimpleHeaderConverterTest > shouldConvertEmptyMapToMapWithoutSchema PASSED

org.apache.kafka.connect.storage.SimpleHeaderConverterTest > shouldConvertEmptyString STARTED

org.apache.kafka.connect.storage.SimpleHeaderConverterTest > shouldConvertEmptyString PASSED

org.apache.kafka.connect.storage.SimpleHeaderConverterTest > shouldConvertMapWithStringKeysAndMixedValuesToMapWithoutSchema STARTED

org.apache.kafka.connect.storage.SimpleHeaderConverterTest > shouldConvertMapWithStringKeysAndMixedValuesToMapWithoutSchema PASSED

org.apache.kafka.connect.storage.SimpleHeaderConverterTest > shouldParseStringOfMapWithIntValuesWithoutWhitespaceAsMap STARTED

org.apache.kafka.connect.storage.SimpleHeaderConverterTest > shouldParseStringOfMapWithIntValuesWithoutWhitespaceAsMap PASSED

org.apache.kafka.connect.storage.SimpleHeaderConverterTest > shouldParseStringOfMapWithShortValuesWithWhitespaceAsMap STARTED

org.apache.kafka.connect.storage.SimpleHeaderConverterTest > shouldParseStringOfMapWithShortValuesWithWhitespaceAsMap PASSED

org.apache.kafka.connect.storage.SimpleHeaderConverterTest > shouldConvertMapWithStringKeysAndIntegerValues STARTED

org.apache.kafka.connect.storage.SimpleHeaderConverterTest > shouldConvertMapWithStringKeysAndIntegerValues PASSED

org.apache.kafka.connect.storage.SimpleHeaderConverterTest > shouldConvertNullValue STARTED

org.apache.kafka.connect.storage.SimpleHeaderConverterTest > shouldConvertNullValue PASSED

org.apache.kafka.connect.storage.SimpleHeaderConverterTest > shouldParseStringOfMapWithShortValuesWithoutWhitespaceAsMap STARTED

org.apache.kafka.connect.storage.SimpleHeaderConverterTest > shouldParseStringOfMapWithShortValuesWithoutWhitespaceAsMap PASSED

org.apache.kafka.connect.storage.SimpleHeaderConverterTest > shouldConvertListWithStringValues STARTED

org.apache.kafka.connect.storage.SimpleHeaderConverterTest > shouldConvertListWithStringValues PASSED

org.apache.kafka.connect.storage.SimpleHeaderConverterTest > shouldParseStringOfMapWithIntValuesWithWhitespaceAsMap STARTED

org.apache.kafka.connect.storage.SimpleHeaderConverterTest > shouldParseStringOfMapWithIntValuesWithWhitespaceAsMap PASSED

org.apache.kafka.connect.storage.SimpleHeaderConverterTest > shouldConvertListWithIntegerValues STARTED

org.apache.kafka.connect.storage.SimpleHeaderConverterTest > shouldConvertListWithIntegerValues PASSED

org.apache.kafka.connect.storage.ConverterTypeTest > shouldFindByName STARTED

org.apache.kafka.connect.storage.ConverterTypeTest > shouldFindByName PASSED

org.apache.kafka.connect.connector.ConnectorReconfigurationTest > testReconfigureStopException STARTED

org.apache.kafka.connect.connector.ConnectorReconfigurationTest > testReconfigureStopException PASSED

org.apache.kafka.connect.connector.ConnectorReconfigurationTest > testDefaultReconfigure STARTED

org.apache.kafka.connect.connector.ConnectorReconfigurationTest > testDefaultReconfigure PASSED

org.apache.kafka.connect.source.SourceRecordTest > shouldDuplicateRecordAndCloneHeaders STARTED

org.apache.kafka.connect.source.SourceRecordTest > shouldDuplicateRecordAndCloneHeaders PASSED

org.apache.kafka.connect.source.SourceRecordTest > shouldDuplicateRecordUsingNewHeaders STARTED

org.apache.kafka.connect.source.SourceRecordTest > shouldDuplicateRecordUsingNewHeaders PASSED

org.apache.kafka.connect.source.SourceRecordTest > shouldModifyRecordHeader STARTED

org.apache.kafka.connect.source.SourceRecordTest > shouldModifyRecordHeader PASSED

org.apache.kafka.connect.source.SourceRecordTest > shouldCreateSinkRecordWithHeaders STARTED

org.apache.kafka.connect.source.SourceRecordTest > shouldCreateSinkRecordWithHeaders PASSED

org.apache.kafka.connect.source.SourceRecordTest > shouldCreateSinkRecordWithEmtpyHeaders STARTED

org.apache.kafka.connect.source.SourceRecordTest > shouldCreateSinkRecordWithEmtpyHeaders PASSED

org.apache.kafka.connect.util.ConnectorUtilsTest > testGroupPartitions STARTED

org.apache.kafka.connect.util.ConnectorUtilsTest > testGroupPartitions PASSED

org.apache.kafka.connect.util.ConnectorUtilsTest > testGroupPartitionsInvalidCount STARTED

org.apache.kafka.connect.util.ConnectorUtilsTest > testGroupPartitionsInvalidCount PASSED

> Task :streams:examples:test

org.apache.kafka.streams.examples.wordcount.WordCountProcessorTest > test STARTED

org.apache.kafka.streams.examples.wordcount.WordCountProcessorTest > test PASSED

FAILURE: Build failed with an exception.

* What went wrong:
Execution failed for task ':connect:runtime:test'.
> There were failing tests. See the report at: file://<https://builds.apache.org/job/kafka-trunk-jdk8/ws/connect/runtime/build/reports/tests/test/index.html>

* Try:
Run with --stacktrace option to get the stack trace. Run with --info or --debug option to get more log output. Run with --scan to get full insights.

* Get more help at https://help.gradle.org

Deprecated Gradle features were used in this build, making it incompatible with Gradle 6.0.
Use '--warning-mode all' to show the individual deprecation warnings.
See https://docs.gradle.org/5.4.1/userguide/command_line_interface.html#sec:command_line_warnings

BUILD FAILED in 3h 22m 37s
178 actionable tasks: 175 executed, 3 up-to-date
Build step 'Execute shell' marked build as failure
[FINDBUGS] Collecting findbugs analysis files...
Setting GRADLE_4_8_1_HOME=/home/jenkins/tools/gradle/4.8.1
[FINDBUGS] Searching for all files in <https://builds.apache.org/job/kafka-trunk-jdk8/ws/> that match the pattern **/build/reports/*bugs/*.xml
[FINDBUGS] Parsing 17 files in <https://builds.apache.org/job/kafka-trunk-jdk8/ws/>
[FINDBUGS] Successfully parsed file <https://builds.apache.org/job/kafka-trunk-jdk8/ws/clients/build/reports/spotbugs/main.xml> with 0 unique warnings and 0 duplicates.
[FINDBUGS] Successfully parsed file <https://builds.apache.org/job/kafka-trunk-jdk8/ws/connect/api/build/reports/spotbugs/main.xml> with 0 unique warnings and 0 duplicates.
[FINDBUGS] Successfully parsed file <https://builds.apache.org/job/kafka-trunk-jdk8/ws/connect/basic-auth-extension/build/reports/spotbugs/main.xml> with 0 unique warnings and 0 duplicates.
[FINDBUGS] Successfully parsed file <https://builds.apache.org/job/kafka-trunk-jdk8/ws/connect/file/build/reports/spotbugs/main.xml> with 0 unique warnings and 0 duplicates.
[FINDBUGS] Successfully parsed file <https://builds.apache.org/job/kafka-trunk-jdk8/ws/connect/json/build/reports/spotbugs/main.xml> with 0 unique warnings and 0 duplicates.
[FINDBUGS] Successfully parsed file <https://builds.apache.org/job/kafka-trunk-jdk8/ws/connect/runtime/build/reports/spotbugs/main.xml> with 0 unique warnings and 0 duplicates.
[FINDBUGS] Successfully parsed file <https://builds.apache.org/job/kafka-trunk-jdk8/ws/connect/transforms/build/reports/spotbugs/main.xml> with 0 unique warnings and 0 duplicates.
[FINDBUGS] Successfully parsed file <https://builds.apache.org/job/kafka-trunk-jdk8/ws/core/build/reports/spotbugs/main.xml> with 0 unique warnings and 0 duplicates.
[FINDBUGS] Successfully parsed file <https://builds.apache.org/job/kafka-trunk-jdk8/ws/examples/build/reports/spotbugs/main.xml> with 0 unique warnings and 0 duplicates.
[FINDBUGS] Successfully parsed file <https://builds.apache.org/job/kafka-trunk-jdk8/ws/generator/build/reports/spotbugs/main.xml> with 0 unique warnings and 0 duplicates.
[FINDBUGS] Successfully parsed file <https://builds.apache.org/job/kafka-trunk-jdk8/ws/jmh-benchmarks/build/reports/spotbugs/main.xml> with 0 unique warnings and 0 duplicates.
[FINDBUGS] Successfully parsed file <https://builds.apache.org/job/kafka-trunk-jdk8/ws/log4j-appender/build/reports/spotbugs/main.xml> with 0 unique warnings and 0 duplicates.
[FINDBUGS] Successfully parsed file <https://builds.apache.org/job/kafka-trunk-jdk8/ws/streams/build/reports/spotbugs/main.xml> with 0 unique warnings and 0 duplicates.
[FINDBUGS] Successfully parsed file <https://builds.apache.org/job/kafka-trunk-jdk8/ws/streams/examples/build/reports/spotbugs/main.xml> with 0 unique warnings and 0 duplicates.
[FINDBUGS] Successfully parsed file <https://builds.apache.org/job/kafka-trunk-jdk8/ws/streams/streams-scala/build/reports/spotbugs/main.xml> with 0 unique warnings and 0 duplicates.
[FINDBUGS] Successfully parsed file <https://builds.apache.org/job/kafka-trunk-jdk8/ws/streams/test-utils/build/reports/spotbugs/main.xml> with 0 unique warnings and 0 duplicates.
[FINDBUGS] Successfully parsed file <https://builds.apache.org/job/kafka-trunk-jdk8/ws/tools/build/reports/spotbugs/main.xml> with 0 unique warnings and 0 duplicates.
Setting GRADLE_4_8_1_HOME=/home/jenkins/tools/gradle/4.8.1
No credentials specified
Setting GRADLE_4_8_1_HOME=/home/jenkins/tools/gradle/4.8.1
<Git Blamer> Using GitBlamer to create author and commit information for all warnings.
<Git Blamer> GIT_COMMIT=81900d0ba0a5839a1e5dc876897bab1c24b3bd94, workspace=<https://builds.apache.org/job/kafka-trunk-jdk8/ws/>
[FINDBUGS] Computing warning deltas based on reference build #3796
Recording test results
Setting GRADLE_4_8_1_HOME=/home/jenkins/tools/gradle/4.8.1
Setting GRADLE_4_8_1_HOME=/home/jenkins/tools/gradle/4.8.1
Not sending mail to unregistered user ismael@juma.me.uk
Not sending mail to unregistered user noreply@github.com
Not sending mail to unregistered user wangguoz@gmail.com
Not sending mail to unregistered user rajinisivaram@googlemail.com

Jenkins build is back to normal : kafka-trunk-jdk8 #3819

Posted by Apache Jenkins Server <je...@builds.apache.org>.
See <https://builds.apache.org/job/kafka-trunk-jdk8/3819/display/redirect?page=changes>


Build failed in Jenkins: kafka-trunk-jdk8 #3818

Posted by Apache Jenkins Server <je...@builds.apache.org>.
See <https://builds.apache.org/job/kafka-trunk-jdk8/3818/display/redirect>

------------------------------------------
[...truncated 6.46 MB...]

org.apache.kafka.connect.json.JsonConverterTest > structToConnect PASSED

org.apache.kafka.connect.json.JsonConverterTest > stringToJson STARTED

org.apache.kafka.connect.json.JsonConverterTest > stringToJson PASSED

org.apache.kafka.connect.json.JsonConverterTest > nullSchemaAndArrayToJson STARTED

org.apache.kafka.connect.json.JsonConverterTest > nullSchemaAndArrayToJson PASSED

org.apache.kafka.connect.json.JsonConverterTest > byteToConnect STARTED

org.apache.kafka.connect.json.JsonConverterTest > byteToConnect PASSED

org.apache.kafka.connect.json.JsonConverterTest > nullSchemaPrimitiveToConnect STARTED

org.apache.kafka.connect.json.JsonConverterTest > nullSchemaPrimitiveToConnect PASSED

org.apache.kafka.connect.json.JsonConverterTest > byteToJson STARTED

org.apache.kafka.connect.json.JsonConverterTest > byteToJson PASSED

org.apache.kafka.connect.json.JsonConverterTest > intToConnect STARTED

org.apache.kafka.connect.json.JsonConverterTest > intToConnect PASSED

org.apache.kafka.connect.json.JsonConverterTest > dateToJson STARTED

org.apache.kafka.connect.json.JsonConverterTest > dateToJson PASSED

org.apache.kafka.connect.json.JsonConverterTest > noSchemaToConnect STARTED

org.apache.kafka.connect.json.JsonConverterTest > noSchemaToConnect PASSED

org.apache.kafka.connect.json.JsonConverterTest > noSchemaToJson STARTED

org.apache.kafka.connect.json.JsonConverterTest > noSchemaToJson PASSED

org.apache.kafka.connect.json.JsonConverterTest > nullSchemaAndPrimitiveToJson STARTED

org.apache.kafka.connect.json.JsonConverterTest > nullSchemaAndPrimitiveToJson PASSED

org.apache.kafka.connect.json.JsonConverterTest > decimalToConnectOptionalWithDefaultValue STARTED

org.apache.kafka.connect.json.JsonConverterTest > decimalToConnectOptionalWithDefaultValue PASSED

org.apache.kafka.connect.json.JsonConverterTest > mapToJsonStringKeys STARTED

org.apache.kafka.connect.json.JsonConverterTest > mapToJsonStringKeys PASSED

org.apache.kafka.connect.json.JsonConverterTest > arrayToJson STARTED

org.apache.kafka.connect.json.JsonConverterTest > arrayToJson PASSED

org.apache.kafka.connect.json.JsonConverterTest > nullToConnect STARTED

org.apache.kafka.connect.json.JsonConverterTest > nullToConnect PASSED

org.apache.kafka.connect.json.JsonConverterTest > timeToJson STARTED

org.apache.kafka.connect.json.JsonConverterTest > timeToJson PASSED

org.apache.kafka.connect.json.JsonConverterTest > structToJson STARTED

org.apache.kafka.connect.json.JsonConverterTest > structToJson PASSED

org.apache.kafka.connect.json.JsonConverterTest > testConnectSchemaMetadataTranslation STARTED

org.apache.kafka.connect.json.JsonConverterTest > testConnectSchemaMetadataTranslation PASSED

org.apache.kafka.connect.json.JsonConverterTest > shortToJson STARTED

org.apache.kafka.connect.json.JsonConverterTest > shortToJson PASSED

org.apache.kafka.connect.json.JsonConverterTest > dateToConnect STARTED

org.apache.kafka.connect.json.JsonConverterTest > dateToConnect PASSED

org.apache.kafka.connect.json.JsonConverterTest > doubleToJson STARTED

org.apache.kafka.connect.json.JsonConverterTest > doubleToJson PASSED

org.apache.kafka.connect.json.JsonConverterTest > testStringHeaderToJson STARTED

org.apache.kafka.connect.json.JsonConverterTest > testStringHeaderToJson PASSED

org.apache.kafka.connect.json.JsonConverterTest > decimalToConnectOptional STARTED

org.apache.kafka.connect.json.JsonConverterTest > decimalToConnectOptional PASSED

org.apache.kafka.connect.json.JsonConverterTest > structSchemaIdentical STARTED

org.apache.kafka.connect.json.JsonConverterTest > structSchemaIdentical PASSED

org.apache.kafka.connect.json.JsonConverterTest > timeToConnectWithDefaultValue STARTED

org.apache.kafka.connect.json.JsonConverterTest > timeToConnectWithDefaultValue PASSED

org.apache.kafka.connect.json.JsonConverterTest > timeToConnect STARTED

org.apache.kafka.connect.json.JsonConverterTest > timeToConnect PASSED

org.apache.kafka.connect.json.JsonConverterTest > dateToConnectOptionalWithDefaultValue STARTED

org.apache.kafka.connect.json.JsonConverterTest > dateToConnectOptionalWithDefaultValue PASSED

org.apache.kafka.connect.json.JsonConverterTest > mapToConnectStringKeys STARTED

org.apache.kafka.connect.json.JsonConverterTest > mapToConnectStringKeys PASSED

org.apache.kafka.connect.json.JsonConverterTest > dateToConnectOptional STARTED

org.apache.kafka.connect.json.JsonConverterTest > dateToConnectOptional PASSED

org.apache.kafka.connect.json.JsonConverterTest > timeToConnectOptionalWithDefaultValue STARTED

org.apache.kafka.connect.json.JsonConverterTest > timeToConnectOptionalWithDefaultValue PASSED

org.apache.kafka.connect.json.JsonConverterTest > floatToConnect STARTED

org.apache.kafka.connect.json.JsonConverterTest > floatToConnect PASSED

org.apache.kafka.connect.json.JsonConverterTest > decimalToConnectWithDefaultValue STARTED

org.apache.kafka.connect.json.JsonConverterTest > decimalToConnectWithDefaultValue PASSED

org.apache.kafka.connect.json.JsonConverterTest > decimalToJson STARTED

org.apache.kafka.connect.json.JsonConverterTest > decimalToJson PASSED

org.apache.kafka.connect.json.JsonConverterTest > arrayToConnect STARTED

org.apache.kafka.connect.json.JsonConverterTest > arrayToConnect PASSED

org.apache.kafka.connect.json.JsonConverterTest > testCacheSchemaToConnectConversion STARTED

org.apache.kafka.connect.json.JsonConverterTest > testCacheSchemaToConnectConversion PASSED

org.apache.kafka.connect.json.JsonConverterTest > booleanToJson STARTED

org.apache.kafka.connect.json.JsonConverterTest > booleanToJson PASSED

org.apache.kafka.connect.json.JsonConverterTest > bytesToConnect STARTED

org.apache.kafka.connect.json.JsonConverterTest > bytesToConnect PASSED

org.apache.kafka.connect.json.JsonConverterTest > doubleToConnect STARTED

org.apache.kafka.connect.json.JsonConverterTest > doubleToConnect PASSED

org.apache.kafka.connect.json.JsonConverterTest > timestampToConnectOptionalWithDefaultValue STARTED

org.apache.kafka.connect.json.JsonConverterTest > timestampToConnectOptionalWithDefaultValue PASSED

> Task :connect:basic-auth-extension:test

org.apache.kafka.connect.rest.basic.auth.extension.JaasBasicAuthFilterTest > testSuccess STARTED

org.apache.kafka.connect.rest.basic.auth.extension.JaasBasicAuthFilterTest > testSuccess PASSED

org.apache.kafka.connect.rest.basic.auth.extension.JaasBasicAuthFilterTest > testBadCredential STARTED

org.apache.kafka.connect.rest.basic.auth.extension.JaasBasicAuthFilterTest > testBadCredential PASSED

org.apache.kafka.connect.rest.basic.auth.extension.JaasBasicAuthFilterTest > testBadPassword STARTED

org.apache.kafka.connect.rest.basic.auth.extension.JaasBasicAuthFilterTest > testBadPassword PASSED

org.apache.kafka.connect.rest.basic.auth.extension.JaasBasicAuthFilterTest > testUnknownBearer STARTED

org.apache.kafka.connect.rest.basic.auth.extension.JaasBasicAuthFilterTest > testUnknownBearer PASSED

org.apache.kafka.connect.rest.basic.auth.extension.JaasBasicAuthFilterTest > testUnknownLoginModule STARTED

org.apache.kafka.connect.rest.basic.auth.extension.JaasBasicAuthFilterTest > testUnknownLoginModule PASSED

org.apache.kafka.connect.rest.basic.auth.extension.JaasBasicAuthFilterTest > testUnknownCredentialsFile STARTED

org.apache.kafka.connect.rest.basic.auth.extension.JaasBasicAuthFilterTest > testUnknownCredentialsFile PASSED

org.apache.kafka.connect.rest.basic.auth.extension.JaasBasicAuthFilterTest > testEmptyCredentialsFile STARTED

org.apache.kafka.connect.rest.basic.auth.extension.JaasBasicAuthFilterTest > testEmptyCredentialsFile PASSED

org.apache.kafka.connect.rest.basic.auth.extension.JaasBasicAuthFilterTest > testNoFileOption STARTED

org.apache.kafka.connect.rest.basic.auth.extension.JaasBasicAuthFilterTest > testNoFileOption PASSED

org.apache.kafka.connect.rest.basic.auth.extension.JaasBasicAuthFilterTest > testPostWithoutAppropriateCredential STARTED

org.apache.kafka.connect.rest.basic.auth.extension.JaasBasicAuthFilterTest > testPostWithoutAppropriateCredential PASSED

org.apache.kafka.connect.rest.basic.auth.extension.JaasBasicAuthFilterTest > testPostNotChangingConnectorTask STARTED

org.apache.kafka.connect.rest.basic.auth.extension.JaasBasicAuthFilterTest > testPostNotChangingConnectorTask PASSED

FAILURE: Build failed with an exception.

* What went wrong:
Execution failed for task ':connect:runtime:test'.
> There were failing tests. See the report at: file://<https://builds.apache.org/job/kafka-trunk-jdk8/ws/connect/runtime/build/reports/tests/test/index.html>

* Try:
Run with --stacktrace option to get the stack trace. Run with --info or --debug option to get more log output. Run with --scan to get full insights.

* Get more help at https://help.gradle.org

Deprecated Gradle features were used in this build, making it incompatible with Gradle 6.0.
Use '--warning-mode all' to show the individual deprecation warnings.
See https://docs.gradle.org/5.4.1/userguide/command_line_interface.html#sec:command_line_warnings

BUILD FAILED in 3h 22m 11s
178 actionable tasks: 175 executed, 3 up-to-date
Build step 'Execute shell' marked build as failure
[FINDBUGS] Collecting findbugs analysis files...
Setting GRADLE_4_10_3_HOME=/home/jenkins/tools/gradle/4.10.3
[FINDBUGS] Searching for all files in <https://builds.apache.org/job/kafka-trunk-jdk8/ws/> that match the pattern **/build/reports/*bugs/*.xml
[FINDBUGS] Parsing 17 files in <https://builds.apache.org/job/kafka-trunk-jdk8/ws/>
[FINDBUGS] Successfully parsed file <https://builds.apache.org/job/kafka-trunk-jdk8/ws/clients/build/reports/spotbugs/main.xml> with 0 unique warnings and 0 duplicates.
[FINDBUGS] Successfully parsed file <https://builds.apache.org/job/kafka-trunk-jdk8/ws/connect/api/build/reports/spotbugs/main.xml> with 0 unique warnings and 0 duplicates.
[FINDBUGS] Successfully parsed file <https://builds.apache.org/job/kafka-trunk-jdk8/ws/connect/basic-auth-extension/build/reports/spotbugs/main.xml> with 0 unique warnings and 0 duplicates.
[FINDBUGS] Successfully parsed file <https://builds.apache.org/job/kafka-trunk-jdk8/ws/connect/file/build/reports/spotbugs/main.xml> with 0 unique warnings and 0 duplicates.
[FINDBUGS] Successfully parsed file <https://builds.apache.org/job/kafka-trunk-jdk8/ws/connect/json/build/reports/spotbugs/main.xml> with 0 unique warnings and 0 duplicates.
[FINDBUGS] Successfully parsed file <https://builds.apache.org/job/kafka-trunk-jdk8/ws/connect/runtime/build/reports/spotbugs/main.xml> with 0 unique warnings and 0 duplicates.
[FINDBUGS] Successfully parsed file <https://builds.apache.org/job/kafka-trunk-jdk8/ws/connect/transforms/build/reports/spotbugs/main.xml> with 0 unique warnings and 0 duplicates.
[FINDBUGS] Successfully parsed file <https://builds.apache.org/job/kafka-trunk-jdk8/ws/core/build/reports/spotbugs/main.xml> with 0 unique warnings and 0 duplicates.
[FINDBUGS] Successfully parsed file <https://builds.apache.org/job/kafka-trunk-jdk8/ws/examples/build/reports/spotbugs/main.xml> with 0 unique warnings and 0 duplicates.
[FINDBUGS] Successfully parsed file <https://builds.apache.org/job/kafka-trunk-jdk8/ws/generator/build/reports/spotbugs/main.xml> with 0 unique warnings and 0 duplicates.
[FINDBUGS] Successfully parsed file <https://builds.apache.org/job/kafka-trunk-jdk8/ws/jmh-benchmarks/build/reports/spotbugs/main.xml> with 0 unique warnings and 0 duplicates.
[FINDBUGS] Successfully parsed file <https://builds.apache.org/job/kafka-trunk-jdk8/ws/log4j-appender/build/reports/spotbugs/main.xml> with 0 unique warnings and 0 duplicates.
[FINDBUGS] Successfully parsed file <https://builds.apache.org/job/kafka-trunk-jdk8/ws/streams/build/reports/spotbugs/main.xml> with 0 unique warnings and 0 duplicates.
[FINDBUGS] Successfully parsed file <https://builds.apache.org/job/kafka-trunk-jdk8/ws/streams/examples/build/reports/spotbugs/main.xml> with 0 unique warnings and 0 duplicates.
[FINDBUGS] Successfully parsed file <https://builds.apache.org/job/kafka-trunk-jdk8/ws/streams/streams-scala/build/reports/spotbugs/main.xml> with 0 unique warnings and 0 duplicates.
[FINDBUGS] Successfully parsed file <https://builds.apache.org/job/kafka-trunk-jdk8/ws/streams/test-utils/build/reports/spotbugs/main.xml> with 0 unique warnings and 0 duplicates.
[FINDBUGS] Successfully parsed file <https://builds.apache.org/job/kafka-trunk-jdk8/ws/tools/build/reports/spotbugs/main.xml> with 0 unique warnings and 0 duplicates.
Setting GRADLE_4_10_3_HOME=/home/jenkins/tools/gradle/4.10.3
No credentials specified
Setting GRADLE_4_10_3_HOME=/home/jenkins/tools/gradle/4.10.3
<Git Blamer> Using GitBlamer to create author and commit information for all warnings.
<Git Blamer> GIT_COMMIT=81900d0ba0a5839a1e5dc876897bab1c24b3bd94, workspace=<https://builds.apache.org/job/kafka-trunk-jdk8/ws/>
[FINDBUGS] Computing warning deltas based on reference build #3796
Recording test results
Setting GRADLE_4_10_3_HOME=/home/jenkins/tools/gradle/4.10.3
Setting GRADLE_4_10_3_HOME=/home/jenkins/tools/gradle/4.10.3
Not sending mail to unregistered user ismael@juma.me.uk
Not sending mail to unregistered user noreply@github.com
Not sending mail to unregistered user wangguoz@gmail.com
Not sending mail to unregistered user rajinisivaram@googlemail.com