You are viewing a plain text version of this content. The canonical link for it is here.
Posted to dev@lucene.apache.org by Apache Jenkins Server <je...@builds.apache.org> on 2013/12/21 16:41:07 UTC
[JENKINS-MAVEN] Lucene-Solr-Maven-trunk #1057: POMs out of sync
Build: https://builds.apache.org/job/Lucene-Solr-Maven-trunk/1057/
All tests passed
Build Log:
[...truncated 52782 lines...]
[mvn] [INFO] -------------------------------------------------------------
[mvn] [INFO] -------------------------------------------------------------
[mvn] [ERROR] COMPILATION ERROR :
[mvn] [INFO] -------------------------------------------------------------
[...truncated 273 lines...]
BUILD FAILED
/usr/home/hudson/hudson-slave/workspace/Lucene-Solr-Maven-trunk/build.xml:476: The following error occurred while executing this line:
/usr/home/hudson/hudson-slave/workspace/Lucene-Solr-Maven-trunk/build.xml:176: The following error occurred while executing this line:
/usr/home/hudson/hudson-slave/workspace/Lucene-Solr-Maven-trunk/extra-targets.xml:77: Java returned: 1
Total time: 128 minutes 43 seconds
Build step 'Invoke Ant' marked build as failure
Recording test results
Email was triggered for: Failure
Sending email for trigger: Failure
[JENKINS-MAVEN] Lucene-Solr-Maven-trunk #1062: POMs out of sync
Posted by Apache Jenkins Server <je...@builds.apache.org>.
Build: https://builds.apache.org/job/Lucene-Solr-Maven-trunk/1062/
3 tests failed.
REGRESSION: org.apache.solr.morphlines.cell.SolrCellMorphlineTest.testSolrCellDocumentTypes2
Error Message:
key:ignored_creation_date expected:<[2007-10-01T16:13:56Z]> but was:<[२००७-१०-०१T१६:१३:५६Z]>
Stack Trace:
java.lang.AssertionError: key:ignored_creation_date expected:<[2007-10-01T16:13:56Z]> but was:<[२००७-१०-०१T१६:१३:५६Z]>
at __randomizedtesting.SeedInfo.seed([FDF8883C84EFD629:767833DC831945D7]:0)
at org.junit.Assert.fail(Assert.java:93)
at org.junit.Assert.failNotEquals(Assert.java:647)
at org.junit.Assert.assertEquals(Assert.java:128)
at org.apache.solr.morphlines.solr.AbstractSolrMorphlineTestBase.testDocumentTypesInternal(AbstractSolrMorphlineTestBase.java:165)
at org.apache.solr.morphlines.cell.SolrCellMorphlineTest.testSolrCellDocumentTypes2(SolrCellMorphlineTest.java:255)
REGRESSION: org.apache.solr.morphlines.cell.SolrCellMorphlineTest.testSolrCellDocumentTypes
Error Message:
key:ignored_creation_date expected:<[2011-09-02T10:11:00Z]> but was:<[२०११-०९-०२T१०:११:००Z]>
Stack Trace:
java.lang.AssertionError: key:ignored_creation_date expected:<[2011-09-02T10:11:00Z]> but was:<[२०११-०९-०२T१०:११:००Z]>
at __randomizedtesting.SeedInfo.seed([FDF8883C84EFD629:673B2BA2E13488FC]:0)
at org.junit.Assert.fail(Assert.java:93)
at org.junit.Assert.failNotEquals(Assert.java:647)
at org.junit.Assert.assertEquals(Assert.java:128)
at org.apache.solr.morphlines.solr.AbstractSolrMorphlineTestBase.testDocumentTypesInternal(AbstractSolrMorphlineTestBase.java:165)
at org.apache.solr.morphlines.cell.SolrCellMorphlineTest.testSolrCellDocumentTypes(SolrCellMorphlineTest.java:193)
FAILED: org.apache.solr.cloud.BasicDistributedZk2Test.testDistribSearch
Error Message:
No live SolrServers available to handle this request:[http://127.0.0.1:37294/e_h/q/collection1, http://127.0.0.1:13299/e_h/q/collection1]
Stack Trace:
org.apache.solr.client.solrj.SolrServerException: No live SolrServers available to handle this request:[http://127.0.0.1:37294/e_h/q/collection1, http://127.0.0.1:13299/e_h/q/collection1]
at org.apache.solr.client.solrj.impl.HttpSolrServer.request(HttpSolrServer.java:495)
at org.apache.solr.client.solrj.impl.HttpSolrServer.request(HttpSolrServer.java:199)
at org.apache.solr.client.solrj.impl.LBHttpSolrServer.request(LBHttpSolrServer.java:283)
at org.apache.solr.client.solrj.impl.CloudSolrServer.request(CloudSolrServer.java:640)
at org.apache.solr.client.solrj.request.QueryRequest.process(QueryRequest.java:90)
at org.apache.solr.client.solrj.SolrServer.query(SolrServer.java:301)
at org.apache.solr.cloud.AbstractFullDistribZkTestBase.queryServer(AbstractFullDistribZkTestBase.java:1325)
at org.apache.solr.BaseDistributedSearchTestCase.query(BaseDistributedSearchTestCase.java:542)
at org.apache.solr.BaseDistributedSearchTestCase.query(BaseDistributedSearchTestCase.java:521)
at org.apache.solr.cloud.BasicDistributedZk2Test.brindDownShardIndexSomeDocsAndRecover(BasicDistributedZk2Test.java:305)
at org.apache.solr.cloud.BasicDistributedZk2Test.doTest(BasicDistributedZk2Test.java:117)
Build Log:
[...truncated 52807 lines...]
BUILD FAILED
/usr/home/hudson/hudson-slave/workspace/Lucene-Solr-Maven-trunk/build.xml:476: The following error occurred while executing this line:
/usr/home/hudson/hudson-slave/workspace/Lucene-Solr-Maven-trunk/build.xml:176: The following error occurred while executing this line:
/usr/home/hudson/hudson-slave/workspace/Lucene-Solr-Maven-trunk/extra-targets.xml:77: Java returned: 1
Total time: 119 minutes 16 seconds
Build step 'Invoke Ant' marked build as failure
Recording test results
Email was triggered for: Failure
Sending email for trigger: Failure
[JENKINS-MAVEN] Lucene-Solr-Maven-trunk #1061: POMs out of sync
Posted by Apache Jenkins Server <je...@builds.apache.org>.
Build: https://builds.apache.org/job/Lucene-Solr-Maven-trunk/1061/
1 tests failed.
FAILED: org.apache.solr.cloud.BasicDistributedZk2Test.testDistribSearch
Error Message:
No live SolrServers available to handle this request:[http://127.0.0.1:49496/dkg/collection1, http://127.0.0.1:50951/dkg/collection1]
Stack Trace:
org.apache.solr.client.solrj.SolrServerException: No live SolrServers available to handle this request:[http://127.0.0.1:49496/dkg/collection1, http://127.0.0.1:50951/dkg/collection1]
at org.apache.solr.client.solrj.impl.HttpSolrServer.request(HttpSolrServer.java:495)
at org.apache.solr.client.solrj.impl.HttpSolrServer.request(HttpSolrServer.java:199)
at org.apache.solr.client.solrj.impl.LBHttpSolrServer.request(LBHttpSolrServer.java:283)
at org.apache.solr.client.solrj.impl.CloudSolrServer.request(CloudSolrServer.java:640)
at org.apache.solr.client.solrj.request.QueryRequest.process(QueryRequest.java:90)
at org.apache.solr.client.solrj.SolrServer.query(SolrServer.java:301)
at org.apache.solr.cloud.AbstractFullDistribZkTestBase.queryServer(AbstractFullDistribZkTestBase.java:1325)
at org.apache.solr.BaseDistributedSearchTestCase.query(BaseDistributedSearchTestCase.java:542)
at org.apache.solr.BaseDistributedSearchTestCase.query(BaseDistributedSearchTestCase.java:521)
at org.apache.solr.cloud.BasicDistributedZk2Test.brindDownShardIndexSomeDocsAndRecover(BasicDistributedZk2Test.java:305)
at org.apache.solr.cloud.BasicDistributedZk2Test.doTest(BasicDistributedZk2Test.java:117)
Build Log:
[...truncated 52898 lines...]
BUILD FAILED
/usr/home/hudson/hudson-slave/workspace/Lucene-Solr-Maven-trunk/build.xml:476: The following error occurred while executing this line:
/usr/home/hudson/hudson-slave/workspace/Lucene-Solr-Maven-trunk/build.xml:176: The following error occurred while executing this line:
/usr/home/hudson/hudson-slave/workspace/Lucene-Solr-Maven-trunk/extra-targets.xml:77: Java returned: 1
Total time: 130 minutes 41 seconds
Build step 'Invoke Ant' marked build as failure
Recording test results
Email was triggered for: Failure
Sending email for trigger: Failure
[JENKINS-MAVEN] Lucene-Solr-Maven-trunk #1060: POMs out of sync
Posted by Apache Jenkins Server <je...@builds.apache.org>.
Build: https://builds.apache.org/job/Lucene-Solr-Maven-trunk/1060/
1 tests failed.
FAILED: org.apache.solr.cloud.BasicDistributedZk2Test.testDistribSearch
Error Message:
No live SolrServers available to handle this request:[http://127.0.0.1:59153/fh/yf/collection1, http://127.0.0.1:34458/fh/yf/collection1]
Stack Trace:
org.apache.solr.client.solrj.SolrServerException: No live SolrServers available to handle this request:[http://127.0.0.1:59153/fh/yf/collection1, http://127.0.0.1:34458/fh/yf/collection1]
at org.apache.solr.client.solrj.impl.HttpSolrServer.request(HttpSolrServer.java:495)
at org.apache.solr.client.solrj.impl.HttpSolrServer.request(HttpSolrServer.java:199)
at org.apache.solr.client.solrj.impl.LBHttpSolrServer.request(LBHttpSolrServer.java:283)
at org.apache.solr.client.solrj.impl.CloudSolrServer.request(CloudSolrServer.java:640)
at org.apache.solr.client.solrj.request.QueryRequest.process(QueryRequest.java:90)
at org.apache.solr.client.solrj.SolrServer.query(SolrServer.java:301)
at org.apache.solr.cloud.AbstractFullDistribZkTestBase.queryServer(AbstractFullDistribZkTestBase.java:1325)
at org.apache.solr.BaseDistributedSearchTestCase.query(BaseDistributedSearchTestCase.java:542)
at org.apache.solr.BaseDistributedSearchTestCase.query(BaseDistributedSearchTestCase.java:521)
at org.apache.solr.cloud.BasicDistributedZk2Test.brindDownShardIndexSomeDocsAndRecover(BasicDistributedZk2Test.java:305)
at org.apache.solr.cloud.BasicDistributedZk2Test.doTest(BasicDistributedZk2Test.java:117)
Build Log:
[...truncated 38195 lines...]
-validate-maven-dependencies:
[artifact:dependencies] [INFO] snapshot org.apache.lucene:lucene-test-framework:5.0-SNAPSHOT: checking for updates from maven-restlet
[artifact:dependencies] [INFO] snapshot org.apache.lucene:lucene-test-framework:5.0-SNAPSHOT: checking for updates from releases.cloudera.com
[artifact:dependencies] [WARNING] repository metadata for: 'snapshot org.apache.lucene:lucene-test-framework:5.0-SNAPSHOT' could not be retrieved from repository: releases.cloudera.com due to an error: Error transferring file: Server returned HTTP response code: 502 for URL: https://repository.cloudera.com/artifactory/libs-release/org/apache/lucene/lucene-test-framework/5.0-SNAPSHOT/maven-metadata.xml
[...truncated 25 lines...]
-validate-maven-dependencies:
[artifact:dependencies] [INFO] snapshot org.apache.lucene:lucene-test-framework:5.0-SNAPSHOT: checking for updates from releases.cloudera.com
[artifact:dependencies] [WARNING] repository metadata for: 'snapshot org.apache.lucene:lucene-test-framework:5.0-SNAPSHOT' could not be retrieved from repository: releases.cloudera.com due to an error: Error transferring file: Server returned HTTP response code: 502 for URL: https://repository.cloudera.com/artifactory/libs-release/org/apache/lucene/lucene-test-framework/5.0-SNAPSHOT/maven-metadata.xml
[...truncated 9 lines...]
-validate-maven-dependencies:
[artifact:dependencies] [INFO] snapshot org.apache.lucene:lucene-test-framework:5.0-SNAPSHOT: checking for updates from releases.cloudera.com
[artifact:dependencies] [WARNING] repository metadata for: 'snapshot org.apache.lucene:lucene-test-framework:5.0-SNAPSHOT' could not be retrieved from repository: releases.cloudera.com due to an error: Error transferring file: Server returned HTTP response code: 502 for URL: https://repository.cloudera.com/artifactory/libs-release/org/apache/lucene/lucene-test-framework/5.0-SNAPSHOT/maven-metadata.xml
[...truncated 4 lines...]
-validate-maven-dependencies:
[artifact:dependencies] [INFO] snapshot org.apache.lucene:lucene-test-framework:5.0-SNAPSHOT: checking for updates from releases.cloudera.com
[artifact:dependencies] [WARNING] repository metadata for: 'snapshot org.apache.lucene:lucene-test-framework:5.0-SNAPSHOT' could not be retrieved from repository: releases.cloudera.com due to an error: Error transferring file: Server returned HTTP response code: 502 for URL: https://repository.cloudera.com/artifactory/libs-release/org/apache/lucene/lucene-test-framework/5.0-SNAPSHOT/maven-metadata.xml
[...truncated 5 lines...]
-validate-maven-dependencies:
[artifact:dependencies] [INFO] snapshot org.apache.lucene:lucene-test-framework:5.0-SNAPSHOT: checking for updates from releases.cloudera.com
[artifact:dependencies] [WARNING] repository metadata for: 'snapshot org.apache.lucene:lucene-test-framework:5.0-SNAPSHOT' could not be retrieved from repository: releases.cloudera.com due to an error: Error transferring file: Server returned HTTP response code: 502 for URL: https://repository.cloudera.com/artifactory/libs-release/org/apache/lucene/lucene-test-framework/5.0-SNAPSHOT/maven-metadata.xml
[...truncated 4 lines...]
-validate-maven-dependencies:
[artifact:dependencies] [INFO] snapshot org.apache.lucene:lucene-test-framework:5.0-SNAPSHOT: checking for updates from releases.cloudera.com
[artifact:dependencies] [WARNING] repository metadata for: 'snapshot org.apache.lucene:lucene-test-framework:5.0-SNAPSHOT' could not be retrieved from repository: releases.cloudera.com due to an error: Error transferring file: Server returned HTTP response code: 502 for URL: https://repository.cloudera.com/artifactory/libs-release/org/apache/lucene/lucene-test-framework/5.0-SNAPSHOT/maven-metadata.xml
[...truncated 14651 lines...]
BUILD FAILED
/usr/home/hudson/hudson-slave/workspace/Lucene-Solr-Maven-trunk/build.xml:476: The following error occurred while executing this line:
/usr/home/hudson/hudson-slave/workspace/Lucene-Solr-Maven-trunk/build.xml:176: The following error occurred while executing this line:
/usr/home/hudson/hudson-slave/workspace/Lucene-Solr-Maven-trunk/extra-targets.xml:77: Java returned: 1
Total time: 134 minutes 53 seconds
Build step 'Invoke Ant' marked build as failure
Recording test results
Email was triggered for: Failure
Sending email for trigger: Failure
[JENKINS-MAVEN] Lucene-Solr-Maven-trunk #1059: POMs out of sync
Posted by Apache Jenkins Server <je...@builds.apache.org>.
Build: https://builds.apache.org/job/Lucene-Solr-Maven-trunk/1059/
1 tests failed.
FAILED: org.apache.solr.cloud.BasicDistributedZk2Test.testDistribSearch
Error Message:
No live SolrServers available to handle this request:[http://127.0.0.1:15369/ky_kg/collection1, http://127.0.0.1:12475/ky_kg/collection1]
Stack Trace:
org.apache.solr.client.solrj.SolrServerException: No live SolrServers available to handle this request:[http://127.0.0.1:15369/ky_kg/collection1, http://127.0.0.1:12475/ky_kg/collection1]
at org.apache.solr.client.solrj.impl.HttpSolrServer.request(HttpSolrServer.java:495)
at org.apache.solr.client.solrj.impl.HttpSolrServer.request(HttpSolrServer.java:199)
at org.apache.solr.client.solrj.impl.LBHttpSolrServer.request(LBHttpSolrServer.java:283)
at org.apache.solr.client.solrj.impl.CloudSolrServer.request(CloudSolrServer.java:640)
at org.apache.solr.client.solrj.request.QueryRequest.process(QueryRequest.java:90)
at org.apache.solr.client.solrj.SolrServer.query(SolrServer.java:301)
at org.apache.solr.cloud.AbstractFullDistribZkTestBase.queryServer(AbstractFullDistribZkTestBase.java:1325)
at org.apache.solr.BaseDistributedSearchTestCase.query(BaseDistributedSearchTestCase.java:542)
at org.apache.solr.BaseDistributedSearchTestCase.query(BaseDistributedSearchTestCase.java:521)
at org.apache.solr.cloud.BasicDistributedZk2Test.brindDownShardIndexSomeDocsAndRecover(BasicDistributedZk2Test.java:305)
at org.apache.solr.cloud.BasicDistributedZk2Test.doTest(BasicDistributedZk2Test.java:117)
Build Log:
[...truncated 52608 lines...]
[mvn] [INFO] -------------------------------------------------------------
[mvn] [INFO] -------------------------------------------------------------
[mvn] [ERROR] COMPILATION ERROR :
[mvn] [INFO] -------------------------------------------------------------
[...truncated 279 lines...]
BUILD FAILED
/usr/home/hudson/hudson-slave/workspace/Lucene-Solr-Maven-trunk/build.xml:476: The following error occurred while executing this line:
/usr/home/hudson/hudson-slave/workspace/Lucene-Solr-Maven-trunk/build.xml:176: The following error occurred while executing this line:
/usr/home/hudson/hudson-slave/workspace/Lucene-Solr-Maven-trunk/extra-targets.xml:77: Java returned: 1
Total time: 111 minutes 23 seconds
Build step 'Invoke Ant' marked build as failure
Recording test results
Email was triggered for: Failure
Sending email for trigger: Failure
[JENKINS-MAVEN] Lucene-Solr-Maven-trunk #1058: POMs out of sync
Posted by Apache Jenkins Server <je...@builds.apache.org>.
Build: https://builds.apache.org/job/Lucene-Solr-Maven-trunk/1058/
1 tests failed.
REGRESSION: org.apache.solr.cloud.BasicDistributedZk2Test.testDistribSearch
Error Message:
No live SolrServers available to handle this request:[http://127.0.0.1:25118/collection1, http://127.0.0.1:25111/collection1]
Stack Trace:
org.apache.solr.client.solrj.SolrServerException: No live SolrServers available to handle this request:[http://127.0.0.1:25118/collection1, http://127.0.0.1:25111/collection1]
at org.apache.solr.client.solrj.impl.HttpSolrServer.request(HttpSolrServer.java:495)
at org.apache.solr.client.solrj.impl.HttpSolrServer.request(HttpSolrServer.java:199)
at org.apache.solr.client.solrj.impl.LBHttpSolrServer.request(LBHttpSolrServer.java:283)
at org.apache.solr.client.solrj.impl.CloudSolrServer.request(CloudSolrServer.java:640)
at org.apache.solr.client.solrj.request.QueryRequest.process(QueryRequest.java:90)
at org.apache.solr.client.solrj.SolrServer.query(SolrServer.java:301)
at org.apache.solr.cloud.AbstractFullDistribZkTestBase.queryServer(AbstractFullDistribZkTestBase.java:1325)
at org.apache.solr.BaseDistributedSearchTestCase.query(BaseDistributedSearchTestCase.java:542)
at org.apache.solr.BaseDistributedSearchTestCase.query(BaseDistributedSearchTestCase.java:521)
at org.apache.solr.cloud.BasicDistributedZk2Test.brindDownShardIndexSomeDocsAndRecover(BasicDistributedZk2Test.java:305)
at org.apache.solr.cloud.BasicDistributedZk2Test.doTest(BasicDistributedZk2Test.java:117)
Build Log:
[...truncated 52592 lines...]
[mvn] [INFO] -------------------------------------------------------------
[mvn] [INFO] -------------------------------------------------------------
[mvn] [ERROR] COMPILATION ERROR :
[mvn] [INFO] -------------------------------------------------------------
[...truncated 279 lines...]
BUILD FAILED
/usr/home/hudson/hudson-slave/workspace/Lucene-Solr-Maven-trunk/build.xml:476: The following error occurred while executing this line:
/usr/home/hudson/hudson-slave/workspace/Lucene-Solr-Maven-trunk/build.xml:176: The following error occurred while executing this line:
/usr/home/hudson/hudson-slave/workspace/Lucene-Solr-Maven-trunk/extra-targets.xml:77: Java returned: 1
Total time: 126 minutes 37 seconds
Build step 'Invoke Ant' marked build as failure
Recording test results
Email was triggered for: Failure
Sending email for trigger: Failure