You are viewing a plain text version of this content. The canonical link for it is here.
Posted to dev@oozie.apache.org by Apache Jenkins Server <je...@builds.apache.org> on 2018/10/13 09:21:27 UTC
Failed: OOZIE-3368 PreCommit Build #892
Jira: https://issues.apache.org/jira/browse/OOZIE-3368
Build: https://builds.apache.org/job/PreCommit-OOZIE-Build/892/
###################################################################################
########################## LAST 100 LINES OF THE CONSOLE ###########################
[...truncated 1.88 MB...]
[DEBUG] There are no new bugs found in [sharelib/sqoop].
[TRACE] New XMLLib present, calling 'xmllint --xpath' to get bug instance counts
[DEBUG] There are no new bugs found in [sharelib/spark].
[TRACE] New XMLLib present, calling 'xmllint --xpath' to get bug instance counts
[DEBUG] There are no new bugs found in [sharelib/hive2].
[TRACE] New XMLLib present, calling 'xmllint --xpath' to get bug instance counts
[DEBUG] There are no new bugs found in [sharelib/pig].
[TRACE] New XMLLib present, calling 'xmllint --xpath' to get bug instance counts
[DEBUG] There are no new bugs found in [webapp].
[INFO] There are no new bugs found totally].
[TRACE] FindBugs diffs checked and reports created
[TRACE] Summary file size is 2561 bytes
[TRACE] Full summary file size is 1471 bytes
[TRACE] File [/home/jenkins/jenkins-slave/workspace/PreCommit-OOZIE-Build/test-patch/tmp/FINDBUGS_DIFF/diff/findbugs-diff-0.1.0-all.jar] removed
[TRACE] File [/home/jenkins/jenkins-slave/workspace/PreCommit-OOZIE-Build/test-patch/tmp/FINDBUGS_DIFF/diff/findbugs-diff-0.1.0-all.jar.md5sum] removed
Running test-patch task BACKWARDS_COMPATIBILITY
Running test-patch task TESTS
Running test-patch task DISTRO
Testing JIRA OOZIE-3368
Cleaning local git workspace
----------------------------
+1 PATCH_APPLIES
+1 CLEAN
-1 RAW_PATCH_ANALYSIS
+1 the patch does not introduce any @author tags
+1 the patch does not introduce any tabs
+1 the patch does not introduce any trailing spaces
+1 the patch does not introduce any star imports
+1 the patch does not introduce any line longer than 132
-1 the patch does not add/modify any testcase
+1 RAT
+1 the patch does not seem to introduce new RAT warnings
+1 JAVADOC
+1 Javadoc generation succeeded with the patch
+1 the patch does not seem to introduce new Javadoc warning(s)
WARNING: the current HEAD has 100 Javadoc warning(s)
+1 COMPILE
+1 HEAD compiles
+1 patch compiles
+1 the patch does not seem to introduce new javac warnings
+1 There are no new bugs found in total.
+1 There are no new bugs found in [docs].
+1 There are no new bugs found in [examples].
+1 There are no new bugs found in [tools].
+1 There are no new bugs found in [core].
+1 There are no new bugs found in [server].
+1 There are no new bugs found in [client].
+1 There are no new bugs found in [fluent-job/fluent-job-api].
+1 There are no new bugs found in [sharelib/distcp].
+1 There are no new bugs found in [sharelib/oozie].
+1 There are no new bugs found in [sharelib/hcatalog].
+1 There are no new bugs found in [sharelib/streaming].
+1 There are no new bugs found in [sharelib/git].
+1 There are no new bugs found in [sharelib/hive].
+1 There are no new bugs found in [sharelib/sqoop].
+1 There are no new bugs found in [sharelib/spark].
+1 There are no new bugs found in [sharelib/hive2].
+1 There are no new bugs found in [sharelib/pig].
+1 There are no new bugs found in [webapp].
+1 BACKWARDS_COMPATIBILITY
+1 the patch does not change any JPA Entity/Colum/Basic/Lob/Transient annotations
+1 the patch does not modify JPA files
+1 TESTS
Tests run: 3056
Tests failed at first run:
TestSubWorkflowActionExecutor#testSubWorkflowRerun
For the complete list of flaky tests, see TEST-SUMMARY-FULL files.
+1 DISTRO
+1 distro tarball builds with the patch
----------------------------
-1 Overall result, please check the reported -1(s)
There is at least one warning, please check
The full output of the test-patch run is available at
https://builds.apache.org/job/PreCommit-OOZIE-Build/892/
Adding comment to JIRA
% Total % Received % Xferd Average Speed Time Time Time Current
Dload Upload Total Spent Left Speed
0 0 0 0 0 0 0 0 --:--:-- --:--:-- --:--:-- 0 0 0 0 0 0 0 0 0 --:--:-- --:--:-- --:--:-- 0{"self":"https://issues.apache.org/jira/rest/api/2/issue/13191379/comment/16648845","id":"16648845","author":{"self":"https://issues.apache.org/jira/rest/api/2/user?username=hadoopqa","name":"hadoopqa","key":"hadoopqa","avatarUrls":{"48x48":"https://issues.apache.org/jira/secure/useravatar?ownerId=hadoopqa&avatarId=10393","24x24":"https://issues.apache.org/jira/secure/useravatar?size=small&ownerId=hadoopqa&avatarId=10393","16x16":"https://issues.apache.org/jira/secure/useravatar?size=xsmall&ownerId=hadoopqa&avatarId=10393","32x32":"https://issues.apache.org/jira/secure/useravatar?size=medium&ownerId=hadoopqa&avatarId=10393"},"displayName":"Hadoop QA","active":true,"timeZone":"Etc/UTC"},"body":"\nTesting JIRA OOZIE-3368\n\nCleaning local git workspace\n\n----------------------------\n\n{color:green}+1 PATCH_APPLIES{color}\n{color:green}+1 CLEAN{color}\n{color:red}-1 RAW_PATCH_ANALYSIS{color}\n. {color:green}+1{color} the patch does not introduce any @author tags\n. {color:green}+1{color} the patch does not introduce any tabs\n. {color:green}+1{color} the patch does not introduce any trailing spaces\n. {color:green}+1{color} the patch does not introduce any star imports\n. {color:green}+1{color} the patch does not introduce any line longer than 132\n. {color:red}-1{color} the patch does not add/modify any testcase\n{color:green}+1 RAT{color}\n. {color:green}+1{color} the patch does not seem to introduce new RAT warnings\n{color:green}+1 JAVADOC{color}\n. {color:green}+1{color} Javadoc generation succeeded with the patch\n. {color:green}+1{color} the patch does not seem to introduce new Javadoc warning(s)\n. {color:orange}WARNING{color}: the current HEAD has 100 Javadoc warning(s)\n{color:green}+1 COMPILE{color}\n. {color:green}+1{color} HEAD compiles\n. {color:green}+1{color} patch compiles\n. {color:green}+1{color} the patch does not seem to introduce new javac warnings\n{color:green}+1{color} There are no new bugs found in total.\n. {color:green}+1{color} There are no new bugs found in [docs].\n. {color:green}+1{color} There are no new bugs found in [examples].\n. {color:green}+1{color} There are no new bugs found in [tools].\n. {color:green}+1{color} There are no new bugs found in [core].\n. {color:green}+1{color} There are no new bugs found in [server].\n. {color:green}+1{color} There are no new bugs found in [client].\n. {color:green}+1{color} There are no new bugs found in [fluent-job/fluent-job-api].\n. {color:green}+1{color} There are no new bugs found in [sharelib/distcp].\n. {color:green}+1{color} There are no new bugs found in [sharelib/oozie].\n. {color:green}+1{color} There are no new bugs found in [sharelib/hcatalog].\n. {color:green}+1{color} There are no new bugs found in [sharelib/streaming].\n. {color:green}+1{color} There are no new bugs found in [sharelib/git].\n. {color:green}+1{color} There are no new bugs found in [sharelib/hive].\n. {color:green}+1{color} There are no new bugs found in [sharelib/sqoop].\n. {color:green}+1{color} There are no new bugs found in [sharelib/spark].\n. {color:green}+1{color} There are no new bugs found in [sharelib/hive2].\n. {color:green}+1{color} There are no new bugs found in [sharelib/pig].\n. {color:green}+1{color} There are no new bugs found in [webapp].\n{color:green}+1 BACKWARDS_COMPATIBILITY{color}\n. {color:green}+1{color} the patch does not change any JPA Entity/Colum/Basic/Lob/Transient annotations\n. {color:green}+1{color} the patch does not modify JPA files\n{color:green}+1 TESTS{color}\n. Tests run: 3056\n. {color:orange}Tests failed at first run:{color}\nTestSubWorkflowActionExecutor#testSubWorkflowRerun\n. For the complete list of flaky tests, see TEST-SUMMARY-FULL files.\n{color:green}+1 DISTRO{color}\n. {color:green}+1{color} distro tarball builds with the patch \n\n----------------------------\n{color:red}*-1 Overall result, please check the reported -1(s)*{color}\n\n{color:red}. There is at least one warning, please check{color}\n\nThe full output of the test-patch run is available at\n\n. https100 8296 0 4836 100 3460 6314 4517 --:--:-- --:--:-- --:--:-- 6313
://builds.apache.org/job/PreCommit-OOZIE-Build/892/\n\n","updateAuthor":{"self":"https://issues.apache.org/jira/rest/api/2/user?username=hadoopqa","name":"hadoopqa","key":"hadoopqa","avatarUrls":{"48x48":"https://issues.apache.org/jira/secure/useravatar?ownerId=hadoopqa&avatarId=10393","24x24":"https://issues.apache.org/jira/secure/useravatar?size=small&ownerId=hadoopqa&avatarId=10393","16x16":"https://issues.apache.org/jira/secure/useravatar?size=xsmall&ownerId=hadoopqa&avatarId=10393","32x32":"https://issues.apache.org/jira/secure/useravatar?size=medium&ownerId=hadoopqa&avatarId=10393"},"displayName":"Hadoop QA","active":true,"timeZone":"Etc/UTC"},"created":"2018-10-13T09:21:23.257+0000","updated":"2018-10-13T09:21:23.257+0000"}
test-patch exit code: 1
Build step 'Execute shell' marked build as failure
[description-setter] Description set: OOZIE-3368
Archiving artifacts
[Fast Archiver] Compressed 2.93 MB of artifacts by 50.1% relative to #889
Recording test results
ERROR: Step ?Publish JUnit test result report? failed: No test report files were found. Configuration error?
Email was triggered for: Failure - Any
Sending email for trigger: Failure - Any
###################################################################################
############################## FAILED TESTS (if any) ##############################
No tests ran.
Failed: OOZIE-3378 PreCommit Build #905
Posted by Apache Jenkins Server <je...@builds.apache.org>.
Jira: https://issues.apache.org/jira/browse/OOZIE-3378
Build: https://builds.apache.org/job/PreCommit-OOZIE-Build/905/
###################################################################################
########################## LAST 100 LINES OF THE CONSOLE ###########################
[...truncated 1.89 MB...]
[TRACE] New XMLLib present, calling 'xmllint --xpath' to get bug instance counts
[DEBUG] There are no new bugs found in [sharelib/pig].
[TRACE] New XMLLib present, calling 'xmllint --xpath' to get bug instance counts
[DEBUG] There are no new bugs found in [webapp].
[INFO] There are no new bugs found totally].
[TRACE] FindBugs diffs checked and reports created
[TRACE] Summary file size is 2560 bytes
[TRACE] Full summary file size is 1471 bytes
[TRACE] File [/home/jenkins/jenkins-slave/workspace/PreCommit-OOZIE-Build/test-patch/tmp/FINDBUGS_DIFF/diff/findbugs-diff-0.1.0-all.jar] removed
[TRACE] File [/home/jenkins/jenkins-slave/workspace/PreCommit-OOZIE-Build/test-patch/tmp/FINDBUGS_DIFF/diff/findbugs-diff-0.1.0-all.jar.md5sum] removed
Running test-patch task BACKWARDS_COMPATIBILITY
Running test-patch task TESTS
xargs: Warning: a NUL character occurred in the input. It cannot be passed through in the argument list. Did you mean to use the --null option?
Running test-patch task DISTRO
Testing JIRA OOZIE-3378
Cleaning local git workspace
----------------------------
+1 PATCH_APPLIES
+1 CLEAN
+1 RAW_PATCH_ANALYSIS
+1 the patch does not introduce any @author tags
+1 the patch does not introduce any tabs
+1 the patch does not introduce any trailing spaces
+1 the patch does not introduce any star imports
+1 the patch does not introduce any line longer than 132
+1 the patch adds/modifies 1 testcase(s)
+1 RAT
+1 the patch does not seem to introduce new RAT warnings
+1 JAVADOC
+1 Javadoc generation succeeded with the patch
+1 the patch does not seem to introduce new Javadoc warning(s)
WARNING: the current HEAD has 100 Javadoc warning(s)
+1 COMPILE
+1 HEAD compiles
+1 patch compiles
+1 the patch does not seem to introduce new javac warnings
+1 There are no new bugs found in total.
+1 There are no new bugs found in [docs].
+1 There are no new bugs found in [examples].
+1 There are no new bugs found in [tools].
+1 There are no new bugs found in [core].
+1 There are no new bugs found in [server].
+1 There are no new bugs found in [client].
+1 There are no new bugs found in [fluent-job/fluent-job-api].
+1 There are no new bugs found in [sharelib/distcp].
+1 There are no new bugs found in [sharelib/oozie].
+1 There are no new bugs found in [sharelib/hcatalog].
+1 There are no new bugs found in [sharelib/streaming].
+1 There are no new bugs found in [sharelib/git].
+1 There are no new bugs found in [sharelib/hive].
+1 There are no new bugs found in [sharelib/sqoop].
+1 There are no new bugs found in [sharelib/spark].
+1 There are no new bugs found in [sharelib/hive2].
+1 There are no new bugs found in [sharelib/pig].
+1 There are no new bugs found in [webapp].
+1 BACKWARDS_COMPATIBILITY
+1 the patch does not change any JPA Entity/Colum/Basic/Lob/Transient annotations
+1 the patch does not modify JPA files
-1 TESTS
Tests run : 3063
Tests failed : 1
Tests in error : 0
Tests timed out : 0
-1 [ERROR] There are [1] test failures in [core]. Listing only the first [5] ones
testMaterializationLookup:org.apache.oozie.command.coord.TestCoordMaterializeTransitionXCommand
Check console output for the full list of errors/failures
+1 DISTRO
+1 distro tarball builds with the patch
----------------------------
-1 Overall result, please check the reported -1(s)
There is at least one warning, please check
The full output of the test-patch run is available at
https://builds.apache.org/job/PreCommit-OOZIE-Build/905/
Adding comment to JIRA
% Total % Received % Xferd Average Speed Time Time Time Current
Dload Upload Total Spent Left Speed
0 0 0 0 0 0 0 0 --:--:-- --:--:-- --:--:-- 0 0 0 0 0 0 0 0 0 --:--:-- --:--:-- --:--:-- 0{"self":"https://issues.apache.org/jira/rest/api/2/issue/13196208/comment/16676589","id":"16676589","author":{"self":"https://issues.apache.org/jira/rest/api/2/user?username=hadoopqa","name":"hadoopqa","key":"hadoopqa","avatarUrls":{"48x48":"https://issues.apache.org/jira/secure/useravatar?ownerId=hadoopqa&avatarId=10393","24x24":"https://issues.apache.org/jira/secure/useravatar?size=small&ownerId=hadoopqa&avatarId=10393","16x16":"https://issues.apache.org/jira/secure/useravatar?size=xsmall&ownerId=hadoopqa&avatarId=10393","32x32":"https://issues.apache.org/jira/secure/useravatar?size=medium&ownerId=hadoopqa&avatarId=10393"},"displayName":"Hadoop QA","active":true,"timeZone":"Etc/UTC"},"body":"\nTesting JIRA OOZIE-3378\n\nCleaning local git workspace\n\n----------------------------\n\n{color:green}+1 PATCH_APPLIES{color}\n{color:green}+1 CLEAN{color}\n{color:green}+1 RAW_PATCH_ANALYSIS{color}\n. {color:green}+1{color} the patch does not introduce any @author tags\n. {color:green}+1{color} the patch does not introduce any tabs\n. {color:green}+1{color} the patch does not introduce any trailing spaces\n. {color:green}+1{color} the patch does not introduce any star imports\n. {color:green}+1{color} the patch does not introduce any line longer than 132\n. {color:green}+1{color} the patch adds/modifies 1 testcase(s)\n{color:green}+1 RAT{color}\n. {color:green}+1{color} the patch does not seem to introduce new RAT warnings\n{color:green}+1 JAVADOC{color}\n. {color:green}+1{color} Javadoc generation succeeded with the patch\n. {color:green}+1{color} the patch does not seem to introduce new Javadoc warning(s)\n. {color:orange}WARNING{color}: the current HEAD has 100 Javadoc warning(s)\n{color:green}+1 COMPILE{color}\n. {color:green}+1{color} HEAD compiles\n. {color:green}+1{color} patch compiles\n. {color:green}+1{color} the patch does not seem to introduce new javac warnings\n{color:green}+1{color} There are no new bugs found in total.\n. {color:green}+1{color} There are no new bugs found in [docs].\n. {color:green}+1{color} There are no new bugs found in [examples].\n. {color:green}+1{color} There are no new bugs found in [tools].\n. {color:green}+1{color} There are no new bugs found in [core].\n. {color:green}+1{color} There are no new bugs found in [server].\n. {color:green}+1{color} There are no new bugs found in [client].\n. {color:green}+1{color} There are no new bugs found in [fluent-job/fluent-job-api].\n. {color:green}+1{color} There are no new bugs found in [sharelib/distcp].\n. {color:green}+1{color} There are no new bugs found in [sharelib/oozie].\n. {color:green}+1{color} There are no new bugs found in [sharelib/hcatalog].\n. {color:green}+1{color} There are no new bugs found in [sharelib/streaming].\n. {color:green}+1{color} There are no new bugs found in [sharelib/git].\n. {color:green}+1{color} There are no new bugs found in [sharelib/hive].\n. {color:green}+1{color} There are no new bugs found in [sharelib/sqoop].\n. {color:green}+1{color} There are no new bugs found in [sharelib/spark].\n. {color:green}+1{color} There are no new bugs found in [sharelib/hive2].\n. {color:green}+1{color} There are no new bugs found in [sharelib/pig].\n. {color:green}+1{color} There are no new bugs found in [webapp].\n{color:green}+1 BACKWARDS_COMPATIBILITY{color}\n. {color:green}+1{color} the patch does not change any JPA Entity/Colum/Basic/Lob/Transient annotations\n. {color:green}+1{color} the patch does not modify JPA files\n{color:red}-1 TESTS{color}\n. Tests run : 3063\n. Tests failed : 1\n. Tests in error : 0\n. Tests timed out : 0\n\n{color:red}-1{color} [ERROR] There are [1] test failures in [core]. Listing only the first [5] ones\ntestMaterializationLookup:org.apache.oozie.command.coord.TestCoordMaterializeTransitionXCommand\n\nCheck console output for the full list of errors/failures\n{color:green}+1 DISTRO{color}\n. {color:green}+1{color} distro tarball builds with the patch \n\n----------------------------\n{color:red}*-1 Overall result, please100 8632 0 5004 100 3628 5008 3631 --:--:-- --:--:-- --:--:-- 5009
check the reported -1(s)*{color}\n\n{color:red}. There is at least one warning, please check{color}\n\nThe full output of the test-patch run is available at\n\n. https://builds.apache.org/job/PreCommit-OOZIE-Build/905/\n\n","updateAuthor":{"self":"https://issues.apache.org/jira/rest/api/2/user?username=hadoopqa","name":"hadoopqa","key":"hadoopqa","avatarUrls":{"48x48":"https://issues.apache.org/jira/secure/useravatar?ownerId=hadoopqa&avatarId=10393","24x24":"https://issues.apache.org/jira/secure/useravatar?size=small&ownerId=hadoopqa&avatarId=10393","16x16":"https://issues.apache.org/jira/secure/useravatar?size=xsmall&ownerId=hadoopqa&avatarId=10393","32x32":"https://issues.apache.org/jira/secure/useravatar?size=medium&ownerId=hadoopqa&avatarId=10393"},"displayName":"Hadoop QA","active":true,"timeZone":"Etc/UTC"},"created":"2018-11-06T10:40:50.194+0000","updated":"2018-11-06T10:40:50.194+0000"}
test-patch exit code: 1
Build step 'Execute shell' marked build as failure
[description-setter] Description set: OOZIE-3378
Archiving artifacts
[Fast Archiver] Compressed 2.94 MB of artifacts by 14.9% relative to #889
Recording test results
Email was triggered for: Failure - Any
Sending email for trigger: Failure - Any
###################################################################################
############################## FAILED TESTS (if any) ##############################
1 tests failed.
FAILED: org.apache.oozie.command.coord.TestCoordMaterializeTransitionXCommand.testMaterializationLookup
Error Message:
expected:<Tue Nov 06 10:29:02 UTC 2018> but was:<Mon Nov 05 10:29:02 UTC 2018>
Stack Trace:
junit.framework.AssertionFailedError: expected:<Tue Nov 06 10:29:02 UTC 2018> but was:<Mon Nov 05 10:29:02 UTC 2018>
at junit.framework.Assert.fail(Assert.java:57)
at junit.framework.Assert.failNotEquals(Assert.java:329)
at junit.framework.Assert.assertEquals(Assert.java:78)
at junit.framework.Assert.assertEquals(Assert.java:86)
at junit.framework.TestCase.assertEquals(TestCase.java:253)
at org.apache.oozie.command.coord.TestCoordMaterializeTransitionXCommand.testMaterializationLookup(TestCoordMaterializeTransitionXCommand.java:691)
at sun.reflect.NativeMethodAccessorImpl.invoke0(Native Method)
at sun.reflect.NativeMethodAccessorImpl.invoke(NativeMethodAccessorImpl.java:62)
at sun.reflect.DelegatingMethodAccessorImpl.invoke(DelegatingMethodAccessorImpl.java:43)
at java.lang.reflect.Method.invoke(Method.java:498)
at junit.framework.TestCase.runTest(TestCase.java:176)
at junit.framework.TestCase.runBare(TestCase.java:141)
at junit.framework.TestResult$1.protect(TestResult.java:122)
at junit.framework.TestResult.runProtected(TestResult.java:142)
at junit.framework.TestResult.run(TestResult.java:125)
at junit.framework.TestCase.run(TestCase.java:129)
at junit.framework.TestSuite.runTest(TestSuite.java:255)
at junit.framework.TestSuite.run(TestSuite.java:250)
at org.junit.internal.runners.JUnit38ClassRunner.run(JUnit38ClassRunner.java:84)
at org.junit.runners.Suite.runChild(Suite.java:127)
at org.junit.runners.Suite.runChild(Suite.java:26)
at org.junit.runners.ParentRunner$3.run(ParentRunner.java:238)
at org.junit.runners.ParentRunner$1.schedule(ParentRunner.java:63)
at org.junit.runners.ParentRunner.runChildren(ParentRunner.java:236)
at org.junit.runners.ParentRunner.access$000(ParentRunner.java:53)
at org.junit.runners.ParentRunner$2.evaluate(ParentRunner.java:229)
at org.junit.runners.ParentRunner.run(ParentRunner.java:309)
at org.junit.runners.Suite.runChild(Suite.java:127)
at org.junit.runners.Suite.runChild(Suite.java:26)
at org.junit.runners.ParentRunner$3.run(ParentRunner.java:238)
at org.apache.maven.surefire.junitcore.pc.Scheduler$1.run(Scheduler.java:410)
at org.apache.maven.surefire.junitcore.pc.InvokerStrategy.schedule(InvokerStrategy.java:54)
at org.apache.maven.surefire.junitcore.pc.Scheduler.schedule(Scheduler.java:367)
at org.junit.runners.ParentRunner.runChildren(ParentRunner.java:236)
at org.junit.runners.ParentRunner.access$000(ParentRunner.java:53)
at org.junit.runners.ParentRunner$2.evaluate(ParentRunner.java:229)
at org.junit.runners.ParentRunner.run(ParentRunner.java:309)
at org.apache.maven.surefire.junitcore.pc.ParallelComputerBuilder$PC$1.run(ParallelComputerBuilder.java:593)
at org.apache.maven.surefire.junitcore.JUnitCore.run(JUnitCore.java:55)
at org.apache.maven.surefire.junitcore.JUnitCoreWrapper.createRequestAndRun(JUnitCoreWrapper.java:137)
at org.apache.maven.surefire.junitcore.JUnitCoreWrapper.executeEager(JUnitCoreWrapper.java:107)
at org.apache.maven.surefire.junitcore.JUnitCoreWrapper.execute(JUnitCoreWrapper.java:83)
at org.apache.maven.surefire.junitcore.JUnitCoreWrapper.execute(JUnitCoreWrapper.java:75)
at org.apache.maven.surefire.junitcore.JUnitCoreProvider.invoke(JUnitCoreProvider.java:159)
at org.apache.maven.surefire.booter.ForkedBooter.invokeProviderInSameClassLoader(ForkedBooter.java:373)
at org.apache.maven.surefire.booter.ForkedBooter.runSuitesInProcess(ForkedBooter.java:334)
at org.apache.maven.surefire.booter.ForkedBooter.execute(ForkedBooter.java:119)
at org.apache.maven.surefire.booter.ForkedBooter.main(ForkedBooter.java:407)
Failed: OOZIE-3378 PreCommit Build #904
Posted by Apache Jenkins Server <je...@builds.apache.org>.
Jira: https://issues.apache.org/jira/browse/OOZIE-3378
Build: https://builds.apache.org/job/PreCommit-OOZIE-Build/904/
###################################################################################
########################## LAST 100 LINES OF THE CONSOLE ###########################
[...truncated 1.89 MB...]
[TRACE] New XMLLib present, calling 'xmllint --xpath' to get bug instance counts
[DEBUG] There are no new bugs found in [examples].
[TRACE] New XMLLib present, calling 'xmllint --xpath' to get bug instance counts
[DEBUG] There are no new bugs found in [core].
[INFO] There are no new bugs found totally].
[TRACE] FindBugs diffs checked and reports created
[TRACE] Summary file size is 2560 bytes
[TRACE] Full summary file size is 1471 bytes
[TRACE] File [/home/jenkins/jenkins-slave/workspace/PreCommit-OOZIE-Build/test-patch/tmp/FINDBUGS_DIFF/diff/findbugs-diff-0.1.0-all.jar] removed
[TRACE] File [/home/jenkins/jenkins-slave/workspace/PreCommit-OOZIE-Build/test-patch/tmp/FINDBUGS_DIFF/diff/findbugs-diff-0.1.0-all.jar.md5sum] removed
Running test-patch task BACKWARDS_COMPATIBILITY
Running test-patch task TESTS
xargs: WARNING: a NUL character occurred in the input. It cannot be passed through in the argument list. Did you mean to use the --null option?
Running test-patch task DISTRO
Testing JIRA OOZIE-3378
Cleaning local git workspace
----------------------------
+1 PATCH_APPLIES
+1 CLEAN
+1 RAW_PATCH_ANALYSIS
+1 the patch does not introduce any @author tags
+1 the patch does not introduce any tabs
+1 the patch does not introduce any trailing spaces
+1 the patch does not introduce any star imports
+1 the patch does not introduce any line longer than 132
+1 the patch adds/modifies 1 testcase(s)
+1 RAT
+1 the patch does not seem to introduce new RAT warnings
+1 JAVADOC
+1 Javadoc generation succeeded with the patch
+1 the patch does not seem to introduce new Javadoc warning(s)
WARNING: the current HEAD has 100 Javadoc warning(s)
+1 COMPILE
+1 HEAD compiles
+1 patch compiles
+1 the patch does not seem to introduce new javac warnings
+1 There are no new bugs found in total.
+1 There are no new bugs found in [sharelib/hive2].
+1 There are no new bugs found in [sharelib/spark].
+1 There are no new bugs found in [sharelib/oozie].
+1 There are no new bugs found in [sharelib/pig].
+1 There are no new bugs found in [sharelib/streaming].
+1 There are no new bugs found in [sharelib/hive].
+1 There are no new bugs found in [sharelib/distcp].
+1 There are no new bugs found in [sharelib/hcatalog].
+1 There are no new bugs found in [sharelib/sqoop].
+1 There are no new bugs found in [sharelib/git].
+1 There are no new bugs found in [client].
+1 There are no new bugs found in [docs].
+1 There are no new bugs found in [tools].
+1 There are no new bugs found in [fluent-job/fluent-job-api].
+1 There are no new bugs found in [server].
+1 There are no new bugs found in [webapp].
+1 There are no new bugs found in [examples].
+1 There are no new bugs found in [core].
+1 BACKWARDS_COMPATIBILITY
+1 the patch does not change any JPA Entity/Colum/Basic/Lob/Transient annotations
+1 the patch does not modify JPA files
-1 TESTS
Tests run : 3063
Tests failed : 1
Tests in error : 0
Tests timed out : 0
-1 [ERROR] There are [1] test failures in [core]. Listing only the first [5] ones
testMaterializationLookup:org.apache.oozie.command.coord.TestCoordMaterializeTransitionXCommand
Check console output for the full list of errors/failures
+1 DISTRO
+1 distro tarball builds with the patch
----------------------------
-1 Overall result, please check the reported -1(s)
There is at least one warning, please check
The full output of the test-patch run is available at
https://builds.apache.org/job/PreCommit-OOZIE-Build/904/
Adding comment to JIRA
% Total % Received % Xferd Average Speed Time Time Time Current
Dload Upload Total Spent Left Speed
0 0 0 0 0 0 0 0 --:--:-- --:--:-- --:--:-- 0 0 0 0 0 0 0 0 0 --:--:-- --:--:-- --:--:-- 0{"self":"https://issues.apache.org/jira/rest/api/2/issue/13196208/comment/16675262","id":"16675262","author":{"self":"https://issues.apache.org/jira/rest/api/2/user?username=hadoopqa","name":"hadoopqa","key":"hadoopqa","avatarUrls":{"48x48":"https://issues.apache.org/jira/secure/useravatar?ownerId=hadoopqa&avatarId=10393","24x24":"https://issues.apache.org/jira/secure/useravatar?size=small&ownerId=hadoopqa&avatarId=10393","16x16":"https://issues.apache.org/jira/secure/useravatar?size=xsmall&ownerId=hadoopqa&avatarId=10393","32x32":"https://issues.apache.org/jira/secure/useravatar?size=medium&ownerId=hadoopqa&avatarId=10393"},"displayName":"Hadoop QA","active":true,"timeZone":"Etc/UTC"},"body":"\nTesting JIRA OOZIE-3378\n\nCleaning local git workspace\n\n----------------------------\n\n{color:green}+1 PATCH_APPLIES{color}\n{color:green}+1 CLEAN{color}\n{color:green}+1 RAW_PATCH_ANALYSIS{color}\n. {color:green}+1{color} the patch does not introduce any @author tags\n. {color:green}+1{color} the patch does not introduce any tabs\n. {color:green}+1{color} the patch does not introduce any trailing spaces\n. {color:green}+1{color} the patch does not introduce any star imports\n. {color:green}+1{color} the patch does not introduce any line longer than 132\n. {color:green}+1{color} the patch adds/modifies 1 testcase(s)\n{color:green}+1 RAT{color}\n. {color:green}+1{color} the patch does not seem to introduce new RAT warnings\n{color:green}+1 JAVADOC{color}\n. {color:green}+1{color} Javadoc generation succeeded with the patch\n. {color:green}+1{color} the patch does not seem to introduce new Javadoc warning(s)\n. {color:orange}WARNING{color}: the current HEAD has 100 Javadoc warning(s)\n{color:green}+1 COMPILE{color}\n. {color:green}+1{color} HEAD compiles\n. {color:green}+1{color} patch compiles\n. {color:green}+1{color} the patch does not seem to introduce new javac warnings\n{color:green}+1{color} There are no new bugs found in total.\n. {color:green}+1{color} There are no new bugs found in [sharelib/hive2].\n. {color:green}+1{color} There are no new bugs found in [sharelib/spark].\n. {color:green}+1{color} There are no new bugs found in [sharelib/oozie].\n. {color:green}+1{color} There are no new bugs found in [sharelib/pig].\n. {color:green}+1{color} There are no new bugs found in [sharelib/streaming].\n. {color:green}+1{color} There are no new bugs found in [sharelib/hive].\n. {color:green}+1{color} There are no new bugs found in [sharelib/distcp].\n. {color:green}+1{color} There are no new bugs found in [sharelib/hcatalog].\n. {color:green}+1{color} There are no new bugs found in [sharelib/sqoop].\n. {color:green}+1{color} There are no new bugs found in [sharelib/git].\n. {color:green}+1{color} There are no new bugs found in [client].\n. {color:green}+1{color} There are no new bugs found in [docs].\n. {color:green}+1{color} There are no new bugs found in [tools].\n. {color:green}+1{color} There are no new bugs found in [fluent-job/fluent-job-api].\n. {color:green}+1{color} There are no new bugs found in [server].\n. {color:green}+1{color} There are no new bugs found in [webapp].\n. {color:green}+1{color} There are no new bugs found in [examples].\n. {color:green}+1{color} There are no new bugs found in [core].\n{color:green}+1 BACKWARDS_COMPATIBILITY{color}\n. {color:green}+1{color} the patch does not change any JPA Entity/Colum/Basic/Lob/Transient annotations\n. {color:green}+1{color} the patch does not modify JPA files\n{color:red}-1 TESTS{color}\n. Tests run : 3063\n. Tests failed : 1\n. Tests in error : 0\n. Tests timed out : 0\n\n{color:red}-1{color} [ERROR] There are [1] test failures in [core]. Listing only the first [5] ones\ntestMaterializationLookup:org.apache.oozie.command.coord.TestCoordMaterializeTransitionXCommand\n\nCheck console output for the full list of errors/failures\n{color:green}+1 DISTRO{color}\n. {color:green}+1{color} distro tarball builds with the patch \n\n----------------------------\n{color:red}*-1 Overall result, please100 8632 0 5004 100 3628 5447 3949 --:--:-- --:--:-- --:--:-- 5445
check the reported -1(s)*{color}\n\n{color:red}. There is at least one warning, please check{color}\n\nThe full output of the test-patch run is available at\n\n. https://builds.apache.org/job/PreCommit-OOZIE-Build/904/\n\n","updateAuthor":{"self":"https://issues.apache.org/jira/rest/api/2/user?username=hadoopqa","name":"hadoopqa","key":"hadoopqa","avatarUrls":{"48x48":"https://issues.apache.org/jira/secure/useravatar?ownerId=hadoopqa&avatarId=10393","24x24":"https://issues.apache.org/jira/secure/useravatar?size=small&ownerId=hadoopqa&avatarId=10393","16x16":"https://issues.apache.org/jira/secure/useravatar?size=xsmall&ownerId=hadoopqa&avatarId=10393","32x32":"https://issues.apache.org/jira/secure/useravatar?size=medium&ownerId=hadoopqa&avatarId=10393"},"displayName":"Hadoop QA","active":true,"timeZone":"Etc/UTC"},"created":"2018-11-05T14:42:47.885+0000","updated":"2018-11-05T14:42:47.885+0000"}
test-patch exit code: 1
Build step 'Execute shell' marked build as failure
[description-setter] Description set: OOZIE-3378
Archiving artifacts
[Fast Archiver] Compressed 2.93 MB of artifacts by 14.9% relative to #889
Recording test results
Email was triggered for: Failure - Any
Sending email for trigger: Failure - Any
###################################################################################
############################## FAILED TESTS (if any) ##############################
1 tests failed.
FAILED: org.apache.oozie.command.coord.TestCoordMaterializeTransitionXCommand.testMaterializationLookup
Error Message:
expected:<Mon Nov 05 14:33:24 UTC 2018> but was:<Sun Nov 04 14:33:24 UTC 2018>
Stack Trace:
junit.framework.AssertionFailedError: expected:<Mon Nov 05 14:33:24 UTC 2018> but was:<Sun Nov 04 14:33:24 UTC 2018>
at junit.framework.Assert.fail(Assert.java:57)
at junit.framework.Assert.failNotEquals(Assert.java:329)
at junit.framework.Assert.assertEquals(Assert.java:78)
at junit.framework.Assert.assertEquals(Assert.java:86)
at junit.framework.TestCase.assertEquals(TestCase.java:253)
at org.apache.oozie.command.coord.TestCoordMaterializeTransitionXCommand.testMaterializationLookup(TestCoordMaterializeTransitionXCommand.java:691)
at sun.reflect.NativeMethodAccessorImpl.invoke0(Native Method)
at sun.reflect.NativeMethodAccessorImpl.invoke(NativeMethodAccessorImpl.java:62)
at sun.reflect.DelegatingMethodAccessorImpl.invoke(DelegatingMethodAccessorImpl.java:43)
at java.lang.reflect.Method.invoke(Method.java:498)
at junit.framework.TestCase.runTest(TestCase.java:176)
at junit.framework.TestCase.runBare(TestCase.java:141)
at junit.framework.TestResult$1.protect(TestResult.java:122)
at junit.framework.TestResult.runProtected(TestResult.java:142)
at junit.framework.TestResult.run(TestResult.java:125)
at junit.framework.TestCase.run(TestCase.java:129)
at junit.framework.TestSuite.runTest(TestSuite.java:255)
at junit.framework.TestSuite.run(TestSuite.java:250)
at org.junit.internal.runners.JUnit38ClassRunner.run(JUnit38ClassRunner.java:84)
at org.junit.runners.Suite.runChild(Suite.java:127)
at org.junit.runners.Suite.runChild(Suite.java:26)
at org.junit.runners.ParentRunner$3.run(ParentRunner.java:238)
at org.junit.runners.ParentRunner$1.schedule(ParentRunner.java:63)
at org.junit.runners.ParentRunner.runChildren(ParentRunner.java:236)
at org.junit.runners.ParentRunner.access$000(ParentRunner.java:53)
at org.junit.runners.ParentRunner$2.evaluate(ParentRunner.java:229)
at org.junit.runners.ParentRunner.run(ParentRunner.java:309)
at org.junit.runners.Suite.runChild(Suite.java:127)
at org.junit.runners.Suite.runChild(Suite.java:26)
at org.junit.runners.ParentRunner$3.run(ParentRunner.java:238)
at org.apache.maven.surefire.junitcore.pc.Scheduler$1.run(Scheduler.java:410)
at org.apache.maven.surefire.junitcore.pc.InvokerStrategy.schedule(InvokerStrategy.java:54)
at org.apache.maven.surefire.junitcore.pc.Scheduler.schedule(Scheduler.java:367)
at org.junit.runners.ParentRunner.runChildren(ParentRunner.java:236)
at org.junit.runners.ParentRunner.access$000(ParentRunner.java:53)
at org.junit.runners.ParentRunner$2.evaluate(ParentRunner.java:229)
at org.junit.runners.ParentRunner.run(ParentRunner.java:309)
at org.apache.maven.surefire.junitcore.pc.ParallelComputerBuilder$PC$1.run(ParallelComputerBuilder.java:593)
at org.apache.maven.surefire.junitcore.JUnitCore.run(JUnitCore.java:55)
at org.apache.maven.surefire.junitcore.JUnitCoreWrapper.createRequestAndRun(JUnitCoreWrapper.java:137)
at org.apache.maven.surefire.junitcore.JUnitCoreWrapper.executeEager(JUnitCoreWrapper.java:107)
at org.apache.maven.surefire.junitcore.JUnitCoreWrapper.execute(JUnitCoreWrapper.java:83)
at org.apache.maven.surefire.junitcore.JUnitCoreWrapper.execute(JUnitCoreWrapper.java:75)
at org.apache.maven.surefire.junitcore.JUnitCoreProvider.invoke(JUnitCoreProvider.java:159)
at org.apache.maven.surefire.booter.ForkedBooter.invokeProviderInSameClassLoader(ForkedBooter.java:373)
at org.apache.maven.surefire.booter.ForkedBooter.runSuitesInProcess(ForkedBooter.java:334)
at org.apache.maven.surefire.booter.ForkedBooter.execute(ForkedBooter.java:119)
at org.apache.maven.surefire.booter.ForkedBooter.main(ForkedBooter.java:407)
Failed: OOZIE-3377 PreCommit Build #903
Posted by Apache Jenkins Server <je...@builds.apache.org>.
Jira: https://issues.apache.org/jira/browse/OOZIE-3377
Build: https://builds.apache.org/job/PreCommit-OOZIE-Build/903/
###################################################################################
########################## LAST 100 LINES OF THE CONSOLE ###########################
[...truncated 2.49 MB...]
[TRACE] New XMLLib present, calling 'xmllint --xpath' to get bug instance counts
[DEBUG] There are no new bugs found in [core].
[INFO] There are no new bugs found totally].
[TRACE] FindBugs diffs checked and reports created
[TRACE] Summary file size is 2561 bytes
[TRACE] Full summary file size is 1471 bytes
[TRACE] File [/home/jenkins/jenkins-slave/workspace/PreCommit-OOZIE-Build/test-patch/tmp/FINDBUGS_DIFF/diff/findbugs-diff-0.1.0-all.jar] removed
[TRACE] File [/home/jenkins/jenkins-slave/workspace/PreCommit-OOZIE-Build/test-patch/tmp/FINDBUGS_DIFF/diff/findbugs-diff-0.1.0-all.jar.md5sum] removed
Running test-patch task BACKWARDS_COMPATIBILITY
Running test-patch task TESTS
xargs: WARNING: a NUL character occurred in the input. It cannot be passed through in the argument list. Did you mean to use the --null option?
Running test-patch task DISTRO
Testing JIRA OOZIE-3377
Cleaning local git workspace
----------------------------
+1 PATCH_APPLIES
+1 CLEAN
-1 RAW_PATCH_ANALYSIS
+1 the patch does not introduce any @author tags
+1 the patch does not introduce any tabs
+1 the patch does not introduce any trailing spaces
+1 the patch does not introduce any star imports
+1 the patch does not introduce any line longer than 132
-1 the patch does not add/modify any testcase
+1 RAT
+1 the patch does not seem to introduce new RAT warnings
+1 JAVADOC
+1 Javadoc generation succeeded with the patch
+1 the patch does not seem to introduce new Javadoc warning(s)
WARNING: the current HEAD has 100 Javadoc warning(s)
+1 COMPILE
+1 HEAD compiles
+1 patch compiles
+1 the patch does not seem to introduce new javac warnings
+1 There are no new bugs found in total.
+1 There are no new bugs found in [sharelib/hive2].
+1 There are no new bugs found in [sharelib/spark].
+1 There are no new bugs found in [sharelib/oozie].
+1 There are no new bugs found in [sharelib/pig].
+1 There are no new bugs found in [sharelib/streaming].
+1 There are no new bugs found in [sharelib/hive].
+1 There are no new bugs found in [sharelib/distcp].
+1 There are no new bugs found in [sharelib/hcatalog].
+1 There are no new bugs found in [sharelib/sqoop].
+1 There are no new bugs found in [sharelib/git].
+1 There are no new bugs found in [client].
+1 There are no new bugs found in [docs].
+1 There are no new bugs found in [tools].
+1 There are no new bugs found in [fluent-job/fluent-job-api].
+1 There are no new bugs found in [server].
+1 There are no new bugs found in [webapp].
+1 There are no new bugs found in [examples].
+1 There are no new bugs found in [core].
+1 BACKWARDS_COMPATIBILITY
+1 the patch does not change any JPA Entity/Colum/Basic/Lob/Transient annotations
+1 the patch does not modify JPA files
-1 TESTS
Tests run : 3062
Tests failed : 1
Tests in error : 0
Tests timed out : 0
-1 [ERROR] There are [1] test failures in [core]. Listing only the first [5] ones
testMaterializationLookup:org.apache.oozie.command.coord.TestCoordMaterializeTransitionXCommand
Check console output for the full list of errors/failures
Tests failed at first run:
TestPurgeXCommand#testPurgeBundleWithCoordChildWithWFChild3MoreThanLimit
For the complete list of flaky tests, see TEST-SUMMARY-FULL files.
+1 DISTRO
+1 distro tarball builds with the patch
----------------------------
-1 Overall result, please check the reported -1(s)
There is at least one warning, please check
The full output of the test-patch run is available at
https://builds.apache.org/job/PreCommit-OOZIE-Build/903/
Adding comment to JIRA
% Total % Received % Xferd Average Speed Time Time Time Current
Dload Upload Total Spent Left Speed
0 0 0 0 0 0 0 0 --:--:-- --:--:-- --:--:-- 0 0 0 0 0 0 0 0 0 --:--:-- --:--:-- --:--:-- 0{"self":"https://issues.apache.org/jira/rest/api/2/issue/13195419/comment/16675095","id":"16675095","author":{"self":"https://issues.apache.org/jira/rest/api/2/user?username=hadoopqa","name":"hadoopqa","key":"hadoopqa","avatarUrls":{"48x48":"https://issues.apache.org/jira/secure/useravatar?ownerId=hadoopqa&avatarId=10393","24x24":"https://issues.apache.org/jira/secure/useravatar?size=small&ownerId=hadoopqa&avatarId=10393","16x16":"https://issues.apache.org/jira/secure/useravatar?size=xsmall&ownerId=hadoopqa&avatarId=10393","32x32":"https://issues.apache.org/jira/secure/useravatar?size=medium&ownerId=hadoopqa&avatarId=10393"},"displayName":"Hadoop QA","active":true,"timeZone":"Etc/UTC"},"body":"\nTesting JIRA OOZIE-3377\n\nCleaning local git workspace\n\n----------------------------\n\n{color:green}+1 PATCH_APPLIES{color}\n{color:green}+1 CLEAN{color}\n{color:red}-1 RAW_PATCH_ANALYSIS{color}\n. {color:green}+1{color} the patch does not introduce any @author tags\n. {color:green}+1{color} the patch does not introduce any tabs\n. {color:green}+1{color} the patch does not introduce any trailing spaces\n. {color:green}+1{color} the patch does not introduce any star imports\n. {color:green}+1{color} the patch does not introduce any line longer than 132\n. {color:red}-1{color} the patch does not add/modify any testcase\n{color:green}+1 RAT{color}\n. {color:green}+1{color} the patch does not seem to introduce new RAT warnings\n{color:green}+1 JAVADOC{color}\n. {color:green}+1{color} Javadoc generation succeeded with the patch\n. {color:green}+1{color} the patch does not seem to introduce new Javadoc warning(s)\n. {color:orange}WARNING{color}: the current HEAD has 100 Javadoc warning(s)\n{color:green}+1 COMPILE{color}\n. {color:green}+1{color} HEAD compiles\n. {color:green}+1{color} patch compiles\n. {color:green}+1{color} the patch does not seem to introduce new javac warnings\n{color:green}+1{color} There are no new bugs found in total.\n. {color:green}+1{color} There are no new bugs found in [sharelib/hive2].\n. {color:green}+1{color} There are no new bugs found in [sharelib/spark].\n. {color:green}+1{color} There are no new bugs found in [sharelib/oozie].\n. {color:green}+1{color} There are no new bugs found in [sharelib/pig].\n. {color:green}+1{color} There are no new bugs found in [sharelib/streaming].\n. {color:green}+1{color} There are no new bugs found in [sharelib/hive].\n. {color:green}+1{color} There are no new bugs found in [sharelib/distcp].\n. {color:green}+1{color} There are no new bugs found in [sharelib/hcatalog].\n. {color:green}+1{color} There are no new bugs found in [sharelib/sqoop].\n. {color:green}+1{color} There are no new bugs found in [sharelib/git].\n. {color:green}+1{color} There are no new bugs found in [client].\n. {color:green}+1{color} There are no new bugs found in [docs].\n. {color:green}+1{color} There are no new bugs found in [tools].\n. {color:green}+1{color} There are no new bugs found in [fluent-job/fluent-job-api].\n. {color:green}+1{color} There are no new bugs found in [server].\n. {color:green}+1{color} There are no new bugs found in [webapp].\n. {color:green}+1{color} There are no new bugs found in [examples].\n. {color:green}+1{color} There are no new bugs found in [core].\n{color:green}+1 BACKWARDS_COMPATIBILITY{color}\n. {color:green}+1{color} the patch does not change any JPA Entity/Colum/Basic/Lob/Transient annotations\n. {color:green}+1{color} the patch does not modify JPA files\n{color:red}-1 TESTS{color}\n. Tests run : 3062\n. Tests failed : 1\n. Tests in error : 0\n. Tests timed out : 0\n\n{color:red}-1{color} [ERROR] There are [1] test failures in [core]. Listing only the first [5] ones\ntestMaterializationLookup:org.apache.oozie.command.coord.TestCoordMaterializeTransitionXCommand\n\nCheck console output for the full list of errors/failures\n. {color:orange}Tests failed at first run:{color}\nTestPurgeXCommand#testPurgeBundleWithCoordChildWithWFChild3MoreThanLimit\n. For the complete list of flaky te100 9036 0 5206 100 3830 4795 3527 0:00:01 0:00:01 --:--:-- 4798
sts, see TEST-SUMMARY-FULL files.\n{color:green}+1 DISTRO{color}\n. {color:green}+1{color} distro tarball builds with the patch \n\n----------------------------\n{color:red}*-1 Overall result, please check the reported -1(s)*{color}\n\n{color:red}. There is at least one warning, please check{color}\n\nThe full output of the test-patch run is available at\n\n. https://builds.apache.org/job/PreCommit-OOZIE-Build/903/\n\n","updateAuthor":{"self":"https://issues.apache.org/jira/rest/api/2/user?username=hadoopqa","name":"hadoopqa","key":"hadoopqa","avatarUrls":{"48x48":"https://issues.apache.org/jira/secure/useravatar?ownerId=hadoopqa&avatarId=10393","24x24":"https://issues.apache.org/jira/secure/useravatar?size=small&ownerId=hadoopqa&avatarId=10393","16x16":"https://issues.apache.org/jira/secure/useravatar?size=xsmall&ownerId=hadoopqa&avatarId=10393","32x32":"https://issues.apache.org/jira/secure/useravatar?size=medium&ownerId=hadoopqa&avatarId=10393"},"displayName":"Hadoop QA","active":true,"timeZone":"Etc/UTC"},"created":"2018-11-05T12:54:07.785+0000","updated":"2018-11-05T12:54:07.785+0000"}
test-patch exit code: 1
Build step 'Execute shell' marked build as failure
[description-setter] Description set: OOZIE-3377
Archiving artifacts
Recording test results
Email was triggered for: Failure - Any
Sending email for trigger: Failure - Any
###################################################################################
############################## FAILED TESTS (if any) ##############################
1 tests failed.
FAILED: org.apache.oozie.command.coord.TestCoordMaterializeTransitionXCommand.testMaterializationLookup
Error Message:
expected:<Mon Nov 05 12:43:47 UTC 2018> but was:<Sun Nov 04 12:43:47 UTC 2018>
Stack Trace:
junit.framework.AssertionFailedError: expected:<Mon Nov 05 12:43:47 UTC 2018> but was:<Sun Nov 04 12:43:47 UTC 2018>
at junit.framework.Assert.fail(Assert.java:57)
at junit.framework.Assert.failNotEquals(Assert.java:329)
at junit.framework.Assert.assertEquals(Assert.java:78)
at junit.framework.Assert.assertEquals(Assert.java:86)
at junit.framework.TestCase.assertEquals(TestCase.java:253)
at org.apache.oozie.command.coord.TestCoordMaterializeTransitionXCommand.testMaterializationLookup(TestCoordMaterializeTransitionXCommand.java:691)
at sun.reflect.NativeMethodAccessorImpl.invoke0(Native Method)
at sun.reflect.NativeMethodAccessorImpl.invoke(NativeMethodAccessorImpl.java:62)
at sun.reflect.DelegatingMethodAccessorImpl.invoke(DelegatingMethodAccessorImpl.java:43)
at java.lang.reflect.Method.invoke(Method.java:498)
at junit.framework.TestCase.runTest(TestCase.java:176)
at junit.framework.TestCase.runBare(TestCase.java:141)
at junit.framework.TestResult$1.protect(TestResult.java:122)
at junit.framework.TestResult.runProtected(TestResult.java:142)
at junit.framework.TestResult.run(TestResult.java:125)
at junit.framework.TestCase.run(TestCase.java:129)
at junit.framework.TestSuite.runTest(TestSuite.java:255)
at junit.framework.TestSuite.run(TestSuite.java:250)
at org.junit.internal.runners.JUnit38ClassRunner.run(JUnit38ClassRunner.java:84)
at org.junit.runners.Suite.runChild(Suite.java:127)
at org.junit.runners.Suite.runChild(Suite.java:26)
at org.junit.runners.ParentRunner$3.run(ParentRunner.java:238)
at org.junit.runners.ParentRunner$1.schedule(ParentRunner.java:63)
at org.junit.runners.ParentRunner.runChildren(ParentRunner.java:236)
at org.junit.runners.ParentRunner.access$000(ParentRunner.java:53)
at org.junit.runners.ParentRunner$2.evaluate(ParentRunner.java:229)
at org.junit.runners.ParentRunner.run(ParentRunner.java:309)
at org.junit.runners.Suite.runChild(Suite.java:127)
at org.junit.runners.Suite.runChild(Suite.java:26)
at org.junit.runners.ParentRunner$3.run(ParentRunner.java:238)
at org.apache.maven.surefire.junitcore.pc.Scheduler$1.run(Scheduler.java:410)
at org.apache.maven.surefire.junitcore.pc.InvokerStrategy.schedule(InvokerStrategy.java:54)
at org.apache.maven.surefire.junitcore.pc.Scheduler.schedule(Scheduler.java:367)
at org.junit.runners.ParentRunner.runChildren(ParentRunner.java:236)
at org.junit.runners.ParentRunner.access$000(ParentRunner.java:53)
at org.junit.runners.ParentRunner$2.evaluate(ParentRunner.java:229)
at org.junit.runners.ParentRunner.run(ParentRunner.java:309)
at org.apache.maven.surefire.junitcore.pc.ParallelComputerBuilder$PC$1.run(ParallelComputerBuilder.java:593)
at org.apache.maven.surefire.junitcore.JUnitCore.run(JUnitCore.java:55)
at org.apache.maven.surefire.junitcore.JUnitCoreWrapper.createRequestAndRun(JUnitCoreWrapper.java:137)
at org.apache.maven.surefire.junitcore.JUnitCoreWrapper.executeEager(JUnitCoreWrapper.java:107)
at org.apache.maven.surefire.junitcore.JUnitCoreWrapper.execute(JUnitCoreWrapper.java:83)
at org.apache.maven.surefire.junitcore.JUnitCoreWrapper.execute(JUnitCoreWrapper.java:75)
at org.apache.maven.surefire.junitcore.JUnitCoreProvider.invoke(JUnitCoreProvider.java:159)
at org.apache.maven.surefire.booter.ForkedBooter.invokeProviderInSameClassLoader(ForkedBooter.java:373)
at org.apache.maven.surefire.booter.ForkedBooter.runSuitesInProcess(ForkedBooter.java:334)
at org.apache.maven.surefire.booter.ForkedBooter.execute(ForkedBooter.java:119)
at org.apache.maven.surefire.booter.ForkedBooter.main(ForkedBooter.java:407)
Failed: OOZIE-3373 PreCommit Build #902
Posted by Apache Jenkins Server <je...@builds.apache.org>.
Jira: https://issues.apache.org/jira/browse/OOZIE-3373
Build: https://builds.apache.org/job/PreCommit-OOZIE-Build/902/
###################################################################################
########################## LAST 100 LINES OF THE CONSOLE ###########################
[...truncated 1.89 MB...]
[DEBUG] There are no new bugs found in [sharelib/sqoop].
[TRACE] New XMLLib present, calling 'xmllint --xpath' to get bug instance counts
[DEBUG] There are no new bugs found in [sharelib/spark].
[TRACE] New XMLLib present, calling 'xmllint --xpath' to get bug instance counts
[DEBUG] There are no new bugs found in [sharelib/hive2].
[TRACE] New XMLLib present, calling 'xmllint --xpath' to get bug instance counts
[DEBUG] There are no new bugs found in [sharelib/pig].
[TRACE] New XMLLib present, calling 'xmllint --xpath' to get bug instance counts
[DEBUG] There are no new bugs found in [webapp].
[INFO] There are no new bugs found totally].
[TRACE] FindBugs diffs checked and reports created
[TRACE] Summary file size is 2561 bytes
[TRACE] Full summary file size is 1471 bytes
[TRACE] File [/home/jenkins/jenkins-slave/workspace/PreCommit-OOZIE-Build/test-patch/tmp/FINDBUGS_DIFF/diff/findbugs-diff-0.1.0-all.jar] removed
[TRACE] File [/home/jenkins/jenkins-slave/workspace/PreCommit-OOZIE-Build/test-patch/tmp/FINDBUGS_DIFF/diff/findbugs-diff-0.1.0-all.jar.md5sum] removed
Running test-patch task BACKWARDS_COMPATIBILITY
Running test-patch task TESTS
Running test-patch task DISTRO
Testing JIRA OOZIE-3373
Cleaning local git workspace
----------------------------
+1 PATCH_APPLIES
+1 CLEAN
-1 RAW_PATCH_ANALYSIS
+1 the patch does not introduce any @author tags
+1 the patch does not introduce any tabs
+1 the patch does not introduce any trailing spaces
+1 the patch does not introduce any star imports
+1 the patch does not introduce any line longer than 132
-1 the patch does not add/modify any testcase
+1 RAT
+1 the patch does not seem to introduce new RAT warnings
+1 JAVADOC
+1 Javadoc generation succeeded with the patch
+1 the patch does not seem to introduce new Javadoc warning(s)
WARNING: the current HEAD has 100 Javadoc warning(s)
+1 COMPILE
+1 HEAD compiles
+1 patch compiles
+1 the patch does not seem to introduce new javac warnings
+1 There are no new bugs found in total.
+1 There are no new bugs found in [docs].
+1 There are no new bugs found in [examples].
+1 There are no new bugs found in [tools].
+1 There are no new bugs found in [core].
+1 There are no new bugs found in [server].
+1 There are no new bugs found in [client].
+1 There are no new bugs found in [fluent-job/fluent-job-api].
+1 There are no new bugs found in [sharelib/distcp].
+1 There are no new bugs found in [sharelib/oozie].
+1 There are no new bugs found in [sharelib/hcatalog].
+1 There are no new bugs found in [sharelib/streaming].
+1 There are no new bugs found in [sharelib/git].
+1 There are no new bugs found in [sharelib/hive].
+1 There are no new bugs found in [sharelib/sqoop].
+1 There are no new bugs found in [sharelib/spark].
+1 There are no new bugs found in [sharelib/hive2].
+1 There are no new bugs found in [sharelib/pig].
+1 There are no new bugs found in [webapp].
+1 BACKWARDS_COMPATIBILITY
+1 the patch does not change any JPA Entity/Colum/Basic/Lob/Transient annotations
+1 the patch does not modify JPA files
+1 TESTS
Tests run: 3062
Tests failed at first run:
TestStatusTransitService#testCoordStatusTransitServiceSuspendAndResume
For the complete list of flaky tests, see TEST-SUMMARY-FULL files.
+1 DISTRO
+1 distro tarball builds with the patch
----------------------------
-1 Overall result, please check the reported -1(s)
There is at least one warning, please check
The full output of the test-patch run is available at
https://builds.apache.org/job/PreCommit-OOZIE-Build/902/
Adding comment to JIRA
% Total % Received % Xferd Average Speed Time Time Time Current
Dload Upload Total Spent Left Speed
0 0 0 0 0 0 0 0 --:--:-- --:--:-- --:--:-- 0{"self":"https://issues.apache.org/jira/rest/api/2/issue/13193372/comment/16672537","id":"16672537","author":{"self":"https://issues.apache.org/jira/rest/api/2/user?username=hadoopqa","name":"hadoopqa","key":"hadoopqa","avatarUrls":{"48x48":"https://issues.apache.org/jira/secure/useravatar?ownerId=hadoopqa&avatarId=10393","24x24":"https://issues.apache.org/jira/secure/useravatar?size=small&ownerId=hadoopqa&avatarId=10393","16x16":"https://issues.apache.org/jira/secure/useravatar?size=xsmall&ownerId=hadoopqa&avatarId=10393","32x32":"https://issues.apache.org/jira/secure/useravatar?size=medium&ownerId=hadoopqa&avatarId=10393"},"displayName":"Hadoop QA","active":true,"timeZone":"Etc/UTC"},"body":"\nTesting JIRA OOZIE-3373\n\nCleaning local git workspace\n\n----------------------------\n\n{color:green}+1 PATCH_APPLIES{color}\n{color:green}+1 CLEAN{color}\n{color:red}-1 RAW_PATCH_ANALYSIS{color}\n. {color:green}+1{color} the patch does not introduce any @author tags\n. {color:green}+1{color} the patch does not introduce any tabs\n. {color:green}+1{color} the patch does not introduce any trailing spaces\n. {color:green}+1{color} the patch does not introduce any star imports\n. {color:green}+1{color} the patch does not introduce any line longer than 132\n. {color:red}-1{color} the patch does not add/modify any testcase\n{color:green}+1 RAT{color}\n. {color:green}+1{color} the patch does not seem to introduce new RAT warnings\n{color:green}+1 JAVADOC{color}\n. {color:green}+1{color} Javadoc generation succeeded with the patch\n. {color:green}+1{color} the patch does not seem to introduce new Javadoc warning(s)\n. {color:orange}WARNING{color}: the current HEAD has 100 Javadoc warning(s)\n{color:green}+1 COMPILE{color}\n. {color:green}+1{color} HEAD compiles\n. {color:green}+1{color} patch compiles\n. {color:green}+1{color} the patch does not seem to introduce new javac warnings\n{color:green}+1{color} There are no new bugs found in total.\n. {color:green}+1{color} There are no new bugs found in [docs].\n. {color:green}+1{color} There are no new bugs found in [examples].\n. {color:green}+1{color} There are no new bugs found in [tools].\n. {color:green}+1{color} There are no new bugs found in [core].\n. {color:green}+1{color} There are no new bugs found in [server].\n. {color:green}+1{color} There are no new bugs found in [client].\n. {color:green}+1{color} There are no new bugs found in [fluent-job/fluent-job-api].\n. {color:green}+1{color} There are no new bugs found in [sharelib/distcp].\n. {color:green}+1{color} There are no new bugs found in [sharelib/oozie].\n. {color:green}+1{color} There are no new bugs found in [sharelib/hcatalog].\n. {color:green}+1{color} There are no new bugs found in [sharelib/streaming].\n. {color:green}+1{color} There are no new bugs found in [sharelib/git].\n. {color:green}+1{color} There are no new bugs found in [sharelib/hive].\n. {color:green}+1{color} There are no new bugs found in [sharelib/sqoop].\n. {color:green}+1{color} There are no new bugs found in [sharelib/spark].\n. {color:green}+1{color} There are no new bugs found in [sharelib/hive2].\n. {color:green}+1{color} There are no new bugs found in [sharelib/pig].\n. {color:green}+1{color} There are no new bugs found in [webapp].\n{color:green}+1 BACKWARDS_COMPATIBILITY{color}\n. {color:green}+1{color} the patch does not change any JPA Entity/Colum/Basic/Lob/Transient annotations\n. {color:green}+1{color} the patch does not modify JPA files\n{color:green}+1 TESTS{color}\n. Tests run: 3062\n. {color:orange}Tests failed at first run:{color}\nTestStatusTransitService#testCoordStatusTransitServiceSuspendAndResume\n. For the complete list of flaky tests, see TEST-SUMMARY-FULL files.\n{color:green}+1 DISTRO{color}\n. {color:green}+1{color} distro tarball builds with the patch \n\n----------------------------\n{color:red}*-1 Overall result, please check the reported -1(s)*{color}\n\n{color:red}. There is at least one warning, please check{color}\n\nThe full output of the test-patch run is ava100 8336 0 4856 100 3480 7392 5297 --:--:-- --:--:-- --:--:-- 7402
ilable at\n\n. https://builds.apache.org/job/PreCommit-OOZIE-Build/902/\n\n","updateAuthor":{"self":"https://issues.apache.org/jira/rest/api/2/user?username=hadoopqa","name":"hadoopqa","key":"hadoopqa","avatarUrls":{"48x48":"https://issues.apache.org/jira/secure/useravatar?ownerId=hadoopqa&avatarId=10393","24x24":"https://issues.apache.org/jira/secure/useravatar?size=small&ownerId=hadoopqa&avatarId=10393","16x16":"https://issues.apache.org/jira/secure/useravatar?size=xsmall&ownerId=hadoopqa&avatarId=10393","32x32":"https://issues.apache.org/jira/secure/useravatar?size=medium&ownerId=hadoopqa&avatarId=10393"},"displayName":"Hadoop QA","active":true,"timeZone":"Etc/UTC"},"created":"2018-11-02T03:38:00.560+0000","updated":"2018-11-02T03:38:00.560+0000"}
test-patch exit code: 1
Build step 'Execute shell' marked build as failure
[description-setter] Description set: OOZIE-3373
Archiving artifacts
[Fast Archiver] Compressed 3.02 MB of artifacts by 14.5% relative to #889
Recording test results
ERROR: Step ?Publish JUnit test result report? failed: No test report files were found. Configuration error?
Email was triggered for: Failure - Any
Sending email for trigger: Failure - Any
###################################################################################
############################## FAILED TESTS (if any) ##############################
No tests ran.
Failed: OOZIE-3376 PreCommit Build #901
Posted by Apache Jenkins Server <je...@builds.apache.org>.
Jira: https://issues.apache.org/jira/browse/OOZIE-3376
Build: https://builds.apache.org/job/PreCommit-OOZIE-Build/901/
###################################################################################
########################## LAST 100 LINES OF THE CONSOLE ###########################
[...truncated 1.88 MB...]
[DEBUG] There are no new bugs found in [sharelib/hcatalog].
[TRACE] New XMLLib present, calling 'xmllint --xpath' to get bug instance counts
[DEBUG] There are no new bugs found in [sharelib/hive].
[TRACE] New XMLLib present, calling 'xmllint --xpath' to get bug instance counts
[DEBUG] There are no new bugs found in [sharelib/pig].
[TRACE] New XMLLib present, calling 'xmllint --xpath' to get bug instance counts
[DEBUG] There are no new bugs found in [sharelib/oozie].
[TRACE] New XMLLib present, calling 'xmllint --xpath' to get bug instance counts
[DEBUG] There are no new bugs found in [sharelib/sqoop].
[TRACE] New XMLLib present, calling 'xmllint --xpath' to get bug instance counts
[DEBUG] There are no new bugs found in [sharelib/distcp].
[TRACE] New XMLLib present, calling 'xmllint --xpath' to get bug instance counts
[DEBUG] There are no new bugs found in [sharelib/spark].
[INFO] There are no new bugs found totally].
[TRACE] FindBugs diffs checked and reports created
[TRACE] Summary file size is 2560 bytes
[TRACE] Full summary file size is 1471 bytes
[TRACE] File [/home/jenkins/jenkins-slave/workspace/PreCommit-OOZIE-Build/test-patch/tmp/FINDBUGS_DIFF/diff/findbugs-diff-0.1.0-all.jar] removed
[TRACE] File [/home/jenkins/jenkins-slave/workspace/PreCommit-OOZIE-Build/test-patch/tmp/FINDBUGS_DIFF/diff/findbugs-diff-0.1.0-all.jar.md5sum] removed
Running test-patch task BACKWARDS_COMPATIBILITY
Running test-patch task TESTS
Running test-patch task DISTRO
Testing JIRA OOZIE-3376
Cleaning local git workspace
----------------------------
+1 PATCH_APPLIES
+1 CLEAN
+1 RAW_PATCH_ANALYSIS
+1 the patch does not introduce any @author tags
+1 the patch does not introduce any tabs
+1 the patch does not introduce any trailing spaces
+1 the patch does not introduce any star imports
+1 the patch does not introduce any line longer than 132
+1 the patch adds/modifies 1 testcase(s)
+1 RAT
+1 the patch does not seem to introduce new RAT warnings
+1 JAVADOC
+1 Javadoc generation succeeded with the patch
+1 the patch does not seem to introduce new Javadoc warning(s)
WARNING: the current HEAD has 100 Javadoc warning(s)
+1 COMPILE
+1 HEAD compiles
+1 patch compiles
+1 the patch does not seem to introduce new javac warnings
+1 There are no new bugs found in total.
+1 There are no new bugs found in [webapp].
+1 There are no new bugs found in [examples].
+1 There are no new bugs found in [server].
+1 There are no new bugs found in [client].
+1 There are no new bugs found in [docs].
+1 There are no new bugs found in [fluent-job/fluent-job-api].
+1 There are no new bugs found in [core].
+1 There are no new bugs found in [tools].
+1 There are no new bugs found in [sharelib/streaming].
+1 There are no new bugs found in [sharelib/hive2].
+1 There are no new bugs found in [sharelib/git].
+1 There are no new bugs found in [sharelib/hcatalog].
+1 There are no new bugs found in [sharelib/hive].
+1 There are no new bugs found in [sharelib/pig].
+1 There are no new bugs found in [sharelib/oozie].
+1 There are no new bugs found in [sharelib/sqoop].
+1 There are no new bugs found in [sharelib/distcp].
+1 There are no new bugs found in [sharelib/spark].
+1 BACKWARDS_COMPATIBILITY
+1 the patch does not change any JPA Entity/Colum/Basic/Lob/Transient annotations
+1 the patch does not modify JPA files
+1 TESTS
Tests run: 3062
+1 DISTRO
+1 distro tarball builds with the patch
----------------------------
+1 Overall result, good!, no -1s
There is at least one warning, please check
The full output of the test-patch run is available at
https://builds.apache.org/job/PreCommit-OOZIE-Build/901/
Adding comment to JIRA
% Total % Received % Xferd Average Speed Time Time Time Current
Dload Upload Total Spent Left Speed
0 0 0 0 0 0 0 0 --:--:-- --:--:-- --:--:-- 0100 3264 0 0 100 3264 0 4686 --:--:-- --:--:-- --:--:-- 4682{"self":"https://issues.apache.org/jira/rest/api/2/issue/13195408/comment/16670888","id":"16670888","author":{"self":"https://issues.apache.org/jira/rest/api/2/user?username=hadoopqa","name":"hadoopqa","key":"hadoopqa","avatarUrls":{"48x48":"https://issues.apache.org/jira/secure/useravatar?ownerId=hadoopqa&avatarId=10393","24x24":"https://issues.apache.org/jira/secure/useravatar?size=small&ownerId=hadoopqa&avatarId=10393","16x16":"https://issues.apache.org/jira/secure/useravatar?size=xsmall&ownerId=hadoopqa&avatarId=10393","32x32":"https://issues.apache.org/jira/secure/useravatar?size=medium&ownerId=hadoopqa&avatarId=10393"},"displayName":"Hadoop QA","active":true,"timeZone":"Etc/UTC"},"body":"\nTesting JIRA OOZIE-3376\n\nCleaning local git workspace\n\n----------------------------\n\n{color:green}+1 PATCH_APPLIES{color}\n{color:green}+1 CLEAN{color}\n{color:green}+1 RAW_PATCH_ANALYSIS{color}\n. {color:green}+1{color} the patch does not introduce any @author tags\n. {color:green}+1{color} the patch does not introduce any tabs\n. {color:green}+1{color} the patch does not introduce any trailing spaces\n. {color:green}+1{color} the patch does not introduce any star imports\n. {color:green}+1{color} the patch does not introduce any line longer than 132\n. {color:green}+1{color} the patch adds/modifies 1 testcase(s)\n{color:green}+1 RAT{color}\n. {color:green}+1{color} the patch does not seem to introduce new RAT warnings\n{color:green}+1 JAVADOC{color}\n. {color:green}+1{color} Javadoc generation succeeded with the patch\n. {color:green}+1{color} the patch does not seem to introduce new Javadoc warning(s)\n. {color:orange}WARNING{color}: the current HEAD has 100 Javadoc warning(s)\n{color:green}+1 COMPILE{color}\n. {color:green}+1{color} HEAD compiles\n. {color:green}+1{color} patch compiles\n. {color:green}+1{color} the patch does not seem to introduce new javac warnings\n{color:green}+1{color} There are no new bugs found in total.\n. {color:green}+1{color} There are no new bugs found in [webapp].\n. {color:green}+1{color} There are no new bugs found in [examples].\n. {color:green}+1{color} There are no new bugs found in [server].\n. {color:green}+1{color} There are no new bugs found in [client].\n. {color:green}+1{color} There are no new bugs found in [docs].\n. {color:green}+1{color} There are no new bugs found in [fluent-job/fluent-job-api].\n. {color:green}+1{color} There are no new bugs found in [core].\n. {color:green}+1{color} There are no new bugs found in [tools].\n. {color:green}+1{color} There are no new bugs found in [sharelib/streaming].\n. {color:green}+1{color} There are no new bugs found in [sharelib/hive2].\n. {color:green}+1{color} There are no new bugs found in [sharelib/git].\n. {color:green}+1{color} There are no new bugs found in [sharelib/hcatalog].\n. {color:green}+1{color} There are no new bugs found in [sharelib/hive].\n. {color:green}+1{color} There are no new bugs found in [sharelib/pig].\n. {color:green}+1{color} There are no new bugs found in [sharelib/oozie].\n. {color:green}+1{color} There are no new bugs found in [sharelib/sqoop].\n. {color:green}+1{color} There are no new bugs found in [sharelib/distcp].\n. {color:green}+1{color} There are no new bugs found in [sharelib/spark].\n{color:green}+1 BACKWARDS_COMPATIBILITY{color}\n. {color:green}+1{color} the patch does not change any JPA Entity/Colum/Basic/Lob/Transient annotations\n. {color:green}+1{color} the patch does not modify JPA files\n{color:green}+1 TESTS{color}\n. Tests run: 3062\n{color:green}+1 DISTRO{color}\n. {color:green}+1{color} distro tarball builds with the patch \n\n----------------------------\n{color:green}*+1 Overall result, good!, no -1s*{color}\n\n{color:red}. There is at least one warning, please check{color}\n\nThe full output of the test-patch run is available at\n\n. https://builds.apache.org/job/PreCommit-OOZIE-Build/901/\n\n","updateAuthor":{"self":"https://issues.apache.org/jira/rest/api/2/user?username=hadoopqa","name":"hadoopqa","key":"hadoopqa","avatarUrls":{100 7904 0 4640 100 3264 6654 4681 --:--:-- --:--:-- --:--:-- 6647
"48x48":"https://issues.apache.org/jira/secure/useravatar?ownerId=hadoopqa&avatarId=10393","24x24":"https://issues.apache.org/jira/secure/useravatar?size=small&ownerId=hadoopqa&avatarId=10393","16x16":"https://issues.apache.org/jira/secure/useravatar?size=xsmall&ownerId=hadoopqa&avatarId=10393","32x32":"https://issues.apache.org/jira/secure/useravatar?size=medium&ownerId=hadoopqa&avatarId=10393"},"displayName":"Hadoop QA","active":true,"timeZone":"Etc/UTC"},"created":"2018-10-31T23:21:33.001+0000","updated":"2018-10-31T23:21:33.001+0000"}
test-patch exit code: 0
[description-setter] Description set: OOZIE-3376
Archiving artifacts
[Fast Archiver] Compressed 2.93 MB of artifacts by 14.9% relative to #889
Recording test results
ERROR: Step ?Publish JUnit test result report? failed: No test report files were found. Configuration error?
Email was triggered for: Failure - Any
Sending email for trigger: Failure - Any
###################################################################################
############################## FAILED TESTS (if any) ##############################
No tests ran.
Failed: OOZIE-3375 PreCommit Build #900
Posted by Apache Jenkins Server <je...@builds.apache.org>.
Jira: https://issues.apache.org/jira/browse/OOZIE-3375
Build: https://builds.apache.org/job/PreCommit-OOZIE-Build/900/
###################################################################################
########################## LAST 100 LINES OF THE CONSOLE ###########################
[...truncated 1.92 MB...]
[TRACE] FindBugs diffs checked and reports created
[TRACE] Summary file size is 2560 bytes
[TRACE] Full summary file size is 1471 bytes
[TRACE] File [/home/jenkins/jenkins-slave/workspace/PreCommit-OOZIE-Build/test-patch/tmp/FINDBUGS_DIFF/diff/findbugs-diff-0.1.0-all.jar] removed
[TRACE] File [/home/jenkins/jenkins-slave/workspace/PreCommit-OOZIE-Build/test-patch/tmp/FINDBUGS_DIFF/diff/findbugs-diff-0.1.0-all.jar.md5sum] removed
Running test-patch task BACKWARDS_COMPATIBILITY
Running test-patch task TESTS
xargs: Warning: a NUL character occurred in the input. It cannot be passed through in the argument list. Did you mean to use the --null option?
xargs: Warning: a NUL character occurred in the input. It cannot be passed through in the argument list. Did you mean to use the --null option?
Running test-patch task DISTRO
Testing JIRA OOZIE-3375
Cleaning local git workspace
----------------------------
+1 PATCH_APPLIES
+1 CLEAN
+1 RAW_PATCH_ANALYSIS
+1 the patch does not introduce any @author tags
+1 the patch does not introduce any tabs
+1 the patch does not introduce any trailing spaces
+1 the patch does not introduce any star imports
+1 the patch does not introduce any line longer than 132
+1 the patch adds/modifies 1 testcase(s)
+1 RAT
+1 the patch does not seem to introduce new RAT warnings
+1 JAVADOC
+1 Javadoc generation succeeded with the patch
+1 the patch does not seem to introduce new Javadoc warning(s)
WARNING: the current HEAD has 100 Javadoc warning(s)
+1 COMPILE
+1 HEAD compiles
+1 patch compiles
+1 the patch does not seem to introduce new javac warnings
+1 There are no new bugs found in total.
+1 There are no new bugs found in [webapp].
+1 There are no new bugs found in [examples].
+1 There are no new bugs found in [server].
+1 There are no new bugs found in [client].
+1 There are no new bugs found in [docs].
+1 There are no new bugs found in [fluent-job/fluent-job-api].
+1 There are no new bugs found in [core].
+1 There are no new bugs found in [tools].
+1 There are no new bugs found in [sharelib/streaming].
+1 There are no new bugs found in [sharelib/hive2].
+1 There are no new bugs found in [sharelib/git].
+1 There are no new bugs found in [sharelib/hcatalog].
+1 There are no new bugs found in [sharelib/hive].
+1 There are no new bugs found in [sharelib/pig].
+1 There are no new bugs found in [sharelib/oozie].
+1 There are no new bugs found in [sharelib/sqoop].
+1 There are no new bugs found in [sharelib/distcp].
+1 There are no new bugs found in [sharelib/spark].
+1 BACKWARDS_COMPATIBILITY
+1 the patch does not change any JPA Entity/Colum/Basic/Lob/Transient annotations
+1 the patch does not modify JPA files
-1 TESTS
Tests run : 3063
Tests failed : 4
Tests in error : 1
Tests timed out : 0
-1 [ERROR] There are [4] test failures in [core]. Listing only the first [5] ones
testCoordSLAAlertCommands:org.apache.oozie.command.TestSLAAlertXCommand
testBundleSLAAlertCommands:org.apache.oozie.command.TestSLAAlertXCommand
-1 [ERROR] There are [1] test errors in [core]. Listing only the first [5] ones
Check console output for the full list of errors/failures
+1 DISTRO
+1 distro tarball builds with the patch
----------------------------
-1 Overall result, please check the reported -1(s)
There is at least one warning, please check
The full output of the test-patch run is available at
https://builds.apache.org/job/PreCommit-OOZIE-Build/900/
Adding comment to JIRA
% Total % Received % Xferd Average Speed Time Time Time Current
Dload Upload Total Spent Left Speed
0 0 0 0 0 0 0 0 --:--:-- --:--:-- --:--:-- 0 0 0 0 0 0 0 0 0 --:--:-- --:--:-- --:--:-- 0{"self":"https://issues.apache.org/jira/rest/api/2/issue/13194924/comment/16667837","id":"16667837","author":{"self":"https://issues.apache.org/jira/rest/api/2/user?username=hadoopqa","name":"hadoopqa","key":"hadoopqa","avatarUrls":{"48x48":"https://issues.apache.org/jira/secure/useravatar?ownerId=hadoopqa&avatarId=10393","24x24":"https://issues.apache.org/jira/secure/useravatar?size=small&ownerId=hadoopqa&avatarId=10393","16x16":"https://issues.apache.org/jira/secure/useravatar?size=xsmall&ownerId=hadoopqa&avatarId=10393","32x32":"https://issues.apache.org/jira/secure/useravatar?size=medium&ownerId=hadoopqa&avatarId=10393"},"displayName":"Hadoop QA","active":true,"timeZone":"Etc/UTC"},"body":"\nTesting JIRA OOZIE-3375\n\nCleaning local git workspace\n\n----------------------------\n\n{color:green}+1 PATCH_APPLIES{color}\n{color:green}+1 CLEAN{color}\n{color:green}+1 RAW_PATCH_ANALYSIS{color}\n. {color:green}+1{color} the patch does not introduce any @author tags\n. {color:green}+1{color} the patch does not introduce any tabs\n. {color:green}+1{color} the patch does not introduce any trailing spaces\n. {color:green}+1{color} the patch does not introduce any star imports\n. {color:green}+1{color} the patch does not introduce any line longer than 132\n. {color:green}+1{color} the patch adds/modifies 1 testcase(s)\n{color:green}+1 RAT{color}\n. {color:green}+1{color} the patch does not seem to introduce new RAT warnings\n{color:green}+1 JAVADOC{color}\n. {color:green}+1{color} Javadoc generation succeeded with the patch\n. {color:green}+1{color} the patch does not seem to introduce new Javadoc warning(s)\n. {color:orange}WARNING{color}: the current HEAD has 100 Javadoc warning(s)\n{color:green}+1 COMPILE{color}\n. {color:green}+1{color} HEAD compiles\n. {color:green}+1{color} patch compiles\n. {color:green}+1{color} the patch does not seem to introduce new javac warnings\n{color:green}+1{color} There are no new bugs found in total.\n. {color:green}+1{color} There are no new bugs found in [webapp].\n. {color:green}+1{color} There are no new bugs found in [examples].\n. {color:green}+1{color} There are no new bugs found in [server].\n. {color:green}+1{color} There are no new bugs found in [client].\n. {color:green}+1{color} There are no new bugs found in [docs].\n. {color:green}+1{color} There are no new bugs found in [fluent-job/fluent-job-api].\n. {color:green}+1{color} There are no new bugs found in [core].\n. {color:green}+1{color} There are no new bugs found in [tools].\n. {color:green}+1{color} There are no new bugs found in [sharelib/streaming].\n. {color:green}+1{color} There are no new bugs found in [sharelib/hive2].\n. {color:green}+1{color} There are no new bugs found in [sharelib/git].\n. {color:green}+1{color} There are no new bugs found in [sharelib/hcatalog].\n. {color:green}+1{color} There are no new bugs found in [sharelib/hive].\n. {color:green}+1{color} There are no new bugs found in [sharelib/pig].\n. {color:green}+1{color} There are no new bugs found in [sharelib/oozie].\n. {color:green}+1{color} There are no new bugs found in [sharelib/sqoop].\n. {color:green}+1{color} There are no new bugs found in [sharelib/distcp].\n. {color:green}+1{color} There are no new bugs found in [sharelib/spark].\n{color:green}+1 BACKWARDS_COMPATIBILITY{color}\n. {color:green}+1{color} the patch does not change any JPA Entity/Colum/Basic/Lob/Transient annotations\n. {color:green}+1{color} the patch does not modify JPA files\n{color:red}-1 TESTS{color}\n. Tests run : 3063\n. Tests failed : 4\n. Tests in error : 1\n. Tests timed out : 0\n\n{color:red}-1{color} [ERROR] There are [4] test failures in [core]. Listing only the first [5] ones\ntestCoordSLAAlertCommands:org.apache.oozie.command.TestSLAAlertXCommand\ntestBundleSLAAlertCommands:org.apache.oozie.command.TestSLAAlertXCommand\n\n{color:red}-1{color} [ERROR] There are [1] test errors in [core]. Listing only the first [5] ones\n\n\nCheck console output for the full list of errors/failures\n{color:green}+100 8938 0 5157 100 3781 6597 4837 --:--:-- --:--:-- --:--:-- 6594
1 DISTRO{color}\n. {color:green}+1{color} distro tarball builds with the patch \n\n----------------------------\n{color:red}*-1 Overall result, please check the reported -1(s)*{color}\n\n{color:red}. There is at least one warning, please check{color}\n\nThe full output of the test-patch run is available at\n\n. https://builds.apache.org/job/PreCommit-OOZIE-Build/900/\n\n","updateAuthor":{"self":"https://issues.apache.org/jira/rest/api/2/user?username=hadoopqa","name":"hadoopqa","key":"hadoopqa","avatarUrls":{"48x48":"https://issues.apache.org/jira/secure/useravatar?ownerId=hadoopqa&avatarId=10393","24x24":"https://issues.apache.org/jira/secure/useravatar?size=small&ownerId=hadoopqa&avatarId=10393","16x16":"https://issues.apache.org/jira/secure/useravatar?size=xsmall&ownerId=hadoopqa&avatarId=10393","32x32":"https://issues.apache.org/jira/secure/useravatar?size=medium&ownerId=hadoopqa&avatarId=10393"},"displayName":"Hadoop QA","active":true,"timeZone":"Etc/UTC"},"created":"2018-10-29T22:21:53.446+0000","updated":"2018-10-29T22:21:53.446+0000"}
test-patch exit code: 1
Build step 'Execute shell' marked build as failure
[description-setter] Description set: OOZIE-3375
Archiving artifacts
[Fast Archiver] Compressed 3.02 MB of artifacts by 14.5% relative to #889
Recording test results
Email was triggered for: Failure - Any
Sending email for trigger: Failure - Any
###################################################################################
############################## FAILED TESTS (if any) ##############################
5 tests failed.
FAILED: org.apache.oozie.command.TestSLAAlertXCommand.testCoordSLAAlertCommands
Error Message:
expected:<> but was:<null>
Stack Trace:
junit.framework.ComparisonFailure: expected:<> but was:<null>
at junit.framework.Assert.assertEquals(Assert.java:100)
at junit.framework.Assert.assertEquals(Assert.java:107)
at junit.framework.TestCase.assertEquals(TestCase.java:269)
at org.apache.oozie.command.TestSLAAlertXCommand.testCoordSLAAlertCommands(TestSLAAlertXCommand.java:214)
at sun.reflect.NativeMethodAccessorImpl.invoke0(Native Method)
at sun.reflect.NativeMethodAccessorImpl.invoke(NativeMethodAccessorImpl.java:62)
at sun.reflect.DelegatingMethodAccessorImpl.invoke(DelegatingMethodAccessorImpl.java:43)
at java.lang.reflect.Method.invoke(Method.java:498)
at junit.framework.TestCase.runTest(TestCase.java:176)
at junit.framework.TestCase.runBare(TestCase.java:141)
at junit.framework.TestResult$1.protect(TestResult.java:122)
at junit.framework.TestResult.runProtected(TestResult.java:142)
at junit.framework.TestResult.run(TestResult.java:125)
at junit.framework.TestCase.run(TestCase.java:129)
at junit.framework.TestSuite.runTest(TestSuite.java:255)
at junit.framework.TestSuite.run(TestSuite.java:250)
at org.junit.internal.runners.JUnit38ClassRunner.run(JUnit38ClassRunner.java:84)
at org.junit.runners.Suite.runChild(Suite.java:127)
at org.junit.runners.Suite.runChild(Suite.java:26)
at org.junit.runners.ParentRunner$3.run(ParentRunner.java:238)
at org.junit.runners.ParentRunner$1.schedule(ParentRunner.java:63)
at org.junit.runners.ParentRunner.runChildren(ParentRunner.java:236)
at org.junit.runners.ParentRunner.access$000(ParentRunner.java:53)
at org.junit.runners.ParentRunner$2.evaluate(ParentRunner.java:229)
at org.junit.runners.ParentRunner.run(ParentRunner.java:309)
at org.junit.runners.Suite.runChild(Suite.java:127)
at org.junit.runners.Suite.runChild(Suite.java:26)
at org.junit.runners.ParentRunner$3.run(ParentRunner.java:238)
at org.apache.maven.surefire.junitcore.pc.Scheduler$1.run(Scheduler.java:410)
at org.apache.maven.surefire.junitcore.pc.InvokerStrategy.schedule(InvokerStrategy.java:54)
at org.apache.maven.surefire.junitcore.pc.Scheduler.schedule(Scheduler.java:367)
at org.junit.runners.ParentRunner.runChildren(ParentRunner.java:236)
at org.junit.runners.ParentRunner.access$000(ParentRunner.java:53)
at org.junit.runners.ParentRunner$2.evaluate(ParentRunner.java:229)
at org.junit.runners.ParentRunner.run(ParentRunner.java:309)
at org.apache.maven.surefire.junitcore.pc.ParallelComputerBuilder$PC$1.run(ParallelComputerBuilder.java:593)
at org.apache.maven.surefire.junitcore.JUnitCore.run(JUnitCore.java:55)
at org.apache.maven.surefire.junitcore.JUnitCoreWrapper.createRequestAndRun(JUnitCoreWrapper.java:137)
at org.apache.maven.surefire.junitcore.JUnitCoreWrapper.executeEager(JUnitCoreWrapper.java:107)
at org.apache.maven.surefire.junitcore.JUnitCoreWrapper.execute(JUnitCoreWrapper.java:83)
at org.apache.maven.surefire.junitcore.JUnitCoreWrapper.execute(JUnitCoreWrapper.java:75)
at org.apache.maven.surefire.junitcore.JUnitCoreProvider.invoke(JUnitCoreProvider.java:159)
at org.apache.maven.surefire.booter.ForkedBooter.invokeProviderInSameClassLoader(ForkedBooter.java:373)
at org.apache.maven.surefire.booter.ForkedBooter.runSuitesInProcess(ForkedBooter.java:334)
at org.apache.maven.surefire.booter.ForkedBooter.execute(ForkedBooter.java:119)
at org.apache.maven.surefire.booter.ForkedBooter.main(ForkedBooter.java:407)
FAILED: org.apache.oozie.command.TestSLAAlertXCommand.testBundleSLAAlertCommands
Error Message:
expected:<> but was:<null>
Stack Trace:
junit.framework.ComparisonFailure: expected:<> but was:<null>
at junit.framework.Assert.assertEquals(Assert.java:100)
at junit.framework.Assert.assertEquals(Assert.java:107)
at junit.framework.TestCase.assertEquals(TestCase.java:269)
at org.apache.oozie.command.TestSLAAlertXCommand.testBundleSLAAlertCommands(TestSLAAlertXCommand.java:107)
at sun.reflect.NativeMethodAccessorImpl.invoke0(Native Method)
at sun.reflect.NativeMethodAccessorImpl.invoke(NativeMethodAccessorImpl.java:62)
at sun.reflect.DelegatingMethodAccessorImpl.invoke(DelegatingMethodAccessorImpl.java:43)
at java.lang.reflect.Method.invoke(Method.java:498)
at junit.framework.TestCase.runTest(TestCase.java:176)
at junit.framework.TestCase.runBare(TestCase.java:141)
at junit.framework.TestResult$1.protect(TestResult.java:122)
at junit.framework.TestResult.runProtected(TestResult.java:142)
at junit.framework.TestResult.run(TestResult.java:125)
at junit.framework.TestCase.run(TestCase.java:129)
at junit.framework.TestSuite.runTest(TestSuite.java:255)
at junit.framework.TestSuite.run(TestSuite.java:250)
at org.junit.internal.runners.JUnit38ClassRunner.run(JUnit38ClassRunner.java:84)
at org.junit.runners.Suite.runChild(Suite.java:127)
at org.junit.runners.Suite.runChild(Suite.java:26)
at org.junit.runners.ParentRunner$3.run(ParentRunner.java:238)
at org.junit.runners.ParentRunner$1.schedule(ParentRunner.java:63)
at org.junit.runners.ParentRunner.runChildren(ParentRunner.java:236)
at org.junit.runners.ParentRunner.access$000(ParentRunner.java:53)
at org.junit.runners.ParentRunner$2.evaluate(ParentRunner.java:229)
at org.junit.runners.ParentRunner.run(ParentRunner.java:309)
at org.junit.runners.Suite.runChild(Suite.java:127)
at org.junit.runners.Suite.runChild(Suite.java:26)
at org.junit.runners.ParentRunner$3.run(ParentRunner.java:238)
at org.apache.maven.surefire.junitcore.pc.Scheduler$1.run(Scheduler.java:410)
at org.apache.maven.surefire.junitcore.pc.InvokerStrategy.schedule(InvokerStrategy.java:54)
at org.apache.maven.surefire.junitcore.pc.Scheduler.schedule(Scheduler.java:367)
at org.junit.runners.ParentRunner.runChildren(ParentRunner.java:236)
at org.junit.runners.ParentRunner.access$000(ParentRunner.java:53)
at org.junit.runners.ParentRunner$2.evaluate(ParentRunner.java:229)
at org.junit.runners.ParentRunner.run(ParentRunner.java:309)
at org.apache.maven.surefire.junitcore.pc.ParallelComputerBuilder$PC$1.run(ParallelComputerBuilder.java:593)
at org.apache.maven.surefire.junitcore.JUnitCore.run(JUnitCore.java:55)
at org.apache.maven.surefire.junitcore.JUnitCoreWrapper.createRequestAndRun(JUnitCoreWrapper.java:137)
at org.apache.maven.surefire.junitcore.JUnitCoreWrapper.executeEager(JUnitCoreWrapper.java:107)
at org.apache.maven.surefire.junitcore.JUnitCoreWrapper.execute(JUnitCoreWrapper.java:83)
at org.apache.maven.surefire.junitcore.JUnitCoreWrapper.execute(JUnitCoreWrapper.java:75)
at org.apache.maven.surefire.junitcore.JUnitCoreProvider.invoke(JUnitCoreProvider.java:159)
at org.apache.maven.surefire.booter.ForkedBooter.invokeProviderInSameClassLoader(ForkedBooter.java:373)
at org.apache.maven.surefire.booter.ForkedBooter.runSuitesInProcess(ForkedBooter.java:334)
at org.apache.maven.surefire.booter.ForkedBooter.execute(ForkedBooter.java:119)
at org.apache.maven.surefire.booter.ForkedBooter.main(ForkedBooter.java:407)
FAILED: org.apache.oozie.command.wf.TestSubmitXCommand.testProtoConfStorage
Error Message:
expected:<3> but was:<4>
Stack Trace:
junit.framework.AssertionFailedError: expected:<3> but was:<4>
at junit.framework.Assert.fail(Assert.java:57)
at junit.framework.Assert.failNotEquals(Assert.java:329)
at junit.framework.Assert.assertEquals(Assert.java:78)
at junit.framework.Assert.assertEquals(Assert.java:234)
at junit.framework.Assert.assertEquals(Assert.java:241)
at junit.framework.TestCase.assertEquals(TestCase.java:409)
at org.apache.oozie.command.wf.TestSubmitXCommand.testProtoConfStorage(TestSubmitXCommand.java:322)
at sun.reflect.NativeMethodAccessorImpl.invoke0(Native Method)
at sun.reflect.NativeMethodAccessorImpl.invoke(NativeMethodAccessorImpl.java:62)
at sun.reflect.DelegatingMethodAccessorImpl.invoke(DelegatingMethodAccessorImpl.java:43)
at java.lang.reflect.Method.invoke(Method.java:498)
at junit.framework.TestCase.runTest(TestCase.java:176)
at junit.framework.TestCase.runBare(TestCase.java:141)
at junit.framework.TestResult$1.protect(TestResult.java:122)
at junit.framework.TestResult.runProtected(TestResult.java:142)
at junit.framework.TestResult.run(TestResult.java:125)
at junit.framework.TestCase.run(TestCase.java:129)
at junit.framework.TestSuite.runTest(TestSuite.java:255)
at junit.framework.TestSuite.run(TestSuite.java:250)
at org.junit.internal.runners.JUnit38ClassRunner.run(JUnit38ClassRunner.java:84)
at org.junit.runners.Suite.runChild(Suite.java:127)
at org.junit.runners.Suite.runChild(Suite.java:26)
at org.junit.runners.ParentRunner$3.run(ParentRunner.java:238)
at org.junit.runners.ParentRunner$1.schedule(ParentRunner.java:63)
at org.junit.runners.ParentRunner.runChildren(ParentRunner.java:236)
at org.junit.runners.ParentRunner.access$000(ParentRunner.java:53)
at org.junit.runners.ParentRunner$2.evaluate(ParentRunner.java:229)
at org.junit.runners.ParentRunner.run(ParentRunner.java:309)
at org.junit.runners.Suite.runChild(Suite.java:127)
at org.junit.runners.Suite.runChild(Suite.java:26)
at org.junit.runners.ParentRunner$3.run(ParentRunner.java:238)
at org.apache.maven.surefire.junitcore.pc.Scheduler$1.run(Scheduler.java:410)
at org.apache.maven.surefire.junitcore.pc.InvokerStrategy.schedule(InvokerStrategy.java:54)
at org.apache.maven.surefire.junitcore.pc.Scheduler.schedule(Scheduler.java:367)
at org.junit.runners.ParentRunner.runChildren(ParentRunner.java:236)
at org.junit.runners.ParentRunner.access$000(ParentRunner.java:53)
at org.junit.runners.ParentRunner$2.evaluate(ParentRunner.java:229)
at org.junit.runners.ParentRunner.run(ParentRunner.java:309)
at org.apache.maven.surefire.junitcore.pc.ParallelComputerBuilder$PC$1.run(ParallelComputerBuilder.java:593)
at org.apache.maven.surefire.junitcore.JUnitCore.run(JUnitCore.java:55)
at org.apache.maven.surefire.junitcore.JUnitCoreWrapper.createRequestAndRun(JUnitCoreWrapper.java:137)
at org.apache.maven.surefire.junitcore.JUnitCoreWrapper.executeEager(JUnitCoreWrapper.java:107)
at org.apache.maven.surefire.junitcore.JUnitCoreWrapper.execute(JUnitCoreWrapper.java:83)
at org.apache.maven.surefire.junitcore.JUnitCoreWrapper.execute(JUnitCoreWrapper.java:75)
at org.apache.maven.surefire.junitcore.JUnitCoreProvider.invoke(JUnitCoreProvider.java:159)
at org.apache.maven.surefire.booter.ForkedBooter.invokeProviderInSameClassLoader(ForkedBooter.java:373)
at org.apache.maven.surefire.booter.ForkedBooter.runSuitesInProcess(ForkedBooter.java:334)
at org.apache.maven.surefire.booter.ForkedBooter.execute(ForkedBooter.java:119)
at org.apache.maven.surefire.booter.ForkedBooter.main(ForkedBooter.java:407)
FAILED: org.apache.oozie.service.TestConfigurationService.testOozieConfig
Error Message:
Expected: <null> but was:
Stack Trace:
junit.framework.AssertionFailedError: Expected: <null> but was:
at junit.framework.Assert.fail(Assert.java:57)
at junit.framework.Assert.assertTrue(Assert.java:22)
at junit.framework.Assert.assertNull(Assert.java:277)
at junit.framework.Assert.assertNull(Assert.java:268)
at junit.framework.TestCase.assertNull(TestCase.java:438)
at org.apache.oozie.service.TestConfigurationService.testOozieConfig(TestConfigurationService.java:233)
at sun.reflect.NativeMethodAccessorImpl.invoke0(Native Method)
at sun.reflect.NativeMethodAccessorImpl.invoke(NativeMethodAccessorImpl.java:62)
at sun.reflect.DelegatingMethodAccessorImpl.invoke(DelegatingMethodAccessorImpl.java:43)
at java.lang.reflect.Method.invoke(Method.java:498)
at junit.framework.TestCase.runTest(TestCase.java:176)
at junit.framework.TestCase.runBare(TestCase.java:141)
at junit.framework.TestResult$1.protect(TestResult.java:122)
at junit.framework.TestResult.runProtected(TestResult.java:142)
at junit.framework.TestResult.run(TestResult.java:125)
at junit.framework.TestCase.run(TestCase.java:129)
at junit.framework.TestSuite.runTest(TestSuite.java:255)
at junit.framework.TestSuite.run(TestSuite.java:250)
at org.junit.internal.runners.JUnit38ClassRunner.run(JUnit38ClassRunner.java:84)
at org.junit.runners.Suite.runChild(Suite.java:127)
at org.junit.runners.Suite.runChild(Suite.java:26)
at org.junit.runners.ParentRunner$3.run(ParentRunner.java:238)
at org.junit.runners.ParentRunner$1.schedule(ParentRunner.java:63)
at org.junit.runners.ParentRunner.runChildren(ParentRunner.java:236)
at org.junit.runners.ParentRunner.access$000(ParentRunner.java:53)
at org.junit.runners.ParentRunner$2.evaluate(ParentRunner.java:229)
at org.junit.runners.ParentRunner.run(ParentRunner.java:309)
at org.junit.runners.Suite.runChild(Suite.java:127)
at org.junit.runners.Suite.runChild(Suite.java:26)
at org.junit.runners.ParentRunner$3.run(ParentRunner.java:238)
at org.apache.maven.surefire.junitcore.pc.Scheduler$1.run(Scheduler.java:410)
at org.apache.maven.surefire.junitcore.pc.InvokerStrategy.schedule(InvokerStrategy.java:54)
at org.apache.maven.surefire.junitcore.pc.Scheduler.schedule(Scheduler.java:367)
at org.junit.runners.ParentRunner.runChildren(ParentRunner.java:236)
at org.junit.runners.ParentRunner.access$000(ParentRunner.java:53)
at org.junit.runners.ParentRunner$2.evaluate(ParentRunner.java:229)
at org.junit.runners.ParentRunner.run(ParentRunner.java:309)
at org.apache.maven.surefire.junitcore.pc.ParallelComputerBuilder$PC$1.run(ParallelComputerBuilder.java:593)
at org.apache.maven.surefire.junitcore.JUnitCore.run(JUnitCore.java:55)
at org.apache.maven.surefire.junitcore.JUnitCoreWrapper.createRequestAndRun(JUnitCoreWrapper.java:137)
at org.apache.maven.surefire.junitcore.JUnitCoreWrapper.executeEager(JUnitCoreWrapper.java:107)
at org.apache.maven.surefire.junitcore.JUnitCoreWrapper.execute(JUnitCoreWrapper.java:83)
at org.apache.maven.surefire.junitcore.JUnitCoreWrapper.execute(JUnitCoreWrapper.java:75)
at org.apache.maven.surefire.junitcore.JUnitCoreProvider.invoke(JUnitCoreProvider.java:159)
at org.apache.maven.surefire.booter.ForkedBooter.invokeProviderInSameClassLoader(ForkedBooter.java:373)
at org.apache.maven.surefire.booter.ForkedBooter.runSuitesInProcess(ForkedBooter.java:334)
at org.apache.maven.surefire.booter.ForkedBooter.execute(ForkedBooter.java:119)
at org.apache.maven.surefire.booter.ForkedBooter.main(ForkedBooter.java:407)
FAILED: org.apache.oozie.util.TestMetricsInstrumentation.testJMXInstrumentation
Error Message:
Unable to open socket file: target process not responding or HotSpot VM not loaded
Stack Trace:
com.sun.tools.attach.AttachNotSupportedException: Unable to open socket file: target process not responding or HotSpot VM not loaded
at sun.tools.attach.LinuxVirtualMachine.<init>(LinuxVirtualMachine.java:106)
at sun.tools.attach.LinuxAttachProvider.attachVirtualMachine(LinuxAttachProvider.java:78)
at com.sun.tools.attach.VirtualMachine.attach(VirtualMachine.java:250)
at org.apache.oozie.util.TestMetricsInstrumentation.testJMXInstrumentation(TestMetricsInstrumentation.java:234)
at sun.reflect.NativeMethodAccessorImpl.invoke0(Native Method)
at sun.reflect.NativeMethodAccessorImpl.invoke(NativeMethodAccessorImpl.java:62)
at sun.reflect.DelegatingMethodAccessorImpl.invoke(DelegatingMethodAccessorImpl.java:43)
at java.lang.reflect.Method.invoke(Method.java:498)
at junit.framework.TestCase.runTest(TestCase.java:176)
at junit.framework.TestCase.runBare(TestCase.java:141)
at junit.framework.TestResult$1.protect(TestResult.java:122)
at junit.framework.TestResult.runProtected(TestResult.java:142)
at junit.framework.TestResult.run(TestResult.java:125)
at junit.framework.TestCase.run(TestCase.java:129)
at junit.framework.TestSuite.runTest(TestSuite.java:255)
at junit.framework.TestSuite.run(TestSuite.java:250)
at org.junit.internal.runners.JUnit38ClassRunner.run(JUnit38ClassRunner.java:84)
at org.junit.runners.Suite.runChild(Suite.java:127)
at org.junit.runners.Suite.runChild(Suite.java:26)
at org.junit.runners.ParentRunner$3.run(ParentRunner.java:238)
at org.junit.runners.ParentRunner$1.schedule(ParentRunner.java:63)
at org.junit.runners.ParentRunner.runChildren(ParentRunner.java:236)
at org.junit.runners.ParentRunner.access$000(ParentRunner.java:53)
at org.junit.runners.ParentRunner$2.evaluate(ParentRunner.java:229)
at org.junit.runners.ParentRunner.run(ParentRunner.java:309)
at org.junit.runners.Suite.runChild(Suite.java:127)
at org.junit.runners.Suite.runChild(Suite.java:26)
at org.junit.runners.ParentRunner$3.run(ParentRunner.java:238)
at org.apache.maven.surefire.junitcore.pc.Scheduler$1.run(Scheduler.java:410)
at org.apache.maven.surefire.junitcore.pc.InvokerStrategy.schedule(InvokerStrategy.java:54)
at org.apache.maven.surefire.junitcore.pc.Scheduler.schedule(Scheduler.java:367)
at org.junit.runners.ParentRunner.runChildren(ParentRunner.java:236)
at org.junit.runners.ParentRunner.access$000(ParentRunner.java:53)
at org.junit.runners.ParentRunner$2.evaluate(ParentRunner.java:229)
at org.junit.runners.ParentRunner.run(ParentRunner.java:309)
at org.apache.maven.surefire.junitcore.pc.ParallelComputerBuilder$PC$1.run(ParallelComputerBuilder.java:593)
at org.apache.maven.surefire.junitcore.JUnitCore.run(JUnitCore.java:55)
at org.apache.maven.surefire.junitcore.JUnitCoreWrapper.createRequestAndRun(JUnitCoreWrapper.java:137)
at org.apache.maven.surefire.junitcore.JUnitCoreWrapper.executeEager(JUnitCoreWrapper.java:107)
at org.apache.maven.surefire.junitcore.JUnitCoreWrapper.execute(JUnitCoreWrapper.java:83)
at org.apache.maven.surefire.junitcore.JUnitCoreWrapper.execute(JUnitCoreWrapper.java:75)
at org.apache.maven.surefire.junitcore.JUnitCoreProvider.invoke(JUnitCoreProvider.java:159)
at org.apache.maven.surefire.booter.ForkedBooter.invokeProviderInSameClassLoader(ForkedBooter.java:373)
at org.apache.maven.surefire.booter.ForkedBooter.runSuitesInProcess(ForkedBooter.java:334)
at org.apache.maven.surefire.booter.ForkedBooter.execute(ForkedBooter.java:119)
at org.apache.maven.surefire.booter.ForkedBooter.main(ForkedBooter.java:407)
Failed: OOZIE-3371 PreCommit Build #899
Posted by Apache Jenkins Server <je...@builds.apache.org>.
Jira: https://issues.apache.org/jira/browse/OOZIE-3371
Build: https://builds.apache.org/job/PreCommit-OOZIE-Build/899/
###################################################################################
########################## LAST 100 LINES OF THE CONSOLE ###########################
[...truncated 1.88 MB...]
[DEBUG] There are no new bugs found in [sharelib/oozie].
[TRACE] New XMLLib present, calling 'xmllint --xpath' to get bug instance counts
[DEBUG] There are no new bugs found in [sharelib/hcatalog].
[TRACE] New XMLLib present, calling 'xmllint --xpath' to get bug instance counts
[DEBUG] There are no new bugs found in [sharelib/hive].
[TRACE] New XMLLib present, calling 'xmllint --xpath' to get bug instance counts
[DEBUG] There are no new bugs found in [sharelib/git].
[TRACE] New XMLLib present, calling 'xmllint --xpath' to get bug instance counts
[DEBUG] There are no new bugs found in [sharelib/hive2].
[TRACE] New XMLLib present, calling 'xmllint --xpath' to get bug instance counts
[DEBUG] There are no new bugs found in [sharelib/pig].
[TRACE] New XMLLib present, calling 'xmllint --xpath' to get bug instance counts
[DEBUG] There are no new bugs found in [sharelib/spark].
[INFO] There are no new bugs found totally].
[TRACE] FindBugs diffs checked and reports created
[TRACE] Summary file size is 2560 bytes
[TRACE] Full summary file size is 1471 bytes
[TRACE] File [/home/jenkins/jenkins-slave/workspace/PreCommit-OOZIE-Build/test-patch/tmp/FINDBUGS_DIFF/diff/findbugs-diff-0.1.0-all.jar] removed
[TRACE] File [/home/jenkins/jenkins-slave/workspace/PreCommit-OOZIE-Build/test-patch/tmp/FINDBUGS_DIFF/diff/findbugs-diff-0.1.0-all.jar.md5sum] removed
Running test-patch task BACKWARDS_COMPATIBILITY
Running test-patch task TESTS
Running test-patch task DISTRO
Testing JIRA OOZIE-3371
Cleaning local git workspace
----------------------------
+1 PATCH_APPLIES
+1 CLEAN
+1 RAW_PATCH_ANALYSIS
+1 the patch does not introduce any @author tags
+1 the patch does not introduce any tabs
+1 the patch does not introduce any trailing spaces
+1 the patch does not introduce any star imports
+1 the patch does not introduce any line longer than 132
+1 the patch adds/modifies 1 testcase(s)
+1 RAT
+1 the patch does not seem to introduce new RAT warnings
+1 JAVADOC
+1 Javadoc generation succeeded with the patch
+1 the patch does not seem to introduce new Javadoc warning(s)
WARNING: the current HEAD has 100 Javadoc warning(s)
+1 COMPILE
+1 HEAD compiles
+1 patch compiles
+1 the patch does not seem to introduce new javac warnings
+1 There are no new bugs found in total.
+1 There are no new bugs found in [server].
+1 There are no new bugs found in [client].
+1 There are no new bugs found in [core].
+1 There are no new bugs found in [fluent-job/fluent-job-api].
+1 There are no new bugs found in [docs].
+1 There are no new bugs found in [tools].
+1 There are no new bugs found in [examples].
+1 There are no new bugs found in [webapp].
+1 There are no new bugs found in [sharelib/streaming].
+1 There are no new bugs found in [sharelib/sqoop].
+1 There are no new bugs found in [sharelib/distcp].
+1 There are no new bugs found in [sharelib/oozie].
+1 There are no new bugs found in [sharelib/hcatalog].
+1 There are no new bugs found in [sharelib/hive].
+1 There are no new bugs found in [sharelib/git].
+1 There are no new bugs found in [sharelib/hive2].
+1 There are no new bugs found in [sharelib/pig].
+1 There are no new bugs found in [sharelib/spark].
+1 BACKWARDS_COMPATIBILITY
+1 the patch does not change any JPA Entity/Colum/Basic/Lob/Transient annotations
+1 the patch does not modify JPA files
+1 TESTS
Tests run: 3062
+1 DISTRO
+1 distro tarball builds with the patch
----------------------------
+1 Overall result, good!, no -1s
There is at least one warning, please check
The full output of the test-patch run is available at
https://builds.apache.org/job/PreCommit-OOZIE-Build/899/
Adding comment to JIRA
% Total % Received % Xferd Average Speed Time Time Time Current
Dload Upload Total Spent Left Speed
0 0 0 0 0 0 0 0 --:--:-- --:--:-- --:--:-- 0100 3264 0 0 100 3264 0 5598 --:--:-- --:--:-- --:--:-- 5598{"self":"https://issues.apache.org/jira/rest/api/2/issue/13192813/comment/16657032","id":"16657032","author":{"self":"https://issues.apache.org/jira/rest/api/2/user?username=hadoopqa","name":"hadoopqa","key":"hadoopqa","avatarUrls":{"48x48":"https://issues.apache.org/jira/secure/useravatar?ownerId=hadoopqa&avatarId=10393","24x24":"https://issues.apache.org/jira/secure/useravatar?size=small&ownerId=hadoopqa&avatarId=10393","16x16":"https://issues.apache.org/jira/secure/useravatar?size=xsmall&ownerId=hadoopqa&avatarId=10393","32x32":"https://issues.apache.org/jira/secure/useravatar?size=medium&ownerId=hadoopqa&avatarId=10393"},"displayName":"Hadoop QA","active":true,"timeZone":"Etc/UTC"},"body":"\nTesting JIRA OOZIE-3371\n\nCleaning local git workspace\n\n----------------------------\n\n{color:green}+1 PATCH_APPLIES{color}\n{color:green}+1 CLEAN{color}\n{color:green}+1 RAW_PATCH_ANALYSIS{color}\n. {color:green}+1{color} the patch does not introduce any @author tags\n. {color:green}+1{color} the patch does not introduce any tabs\n. {color:green}+1{color} the patch does not introduce any trailing spaces\n. {color:green}+1{color} the patch does not introduce any star imports\n. {color:green}+1{color} the patch does not introduce any line longer than 132\n. {color:green}+1{color} the patch adds/modifies 1 testcase(s)\n{color:green}+1 RAT{color}\n. {color:green}+1{color} the patch does not seem to introduce new RAT warnings\n{color:green}+1 JAVADOC{color}\n. {color:green}+1{color} Javadoc generation succeeded with the patch\n. {color:green}+1{color} the patch does not seem to introduce new Javadoc warning(s)\n. {color:orange}WARNING{color}: the current HEAD has 100 Javadoc warning(s)\n{color:green}+1 COMPILE{color}\n. {color:green}+1{color} HEAD compiles\n. {color:green}+1{color} patch compiles\n. {color:green}+1{color} the patch does not seem to introduce new javac warnings\n{color:green}+1{color} There are no new bugs found in total.\n. {color:green}+1{color} There are no new bugs found in [server].\n. {color:green}+1{color} There are no new bugs found in [client].\n. {color:green}+1{color} There are no new bugs found in [core].\n. {color:green}+1{color} There are no new bugs found in [fluent-job/fluent-job-api].\n. {color:green}+1{color} There are no new bugs found in [docs].\n. {color:green}+1{color} There are no new bugs found in [tools].\n. {color:green}+1{color} There are no new bugs found in [examples].\n. {color:green}+1{color} There are no new bugs found in [webapp].\n. {color:green}+1{color} There are no new bugs found in [sharelib/streaming].\n. {color:green}+1{color} There are no new bugs found in [sharelib/sqoop].\n. {color:green}+1{color} There are no new bugs found in [sharelib/distcp].\n. {color:green}+1{color} There are no new bugs found in [sharelib/oozie].\n. {color:green}+1{color} There are no new bugs found in [sharelib/hcatalog].\n. {color:green}+1{color} There are no new bugs found in [sharelib/hive].\n. {color:green}+1{color} There are no new bugs found in [sharelib/git].\n. {color:green}+1{color} There are no new bugs found in [sharelib/hive2].\n. {color:green}+1{color} There are no new bugs found in [sharelib/pig].\n. {color:green}+1{color} There are no new bugs found in [sharelib/spark].\n{color:green}+1 BACKWARDS_COMPATIBILITY{color}\n. {color:green}+1{color} the patch does not change any JPA Entity/Colum/Basic/Lob/Transient annotations\n. {color:green}+1{color} the patch does not modify JPA files\n{color:green}+1 TESTS{color}\n. Tests run: 3062\n{color:green}+1 DISTRO{color}\n. {color:green}+1{color} distro tarball builds with the patch \n\n----------------------------\n{color:green}*+1 Overall result, good!, no -1s*{color}\n\n{color:red}. There is at least one warning, please check{color}\n\nThe full output of the test-patch run is available at\n\n. https://builds.apache.org/job/PreCommit-OOZIE-Build/899/\n\n","updateAuthor":{"self":"https://issues.apache.org/jira/rest/api/2/user?username=hadoopqa","name":"hadoopqa","key":"hadoopqa","avatarUrls":{100 7904 0 4640 100 3264 7955 5596 --:--:-- --:--:-- --:--:-- 7945
"48x48":"https://issues.apache.org/jira/secure/useravatar?ownerId=hadoopqa&avatarId=10393","24x24":"https://issues.apache.org/jira/secure/useravatar?size=small&ownerId=hadoopqa&avatarId=10393","16x16":"https://issues.apache.org/jira/secure/useravatar?size=xsmall&ownerId=hadoopqa&avatarId=10393","32x32":"https://issues.apache.org/jira/secure/useravatar?size=medium&ownerId=hadoopqa&avatarId=10393"},"displayName":"Hadoop QA","active":true,"timeZone":"Etc/UTC"},"created":"2018-10-19T16:28:08.510+0000","updated":"2018-10-19T16:28:08.510+0000"}
test-patch exit code: 0
[description-setter] Description set: OOZIE-3371
Archiving artifacts
[Fast Archiver] Compressed 2.93 MB of artifacts by 19.2% relative to #889
Recording test results
ERROR: Step ?Publish JUnit test result report? failed: No test report files were found. Configuration error?
Email was triggered for: Failure - Any
Sending email for trigger: Failure - Any
###################################################################################
############################## FAILED TESTS (if any) ##############################
No tests ran.
Failed: OOZIE-3371 PreCommit Build #898
Posted by Apache Jenkins Server <je...@builds.apache.org>.
Jira: https://issues.apache.org/jira/browse/OOZIE-3371
Build: https://builds.apache.org/job/PreCommit-OOZIE-Build/898/
###################################################################################
########################## LAST 100 LINES OF THE CONSOLE ###########################
[...truncated 1.98 MB...]
[TRACE] FindBugs diffs checked and reports created
[TRACE] Summary file size is 2560 bytes
[TRACE] Full summary file size is 1471 bytes
[TRACE] File [/home/jenkins/jenkins-slave/workspace/PreCommit-OOZIE-Build/test-patch/tmp/FINDBUGS_DIFF/diff/findbugs-diff-0.1.0-all.jar] removed
[TRACE] File [/home/jenkins/jenkins-slave/workspace/PreCommit-OOZIE-Build/test-patch/tmp/FINDBUGS_DIFF/diff/findbugs-diff-0.1.0-all.jar.md5sum] removed
Running test-patch task BACKWARDS_COMPATIBILITY
Running test-patch task TESTS
xargs: WARNING: a NUL character occurred in the input. It cannot be passed through in the argument list. Did you mean to use the --null option?
xargs: WARNING: a NUL character occurred in the input. It cannot be passed through in the argument list. Did you mean to use the --null option?
Running test-patch task DISTRO
Testing JIRA OOZIE-3371
Cleaning local git workspace
----------------------------
+1 PATCH_APPLIES
+1 CLEAN
+1 RAW_PATCH_ANALYSIS
+1 the patch does not introduce any @author tags
+1 the patch does not introduce any tabs
+1 the patch does not introduce any trailing spaces
+1 the patch does not introduce any star imports
+1 the patch does not introduce any line longer than 132
+1 the patch adds/modifies 1 testcase(s)
+1 RAT
+1 the patch does not seem to introduce new RAT warnings
+1 JAVADOC
+1 Javadoc generation succeeded with the patch
+1 the patch does not seem to introduce new Javadoc warning(s)
WARNING: the current HEAD has 100 Javadoc warning(s)
+1 COMPILE
+1 HEAD compiles
+1 patch compiles
+1 the patch does not seem to introduce new javac warnings
+1 There are no new bugs found in total.
+1 There are no new bugs found in [docs].
+1 There are no new bugs found in [webapp].
+1 There are no new bugs found in [sharelib/distcp].
+1 There are no new bugs found in [sharelib/hive].
+1 There are no new bugs found in [sharelib/spark].
+1 There are no new bugs found in [sharelib/hive2].
+1 There are no new bugs found in [sharelib/hcatalog].
+1 There are no new bugs found in [sharelib/git].
+1 There are no new bugs found in [sharelib/streaming].
+1 There are no new bugs found in [sharelib/pig].
+1 There are no new bugs found in [sharelib/sqoop].
+1 There are no new bugs found in [sharelib/oozie].
+1 There are no new bugs found in [examples].
+1 There are no new bugs found in [client].
+1 There are no new bugs found in [core].
+1 There are no new bugs found in [tools].
+1 There are no new bugs found in [server].
+1 There are no new bugs found in [fluent-job/fluent-job-api].
+1 BACKWARDS_COMPATIBILITY
+1 the patch does not change any JPA Entity/Colum/Basic/Lob/Transient annotations
+1 the patch does not modify JPA files
-1 TESTS
Tests run : 3062
Tests failed : 0
Tests in error : 8
Tests timed out : 0
-1 [ERROR] There are [7] test errors in [tools]. Listing only the first [5] ones
testConcurrentCopyFromLocalHighThreadNr:org.apache.oozie.tools.TestConcurrentCopyFromLocal
testConcurrentCopyFromLocalSameFileNrAndThreadNr:org.apache.oozie.tools.TestConcurrentCopyFromLocal
testConcurrentCopyFromLocalMoreThreadsThanFiles:org.apache.oozie.tools.TestConcurrentCopyFromLocal
-1 [ERROR] There are [1] test errors in [zookeeper-security-tests]. Listing only the first [5] ones
testNewUsingACLs:org.apache.oozie.util.TestZKUtilsWithSecurity
Check console output for the full list of errors/failures
+1 DISTRO
+1 distro tarball builds with the patch
----------------------------
-1 Overall result, please check the reported -1(s)
There is at least one warning, please check
The full output of the test-patch run is available at
https://builds.apache.org/job/PreCommit-OOZIE-Build/898/
Adding comment to JIRA
% Total % Received % Xferd Average Speed Time Time Time Current
Dload Upload Total Spent Left Speed
0 0 0 0 0 0 0 0 --:--:-- --:--:-- --:--:-- 0 0 0 0 0 0 0 0 0 --:--:-- --:--:-- --:--:-- 0{"self":"https://issues.apache.org/jira/rest/api/2/issue/13192813/comment/16656860","id":"16656860","author":{"self":"https://issues.apache.org/jira/rest/api/2/user?username=hadoopqa","name":"hadoopqa","key":"hadoopqa","avatarUrls":{"48x48":"https://issues.apache.org/jira/secure/useravatar?ownerId=hadoopqa&avatarId=10393","24x24":"https://issues.apache.org/jira/secure/useravatar?size=small&ownerId=hadoopqa&avatarId=10393","16x16":"https://issues.apache.org/jira/secure/useravatar?size=xsmall&ownerId=hadoopqa&avatarId=10393","32x32":"https://issues.apache.org/jira/secure/useravatar?size=medium&ownerId=hadoopqa&avatarId=10393"},"displayName":"Hadoop QA","active":true,"timeZone":"Etc/UTC"},"body":"\nTesting JIRA OOZIE-3371\n\nCleaning local git workspace\n\n----------------------------\n\n{color:green}+1 PATCH_APPLIES{color}\n{color:green}+1 CLEAN{color}\n{color:green}+1 RAW_PATCH_ANALYSIS{color}\n. {color:green}+1{color} the patch does not introduce any @author tags\n. {color:green}+1{color} the patch does not introduce any tabs\n. {color:green}+1{color} the patch does not introduce any trailing spaces\n. {color:green}+1{color} the patch does not introduce any star imports\n. {color:green}+1{color} the patch does not introduce any line longer than 132\n. {color:green}+1{color} the patch adds/modifies 1 testcase(s)\n{color:green}+1 RAT{color}\n. {color:green}+1{color} the patch does not seem to introduce new RAT warnings\n{color:green}+1 JAVADOC{color}\n. {color:green}+1{color} Javadoc generation succeeded with the patch\n. {color:green}+1{color} the patch does not seem to introduce new Javadoc warning(s)\n. {color:orange}WARNING{color}: the current HEAD has 100 Javadoc warning(s)\n{color:green}+1 COMPILE{color}\n. {color:green}+1{color} HEAD compiles\n. {color:green}+1{color} patch compiles\n. {color:green}+1{color} the patch does not seem to introduce new javac warnings\n{color:green}+1{color} There are no new bugs found in total.\n. {color:green}+1{color} There are no new bugs found in [docs].\n. {color:green}+1{color} There are no new bugs found in [webapp].\n. {color:green}+1{color} There are no new bugs found in [sharelib/distcp].\n. {color:green}+1{color} There are no new bugs found in [sharelib/hive].\n. {color:green}+1{color} There are no new bugs found in [sharelib/spark].\n. {color:green}+1{color} There are no new bugs found in [sharelib/hive2].\n. {color:green}+1{color} There are no new bugs found in [sharelib/hcatalog].\n. {color:green}+1{color} There are no new bugs found in [sharelib/git].\n. {color:green}+1{color} There are no new bugs found in [sharelib/streaming].\n. {color:green}+1{color} There are no new bugs found in [sharelib/pig].\n. {color:green}+1{color} There are no new bugs found in [sharelib/sqoop].\n. {color:green}+1{color} There are no new bugs found in [sharelib/oozie].\n. {color:green}+1{color} There are no new bugs found in [examples].\n. {color:green}+1{color} There are no new bugs found in [client].\n. {color:green}+1{color} There are no new bugs found in [core].\n. {color:green}+1{color} There are no new bugs found in [tools].\n. {color:green}+1{color} There are no new bugs found in [server].\n. {color:green}+1{color} There are no new bugs found in [fluent-job/fluent-job-api].\n{color:green}+1 BACKWARDS_COMPATIBILITY{color}\n. {color:green}+1{color} the patch does not change any JPA Entity/Colum/Basic/Lob/Transient annotations\n. {color:green}+1{color} the patch does not modify JPA files\n{color:red}-1 TESTS{color}\n. Tests run : 3062\n. Tests failed : 0\n. Tests in error : 8\n. Tests timed out : 0\n\n{color:red}-1{color} [ERROR] There are [7] test errors in [tools]. Listing only the first [5] ones\ntestConcurrentCopyFromLocalHighThreadNr:org.apache.oozie.tools.TestConcurrentCopyFromLocal\ntestConcurrentCopyFromLocalSameFileNrAndThreadNr:org.apache.oozie.tools.TestConcurrentCopyFromLocal\ntestConcurrentCopyFromLocalMoreThreadsThanFiles:org.apache.oozie.tools.TestConcurrentCopyFromLocal\n{color:red}-1{color} [ERROR] Ther100 9388 0 5382 100 4006 5215 3882 0:00:01 0:00:01 --:--:-- 5220
e are [1] test errors in [zookeeper-security-tests]. Listing only the first [5] ones\ntestNewUsingACLs:org.apache.oozie.util.TestZKUtilsWithSecurity\n\nCheck console output for the full list of errors/failures\n{color:green}+1 DISTRO{color}\n. {color:green}+1{color} distro tarball builds with the patch \n\n----------------------------\n{color:red}*-1 Overall result, please check the reported -1(s)*{color}\n\n{color:red}. There is at least one warning, please check{color}\n\nThe full output of the test-patch run is available at\n\n. https://builds.apache.org/job/PreCommit-OOZIE-Build/898/\n\n","updateAuthor":{"self":"https://issues.apache.org/jira/rest/api/2/user?username=hadoopqa","name":"hadoopqa","key":"hadoopqa","avatarUrls":{"48x48":"https://issues.apache.org/jira/secure/useravatar?ownerId=hadoopqa&avatarId=10393","24x24":"https://issues.apache.org/jira/secure/useravatar?size=small&ownerId=hadoopqa&avatarId=10393","16x16":"https://issues.apache.org/jira/secure/useravatar?size=xsmall&ownerId=hadoopqa&avatarId=10393","32x32":"https://issues.apache.org/jira/secure/useravatar?size=medium&ownerId=hadoopqa&avatarId=10393"},"displayName":"Hadoop QA","active":true,"timeZone":"Etc/UTC"},"created":"2018-10-19T14:35:15.965+0000","updated":"2018-10-19T14:35:15.965+0000"}
test-patch exit code: 1
Build step 'Execute shell' marked build as failure
[description-setter] Description set: OOZIE-3371
Archiving artifacts
[Fast Archiver] Compressed 2.93 MB of artifacts by 19.2% relative to #889
Recording test results
Email was triggered for: Failure - Any
Sending email for trigger: Failure - Any
###################################################################################
############################## FAILED TESTS (if any) ##############################
8 tests failed.
FAILED: org.apache.oozie.tools.TestConcurrentCopyFromLocal.testConcurrentCopyFromLocalHighThreadNr
Error Message:
Could not install Oozie ShareLib properly.
Stack Trace:
java.io.IOException: Could not install Oozie ShareLib properly.
at org.apache.oozie.tools.OozieSharelibCLI$ConcurrentCopyFromLocal.retryFailedCopyTasks(OozieSharelibCLI.java:539)
at org.apache.oozie.tools.OozieSharelibCLI$ConcurrentCopyFromLocal.checkCopyResults(OozieSharelibCLI.java:504)
at org.apache.oozie.tools.OozieSharelibCLI$ConcurrentCopyFromLocal.concurrentCopyFromLocal(OozieSharelibCLI.java:455)
at org.apache.oozie.tools.TestConcurrentCopyFromLocal.performAndCheckConcurrentCopy(TestConcurrentCopyFromLocal.java:107)
at org.apache.oozie.tools.TestConcurrentCopyFromLocal.testConcurrentCopyFromLocalHighThreadNr(TestConcurrentCopyFromLocal.java:98)
at sun.reflect.NativeMethodAccessorImpl.invoke0(Native Method)
at sun.reflect.NativeMethodAccessorImpl.invoke(NativeMethodAccessorImpl.java:62)
at sun.reflect.DelegatingMethodAccessorImpl.invoke(DelegatingMethodAccessorImpl.java:43)
at java.lang.reflect.Method.invoke(Method.java:498)
at junit.framework.TestCase.runTest(TestCase.java:176)
at junit.framework.TestCase.runBare(TestCase.java:141)
at junit.framework.TestResult$1.protect(TestResult.java:122)
at junit.framework.TestResult.runProtected(TestResult.java:142)
at junit.framework.TestResult.run(TestResult.java:125)
at junit.framework.TestCase.run(TestCase.java:129)
at junit.framework.TestSuite.runTest(TestSuite.java:255)
at junit.framework.TestSuite.run(TestSuite.java:250)
at org.junit.internal.runners.JUnit38ClassRunner.run(JUnit38ClassRunner.java:84)
at org.junit.runners.Suite.runChild(Suite.java:127)
at org.junit.runners.Suite.runChild(Suite.java:26)
at org.junit.runners.ParentRunner$3.run(ParentRunner.java:238)
at org.junit.runners.ParentRunner$1.schedule(ParentRunner.java:63)
at org.junit.runners.ParentRunner.runChildren(ParentRunner.java:236)
at org.junit.runners.ParentRunner.access$000(ParentRunner.java:53)
at org.junit.runners.ParentRunner$2.evaluate(ParentRunner.java:229)
at org.junit.runners.ParentRunner.run(ParentRunner.java:309)
at org.junit.runners.Suite.runChild(Suite.java:127)
at org.junit.runners.Suite.runChild(Suite.java:26)
at org.junit.runners.ParentRunner$3.run(ParentRunner.java:238)
at org.apache.maven.surefire.junitcore.pc.Scheduler$1.run(Scheduler.java:410)
at org.apache.maven.surefire.junitcore.pc.InvokerStrategy.schedule(InvokerStrategy.java:54)
at org.apache.maven.surefire.junitcore.pc.Scheduler.schedule(Scheduler.java:367)
at org.junit.runners.ParentRunner.runChildren(ParentRunner.java:236)
at org.junit.runners.ParentRunner.access$000(ParentRunner.java:53)
at org.junit.runners.ParentRunner$2.evaluate(ParentRunner.java:229)
at org.junit.runners.ParentRunner.run(ParentRunner.java:309)
at org.apache.maven.surefire.junitcore.pc.ParallelComputerBuilder$PC$1.run(ParallelComputerBuilder.java:593)
at org.apache.maven.surefire.junitcore.JUnitCore.run(JUnitCore.java:55)
at org.apache.maven.surefire.junitcore.JUnitCoreWrapper.createRequestAndRun(JUnitCoreWrapper.java:137)
at org.apache.maven.surefire.junitcore.JUnitCoreWrapper.executeEager(JUnitCoreWrapper.java:107)
at org.apache.maven.surefire.junitcore.JUnitCoreWrapper.execute(JUnitCoreWrapper.java:83)
at org.apache.maven.surefire.junitcore.JUnitCoreWrapper.execute(JUnitCoreWrapper.java:75)
at org.apache.maven.surefire.junitcore.JUnitCoreProvider.invoke(JUnitCoreProvider.java:159)
at org.apache.maven.surefire.booter.ForkedBooter.invokeProviderInSameClassLoader(ForkedBooter.java:373)
at org.apache.maven.surefire.booter.ForkedBooter.runSuitesInProcess(ForkedBooter.java:334)
at org.apache.maven.surefire.booter.ForkedBooter.execute(ForkedBooter.java:119)
at org.apache.maven.surefire.booter.ForkedBooter.main(ForkedBooter.java:407)
FAILED: org.apache.oozie.tools.TestConcurrentCopyFromLocal.testConcurrentCopyFromLocalSameFileNrAndThreadNr
Error Message:
Could not install Oozie ShareLib properly.
Stack Trace:
java.io.IOException: Could not install Oozie ShareLib properly.
at org.apache.oozie.tools.OozieSharelibCLI$ConcurrentCopyFromLocal.retryFailedCopyTasks(OozieSharelibCLI.java:539)
at org.apache.oozie.tools.OozieSharelibCLI$ConcurrentCopyFromLocal.checkCopyResults(OozieSharelibCLI.java:504)
at org.apache.oozie.tools.OozieSharelibCLI$ConcurrentCopyFromLocal.concurrentCopyFromLocal(OozieSharelibCLI.java:455)
at org.apache.oozie.tools.TestConcurrentCopyFromLocal.performAndCheckConcurrentCopy(TestConcurrentCopyFromLocal.java:107)
at org.apache.oozie.tools.TestConcurrentCopyFromLocal.testConcurrentCopyFromLocalSameFileNrAndThreadNr(TestConcurrentCopyFromLocal.java:82)
at sun.reflect.NativeMethodAccessorImpl.invoke0(Native Method)
at sun.reflect.NativeMethodAccessorImpl.invoke(NativeMethodAccessorImpl.java:62)
at sun.reflect.DelegatingMethodAccessorImpl.invoke(DelegatingMethodAccessorImpl.java:43)
at java.lang.reflect.Method.invoke(Method.java:498)
at junit.framework.TestCase.runTest(TestCase.java:176)
at junit.framework.TestCase.runBare(TestCase.java:141)
at junit.framework.TestResult$1.protect(TestResult.java:122)
at junit.framework.TestResult.runProtected(TestResult.java:142)
at junit.framework.TestResult.run(TestResult.java:125)
at junit.framework.TestCase.run(TestCase.java:129)
at junit.framework.TestSuite.runTest(TestSuite.java:255)
at junit.framework.TestSuite.run(TestSuite.java:250)
at org.junit.internal.runners.JUnit38ClassRunner.run(JUnit38ClassRunner.java:84)
at org.junit.runners.Suite.runChild(Suite.java:127)
at org.junit.runners.Suite.runChild(Suite.java:26)
at org.junit.runners.ParentRunner$3.run(ParentRunner.java:238)
at org.junit.runners.ParentRunner$1.schedule(ParentRunner.java:63)
at org.junit.runners.ParentRunner.runChildren(ParentRunner.java:236)
at org.junit.runners.ParentRunner.access$000(ParentRunner.java:53)
at org.junit.runners.ParentRunner$2.evaluate(ParentRunner.java:229)
at org.junit.runners.ParentRunner.run(ParentRunner.java:309)
at org.junit.runners.Suite.runChild(Suite.java:127)
at org.junit.runners.Suite.runChild(Suite.java:26)
at org.junit.runners.ParentRunner$3.run(ParentRunner.java:238)
at org.apache.maven.surefire.junitcore.pc.Scheduler$1.run(Scheduler.java:410)
at org.apache.maven.surefire.junitcore.pc.InvokerStrategy.schedule(InvokerStrategy.java:54)
at org.apache.maven.surefire.junitcore.pc.Scheduler.schedule(Scheduler.java:367)
at org.junit.runners.ParentRunner.runChildren(ParentRunner.java:236)
at org.junit.runners.ParentRunner.access$000(ParentRunner.java:53)
at org.junit.runners.ParentRunner$2.evaluate(ParentRunner.java:229)
at org.junit.runners.ParentRunner.run(ParentRunner.java:309)
at org.apache.maven.surefire.junitcore.pc.ParallelComputerBuilder$PC$1.run(ParallelComputerBuilder.java:593)
at org.apache.maven.surefire.junitcore.JUnitCore.run(JUnitCore.java:55)
at org.apache.maven.surefire.junitcore.JUnitCoreWrapper.createRequestAndRun(JUnitCoreWrapper.java:137)
at org.apache.maven.surefire.junitcore.JUnitCoreWrapper.executeEager(JUnitCoreWrapper.java:107)
at org.apache.maven.surefire.junitcore.JUnitCoreWrapper.execute(JUnitCoreWrapper.java:83)
at org.apache.maven.surefire.junitcore.JUnitCoreWrapper.execute(JUnitCoreWrapper.java:75)
at org.apache.maven.surefire.junitcore.JUnitCoreProvider.invoke(JUnitCoreProvider.java:159)
at org.apache.maven.surefire.booter.ForkedBooter.invokeProviderInSameClassLoader(ForkedBooter.java:373)
at org.apache.maven.surefire.booter.ForkedBooter.runSuitesInProcess(ForkedBooter.java:334)
at org.apache.maven.surefire.booter.ForkedBooter.execute(ForkedBooter.java:119)
at org.apache.maven.surefire.booter.ForkedBooter.main(ForkedBooter.java:407)
FAILED: org.apache.oozie.tools.TestConcurrentCopyFromLocal.testConcurrentCopyFromLocalMoreThreadsThanFiles
Error Message:
Could not install Oozie ShareLib properly.
Stack Trace:
java.io.IOException: Could not install Oozie ShareLib properly.
at org.apache.oozie.tools.OozieSharelibCLI$ConcurrentCopyFromLocal.retryFailedCopyTasks(OozieSharelibCLI.java:539)
at org.apache.oozie.tools.OozieSharelibCLI$ConcurrentCopyFromLocal.checkCopyResults(OozieSharelibCLI.java:504)
at org.apache.oozie.tools.OozieSharelibCLI$ConcurrentCopyFromLocal.concurrentCopyFromLocal(OozieSharelibCLI.java:455)
at org.apache.oozie.tools.TestConcurrentCopyFromLocal.performAndCheckConcurrentCopy(TestConcurrentCopyFromLocal.java:107)
at org.apache.oozie.tools.TestConcurrentCopyFromLocal.testConcurrentCopyFromLocalMoreThreadsThanFiles(TestConcurrentCopyFromLocal.java:90)
at sun.reflect.NativeMethodAccessorImpl.invoke0(Native Method)
at sun.reflect.NativeMethodAccessorImpl.invoke(NativeMethodAccessorImpl.java:62)
at sun.reflect.DelegatingMethodAccessorImpl.invoke(DelegatingMethodAccessorImpl.java:43)
at java.lang.reflect.Method.invoke(Method.java:498)
at junit.framework.TestCase.runTest(TestCase.java:176)
at junit.framework.TestCase.runBare(TestCase.java:141)
at junit.framework.TestResult$1.protect(TestResult.java:122)
at junit.framework.TestResult.runProtected(TestResult.java:142)
at junit.framework.TestResult.run(TestResult.java:125)
at junit.framework.TestCase.run(TestCase.java:129)
at junit.framework.TestSuite.runTest(TestSuite.java:255)
at junit.framework.TestSuite.run(TestSuite.java:250)
at org.junit.internal.runners.JUnit38ClassRunner.run(JUnit38ClassRunner.java:84)
at org.junit.runners.Suite.runChild(Suite.java:127)
at org.junit.runners.Suite.runChild(Suite.java:26)
at org.junit.runners.ParentRunner$3.run(ParentRunner.java:238)
at org.junit.runners.ParentRunner$1.schedule(ParentRunner.java:63)
at org.junit.runners.ParentRunner.runChildren(ParentRunner.java:236)
at org.junit.runners.ParentRunner.access$000(ParentRunner.java:53)
at org.junit.runners.ParentRunner$2.evaluate(ParentRunner.java:229)
at org.junit.runners.ParentRunner.run(ParentRunner.java:309)
at org.junit.runners.Suite.runChild(Suite.java:127)
at org.junit.runners.Suite.runChild(Suite.java:26)
at org.junit.runners.ParentRunner$3.run(ParentRunner.java:238)
at org.apache.maven.surefire.junitcore.pc.Scheduler$1.run(Scheduler.java:410)
at org.apache.maven.surefire.junitcore.pc.InvokerStrategy.schedule(InvokerStrategy.java:54)
at org.apache.maven.surefire.junitcore.pc.Scheduler.schedule(Scheduler.java:367)
at org.junit.runners.ParentRunner.runChildren(ParentRunner.java:236)
at org.junit.runners.ParentRunner.access$000(ParentRunner.java:53)
at org.junit.runners.ParentRunner$2.evaluate(ParentRunner.java:229)
at org.junit.runners.ParentRunner.run(ParentRunner.java:309)
at org.apache.maven.surefire.junitcore.pc.ParallelComputerBuilder$PC$1.run(ParallelComputerBuilder.java:593)
at org.apache.maven.surefire.junitcore.JUnitCore.run(JUnitCore.java:55)
at org.apache.maven.surefire.junitcore.JUnitCoreWrapper.createRequestAndRun(JUnitCoreWrapper.java:137)
at org.apache.maven.surefire.junitcore.JUnitCoreWrapper.executeEager(JUnitCoreWrapper.java:107)
at org.apache.maven.surefire.junitcore.JUnitCoreWrapper.execute(JUnitCoreWrapper.java:83)
at org.apache.maven.surefire.junitcore.JUnitCoreWrapper.execute(JUnitCoreWrapper.java:75)
at org.apache.maven.surefire.junitcore.JUnitCoreProvider.invoke(JUnitCoreProvider.java:159)
at org.apache.maven.surefire.booter.ForkedBooter.invokeProviderInSameClassLoader(ForkedBooter.java:373)
at org.apache.maven.surefire.booter.ForkedBooter.runSuitesInProcess(ForkedBooter.java:334)
at org.apache.maven.surefire.booter.ForkedBooter.execute(ForkedBooter.java:119)
at org.apache.maven.surefire.booter.ForkedBooter.main(ForkedBooter.java:407)
FAILED: org.apache.oozie.tools.TestCopyTaskCallable.testCallCopyTaskMoreThreadsThanFiles
Error Message:
java.net.ConnectException: Call From asf917.gq1.ygridcore.net/67.195.81.137 to localhost:36340 failed on connection exception: java.net.ConnectException: Connection refused; For more details see: http://wiki.apache.org/hadoop/ConnectionRefused
Stack Trace:
java.util.concurrent.ExecutionException: java.net.ConnectException: Call From asf917.gq1.ygridcore.net/67.195.81.137 to localhost:36340 failed on connection exception: java.net.ConnectException: Connection refused; For more details see: http://wiki.apache.org/hadoop/ConnectionRefused
at java.util.concurrent.FutureTask.report(FutureTask.java:122)
at java.util.concurrent.FutureTask.get(FutureTask.java:192)
at org.apache.oozie.tools.TestCopyTaskCallable.performAndCheckCallCopyTask(TestCopyTaskCallable.java:129)
at org.apache.oozie.tools.TestCopyTaskCallable.testCallCopyTaskMoreThreadsThanFiles(TestCopyTaskCallable.java:107)
at sun.reflect.NativeMethodAccessorImpl.invoke0(Native Method)
at sun.reflect.NativeMethodAccessorImpl.invoke(NativeMethodAccessorImpl.java:62)
at sun.reflect.DelegatingMethodAccessorImpl.invoke(DelegatingMethodAccessorImpl.java:43)
at java.lang.reflect.Method.invoke(Method.java:498)
at junit.framework.TestCase.runTest(TestCase.java:176)
at junit.framework.TestCase.runBare(TestCase.java:141)
at junit.framework.TestResult$1.protect(TestResult.java:122)
at junit.framework.TestResult.runProtected(TestResult.java:142)
at junit.framework.TestResult.run(TestResult.java:125)
at junit.framework.TestCase.run(TestCase.java:129)
at junit.framework.TestSuite.runTest(TestSuite.java:255)
at junit.framework.TestSuite.run(TestSuite.java:250)
at org.junit.internal.runners.JUnit38ClassRunner.run(JUnit38ClassRunner.java:84)
at org.junit.runners.Suite.runChild(Suite.java:127)
at org.junit.runners.Suite.runChild(Suite.java:26)
at org.junit.runners.ParentRunner$3.run(ParentRunner.java:238)
at org.junit.runners.ParentRunner$1.schedule(ParentRunner.java:63)
at org.junit.runners.ParentRunner.runChildren(ParentRunner.java:236)
at org.junit.runners.ParentRunner.access$000(ParentRunner.java:53)
at org.junit.runners.ParentRunner$2.evaluate(ParentRunner.java:229)
at org.junit.runners.ParentRunner.run(ParentRunner.java:309)
at org.junit.runners.Suite.runChild(Suite.java:127)
at org.junit.runners.Suite.runChild(Suite.java:26)
at org.junit.runners.ParentRunner$3.run(ParentRunner.java:238)
at org.apache.maven.surefire.junitcore.pc.Scheduler$1.run(Scheduler.java:410)
at org.apache.maven.surefire.junitcore.pc.InvokerStrategy.schedule(InvokerStrategy.java:54)
at org.apache.maven.surefire.junitcore.pc.Scheduler.schedule(Scheduler.java:367)
at org.junit.runners.ParentRunner.runChildren(ParentRunner.java:236)
at org.junit.runners.ParentRunner.access$000(ParentRunner.java:53)
at org.junit.runners.ParentRunner$2.evaluate(ParentRunner.java:229)
at org.junit.runners.ParentRunner.run(ParentRunner.java:309)
at org.apache.maven.surefire.junitcore.pc.ParallelComputerBuilder$PC$1.run(ParallelComputerBuilder.java:593)
at org.apache.maven.surefire.junitcore.JUnitCore.run(JUnitCore.java:55)
at org.apache.maven.surefire.junitcore.JUnitCoreWrapper.createRequestAndRun(JUnitCoreWrapper.java:137)
at org.apache.maven.surefire.junitcore.JUnitCoreWrapper.executeEager(JUnitCoreWrapper.java:107)
at org.apache.maven.surefire.junitcore.JUnitCoreWrapper.execute(JUnitCoreWrapper.java:83)
at org.apache.maven.surefire.junitcore.JUnitCoreWrapper.execute(JUnitCoreWrapper.java:75)
at org.apache.maven.surefire.junitcore.JUnitCoreProvider.invoke(JUnitCoreProvider.java:159)
at org.apache.maven.surefire.booter.ForkedBooter.invokeProviderInSameClassLoader(ForkedBooter.java:373)
at org.apache.maven.surefire.booter.ForkedBooter.runSuitesInProcess(ForkedBooter.java:334)
at org.apache.maven.surefire.booter.ForkedBooter.execute(ForkedBooter.java:119)
at org.apache.maven.surefire.booter.ForkedBooter.main(ForkedBooter.java:407)
Caused by: java.net.ConnectException: Call From asf917.gq1.ygridcore.net/67.195.81.137 to localhost:36340 failed on connection exception: java.net.ConnectException: Connection refused; For more details see: http://wiki.apache.org/hadoop/ConnectionRefused
at sun.reflect.NativeConstructorAccessorImpl.newInstance0(Native Method)
at sun.reflect.NativeConstructorAccessorImpl.newInstance(NativeConstructorAccessorImpl.java:62)
at sun.reflect.DelegatingConstructorAccessorImpl.newInstance(DelegatingConstructorAccessorImpl.java:45)
at java.lang.reflect.Constructor.newInstance(Constructor.java:423)
at org.apache.hadoop.net.NetUtils.wrapWithMessage(NetUtils.java:791)
at org.apache.hadoop.net.NetUtils.wrapException(NetUtils.java:731)
at org.apache.hadoop.ipc.Client.call(Client.java:1472)
at org.apache.hadoop.ipc.Client.call(Client.java:1399)
at org.apache.hadoop.ipc.ProtobufRpcEngine$Invoker.invoke(ProtobufRpcEngine.java:232)
at com.sun.proxy.$Proxy25.create(Unknown Source)
at org.apache.hadoop.hdfs.protocolPB.ClientNamenodeProtocolTranslatorPB.create(ClientNamenodeProtocolTranslatorPB.java:295)
at sun.reflect.NativeMethodAccessorImpl.invoke0(Native Method)
at sun.reflect.NativeMethodAccessorImpl.invoke(NativeMethodAccessorImpl.java:62)
at sun.reflect.DelegatingMethodAccessorImpl.invoke(DelegatingMethodAccessorImpl.java:43)
at java.lang.reflect.Method.invoke(Method.java:498)
at org.apache.hadoop.io.retry.RetryInvocationHandler.invokeMethod(RetryInvocationHandler.java:187)
at org.apache.hadoop.io.retry.RetryInvocationHandler.invoke(RetryInvocationHandler.java:102)
at com.sun.proxy.$Proxy26.create(Unknown Source)
at org.apache.hadoop.hdfs.DFSOutputStream.newStreamForCreate(DFSOutputStream.java:1725)
at org.apache.hadoop.hdfs.DFSClient.create(DFSClient.java:1668)
at org.apache.hadoop.hdfs.DFSClient.create(DFSClient.java:1593)
at org.apache.hadoop.hdfs.DistributedFileSystem$6.doCall(DistributedFileSystem.java:397)
at org.apache.hadoop.hdfs.DistributedFileSystem$6.doCall(DistributedFileSystem.java:393)
at org.apache.hadoop.fs.FileSystemLinkResolver.resolve(FileSystemLinkResolver.java:81)
at org.apache.hadoop.hdfs.DistributedFileSystem.create(DistributedFileSystem.java:393)
at org.apache.hadoop.hdfs.DistributedFileSystem.create(DistributedFileSystem.java:337)
at org.apache.hadoop.fs.FileSystem.create(FileSystem.java:908)
at org.apache.hadoop.fs.FileSystem.create(FileSystem.java:889)
at org.apache.oozie.tools.OozieSharelibCLI$CopyTaskCallable.call(OozieSharelibCLI.java:414)
at org.apache.oozie.tools.OozieSharelibCLI$CopyTaskCallable.call(OozieSharelibCLI.java:378)
at java.util.concurrent.FutureTask.run(FutureTask.java:266)
at java.util.concurrent.ThreadPoolExecutor.runWorker(ThreadPoolExecutor.java:1149)
at java.util.concurrent.ThreadPoolExecutor$Worker.run(ThreadPoolExecutor.java:624)
at java.lang.Thread.run(Thread.java:748)
Caused by: java.net.ConnectException: Connection refused
at sun.nio.ch.SocketChannelImpl.checkConnect(Native Method)
at sun.nio.ch.SocketChannelImpl.finishConnect(SocketChannelImpl.java:717)
at org.apache.hadoop.net.SocketIOWithTimeout.connect(SocketIOWithTimeout.java:206)
at org.apache.hadoop.net.NetUtils.connect(NetUtils.java:530)
at org.apache.hadoop.net.NetUtils.connect(NetUtils.java:494)
at org.apache.hadoop.ipc.Client$Connection.setupConnection(Client.java:607)
at org.apache.hadoop.ipc.Client$Connection.setupIOstreams(Client.java:705)
at org.apache.hadoop.ipc.Client$Connection.access$2800(Client.java:368)
at org.apache.hadoop.ipc.Client.getConnection(Client.java:1521)
at org.apache.hadoop.ipc.Client.call(Client.java:1438)
... 27 more
FAILED: org.apache.oozie.tools.TestCopyTaskCallable.testCallCopyTaskSameFileNrAndThreadNr
Error Message:
java.net.ConnectException: Call From asf917.gq1.ygridcore.net/67.195.81.137 to localhost:36340 failed on connection exception: java.net.ConnectException: Connection refused; For more details see: http://wiki.apache.org/hadoop/ConnectionRefused
Stack Trace:
java.util.concurrent.ExecutionException: java.net.ConnectException: Call From asf917.gq1.ygridcore.net/67.195.81.137 to localhost:36340 failed on connection exception: java.net.ConnectException: Connection refused; For more details see: http://wiki.apache.org/hadoop/ConnectionRefused
at java.util.concurrent.FutureTask.report(FutureTask.java:122)
at java.util.concurrent.FutureTask.get(FutureTask.java:192)
at org.apache.oozie.tools.TestCopyTaskCallable.performAndCheckCallCopyTask(TestCopyTaskCallable.java:129)
at org.apache.oozie.tools.TestCopyTaskCallable.testCallCopyTaskSameFileNrAndThreadNr(TestCopyTaskCallable.java:86)
at sun.reflect.NativeMethodAccessorImpl.invoke0(Native Method)
at sun.reflect.NativeMethodAccessorImpl.invoke(NativeMethodAccessorImpl.java:62)
at sun.reflect.DelegatingMethodAccessorImpl.invoke(DelegatingMethodAccessorImpl.java:43)
at java.lang.reflect.Method.invoke(Method.java:498)
at junit.framework.TestCase.runTest(TestCase.java:176)
at junit.framework.TestCase.runBare(TestCase.java:141)
at junit.framework.TestResult$1.protect(TestResult.java:122)
at junit.framework.TestResult.runProtected(TestResult.java:142)
at junit.framework.TestResult.run(TestResult.java:125)
at junit.framework.TestCase.run(TestCase.java:129)
at junit.framework.TestSuite.runTest(TestSuite.java:255)
at junit.framework.TestSuite.run(TestSuite.java:250)
at org.junit.internal.runners.JUnit38ClassRunner.run(JUnit38ClassRunner.java:84)
at org.junit.runners.Suite.runChild(Suite.java:127)
at org.junit.runners.Suite.runChild(Suite.java:26)
at org.junit.runners.ParentRunner$3.run(ParentRunner.java:238)
at org.junit.runners.ParentRunner$1.schedule(ParentRunner.java:63)
at org.junit.runners.ParentRunner.runChildren(ParentRunner.java:236)
at org.junit.runners.ParentRunner.access$000(ParentRunner.java:53)
at org.junit.runners.ParentRunner$2.evaluate(ParentRunner.java:229)
at org.junit.runners.ParentRunner.run(ParentRunner.java:309)
at org.junit.runners.Suite.runChild(Suite.java:127)
at org.junit.runners.Suite.runChild(Suite.java:26)
at org.junit.runners.ParentRunner$3.run(ParentRunner.java:238)
at org.apache.maven.surefire.junitcore.pc.Scheduler$1.run(Scheduler.java:410)
at org.apache.maven.surefire.junitcore.pc.InvokerStrategy.schedule(InvokerStrategy.java:54)
at org.apache.maven.surefire.junitcore.pc.Scheduler.schedule(Scheduler.java:367)
at org.junit.runners.ParentRunner.runChildren(ParentRunner.java:236)
at org.junit.runners.ParentRunner.access$000(ParentRunner.java:53)
at org.junit.runners.ParentRunner$2.evaluate(ParentRunner.java:229)
at org.junit.runners.ParentRunner.run(ParentRunner.java:309)
at org.apache.maven.surefire.junitcore.pc.ParallelComputerBuilder$PC$1.run(ParallelComputerBuilder.java:593)
at org.apache.maven.surefire.junitcore.JUnitCore.run(JUnitCore.java:55)
at org.apache.maven.surefire.junitcore.JUnitCoreWrapper.createRequestAndRun(JUnitCoreWrapper.java:137)
at org.apache.maven.surefire.junitcore.JUnitCoreWrapper.executeEager(JUnitCoreWrapper.java:107)
at org.apache.maven.surefire.junitcore.JUnitCoreWrapper.execute(JUnitCoreWrapper.java:83)
at org.apache.maven.surefire.junitcore.JUnitCoreWrapper.execute(JUnitCoreWrapper.java:75)
at org.apache.maven.surefire.junitcore.JUnitCoreProvider.invoke(JUnitCoreProvider.java:159)
at org.apache.maven.surefire.booter.ForkedBooter.invokeProviderInSameClassLoader(ForkedBooter.java:373)
at org.apache.maven.surefire.booter.ForkedBooter.runSuitesInProcess(ForkedBooter.java:334)
at org.apache.maven.surefire.booter.ForkedBooter.execute(ForkedBooter.java:119)
at org.apache.maven.surefire.booter.ForkedBooter.main(ForkedBooter.java:407)
Caused by: java.net.ConnectException: Call From asf917.gq1.ygridcore.net/67.195.81.137 to localhost:36340 failed on connection exception: java.net.ConnectException: Connection refused; For more details see: http://wiki.apache.org/hadoop/ConnectionRefused
at sun.reflect.NativeConstructorAccessorImpl.newInstance0(Native Method)
at sun.reflect.NativeConstructorAccessorImpl.newInstance(NativeConstructorAccessorImpl.java:62)
at sun.reflect.DelegatingConstructorAccessorImpl.newInstance(DelegatingConstructorAccessorImpl.java:45)
at java.lang.reflect.Constructor.newInstance(Constructor.java:423)
at org.apache.hadoop.net.NetUtils.wrapWithMessage(NetUtils.java:791)
at org.apache.hadoop.net.NetUtils.wrapException(NetUtils.java:731)
at org.apache.hadoop.ipc.Client.call(Client.java:1472)
at org.apache.hadoop.ipc.Client.call(Client.java:1399)
at org.apache.hadoop.ipc.ProtobufRpcEngine$Invoker.invoke(ProtobufRpcEngine.java:232)
at com.sun.proxy.$Proxy25.create(Unknown Source)
at org.apache.hadoop.hdfs.protocolPB.ClientNamenodeProtocolTranslatorPB.create(ClientNamenodeProtocolTranslatorPB.java:295)
at sun.reflect.GeneratedMethodAccessor109.invoke(Unknown Source)
at sun.reflect.DelegatingMethodAccessorImpl.invoke(DelegatingMethodAccessorImpl.java:43)
at java.lang.reflect.Method.invoke(Method.java:498)
at org.apache.hadoop.io.retry.RetryInvocationHandler.invokeMethod(RetryInvocationHandler.java:187)
at org.apache.hadoop.io.retry.RetryInvocationHandler.invoke(RetryInvocationHandler.java:102)
at com.sun.proxy.$Proxy26.create(Unknown Source)
at org.apache.hadoop.hdfs.DFSOutputStream.newStreamForCreate(DFSOutputStream.java:1725)
at org.apache.hadoop.hdfs.DFSClient.create(DFSClient.java:1668)
at org.apache.hadoop.hdfs.DFSClient.create(DFSClient.java:1593)
at org.apache.hadoop.hdfs.DistributedFileSystem$6.doCall(DistributedFileSystem.java:397)
at org.apache.hadoop.hdfs.DistributedFileSystem$6.doCall(DistributedFileSystem.java:393)
at org.apache.hadoop.fs.FileSystemLinkResolver.resolve(FileSystemLinkResolver.java:81)
at org.apache.hadoop.hdfs.DistributedFileSystem.create(DistributedFileSystem.java:393)
at org.apache.hadoop.hdfs.DistributedFileSystem.create(DistributedFileSystem.java:337)
at org.apache.hadoop.fs.FileSystem.create(FileSystem.java:908)
at org.apache.hadoop.fs.FileSystem.create(FileSystem.java:889)
at org.apache.oozie.tools.OozieSharelibCLI$CopyTaskCallable.call(OozieSharelibCLI.java:414)
at org.apache.oozie.tools.OozieSharelibCLI$CopyTaskCallable.call(OozieSharelibCLI.java:378)
at java.util.concurrent.FutureTask.run(FutureTask.java:266)
at java.util.concurrent.ThreadPoolExecutor.runWorker(ThreadPoolExecutor.java:1149)
at java.util.concurrent.ThreadPoolExecutor$Worker.run(ThreadPoolExecutor.java:624)
at java.lang.Thread.run(Thread.java:748)
Caused by: java.net.ConnectException: Connection refused
at sun.nio.ch.SocketChannelImpl.checkConnect(Native Method)
at sun.nio.ch.SocketChannelImpl.finishConnect(SocketChannelImpl.java:717)
at org.apache.hadoop.net.SocketIOWithTimeout.connect(SocketIOWithTimeout.java:206)
at org.apache.hadoop.net.NetUtils.connect(NetUtils.java:530)
at org.apache.hadoop.net.NetUtils.connect(NetUtils.java:494)
at org.apache.hadoop.ipc.Client$Connection.setupConnection(Client.java:607)
at org.apache.hadoop.ipc.Client$Connection.setupIOstreams(Client.java:705)
at org.apache.hadoop.ipc.Client$Connection.access$2800(Client.java:368)
at org.apache.hadoop.ipc.Client.getConnection(Client.java:1521)
at org.apache.hadoop.ipc.Client.call(Client.java:1438)
... 26 more
FAILED: org.apache.oozie.tools.TestCopyTaskCallable.testCallCopyTaskMoreFilesThanThreads
Error Message:
java.net.ConnectException: Call From asf917.gq1.ygridcore.net/67.195.81.137 to localhost:36340 failed on connection exception: java.net.ConnectException: Connection refused; For more details see: http://wiki.apache.org/hadoop/ConnectionRefused
Stack Trace:
java.util.concurrent.ExecutionException: java.net.ConnectException: Call From asf917.gq1.ygridcore.net/67.195.81.137 to localhost:36340 failed on connection exception: java.net.ConnectException: Connection refused; For more details see: http://wiki.apache.org/hadoop/ConnectionRefused
at java.util.concurrent.FutureTask.report(FutureTask.java:122)
at java.util.concurrent.FutureTask.get(FutureTask.java:192)
at org.apache.oozie.tools.TestCopyTaskCallable.performAndCheckCallCopyTask(TestCopyTaskCallable.java:129)
at org.apache.oozie.tools.TestCopyTaskCallable.testCallCopyTaskMoreFilesThanThreads(TestCopyTaskCallable.java:100)
at sun.reflect.NativeMethodAccessorImpl.invoke0(Native Method)
at sun.reflect.NativeMethodAccessorImpl.invoke(NativeMethodAccessorImpl.java:62)
at sun.reflect.DelegatingMethodAccessorImpl.invoke(DelegatingMethodAccessorImpl.java:43)
at java.lang.reflect.Method.invoke(Method.java:498)
at junit.framework.TestCase.runTest(TestCase.java:176)
at junit.framework.TestCase.runBare(TestCase.java:141)
at junit.framework.TestResult$1.protect(TestResult.java:122)
at junit.framework.TestResult.runProtected(TestResult.java:142)
at junit.framework.TestResult.run(TestResult.java:125)
at junit.framework.TestCase.run(TestCase.java:129)
at junit.framework.TestSuite.runTest(TestSuite.java:255)
at junit.framework.TestSuite.run(TestSuite.java:250)
at org.junit.internal.runners.JUnit38ClassRunner.run(JUnit38ClassRunner.java:84)
at org.junit.runners.Suite.runChild(Suite.java:127)
at org.junit.runners.Suite.runChild(Suite.java:26)
at org.junit.runners.ParentRunner$3.run(ParentRunner.java:238)
at org.junit.runners.ParentRunner$1.schedule(ParentRunner.java:63)
at org.junit.runners.ParentRunner.runChildren(ParentRunner.java:236)
at org.junit.runners.ParentRunner.access$000(ParentRunner.java:53)
at org.junit.runners.ParentRunner$2.evaluate(ParentRunner.java:229)
at org.junit.runners.ParentRunner.run(ParentRunner.java:309)
at org.junit.runners.Suite.runChild(Suite.java:127)
at org.junit.runners.Suite.runChild(Suite.java:26)
at org.junit.runners.ParentRunner$3.run(ParentRunner.java:238)
at org.apache.maven.surefire.junitcore.pc.Scheduler$1.run(Scheduler.java:410)
at org.apache.maven.surefire.junitcore.pc.InvokerStrategy.schedule(InvokerStrategy.java:54)
at org.apache.maven.surefire.junitcore.pc.Scheduler.schedule(Scheduler.java:367)
at org.junit.runners.ParentRunner.runChildren(ParentRunner.java:236)
at org.junit.runners.ParentRunner.access$000(ParentRunner.java:53)
at org.junit.runners.ParentRunner$2.evaluate(ParentRunner.java:229)
at org.junit.runners.ParentRunner.run(ParentRunner.java:309)
at org.apache.maven.surefire.junitcore.pc.ParallelComputerBuilder$PC$1.run(ParallelComputerBuilder.java:593)
at org.apache.maven.surefire.junitcore.JUnitCore.run(JUnitCore.java:55)
at org.apache.maven.surefire.junitcore.JUnitCoreWrapper.createRequestAndRun(JUnitCoreWrapper.java:137)
at org.apache.maven.surefire.junitcore.JUnitCoreWrapper.executeEager(JUnitCoreWrapper.java:107)
at org.apache.maven.surefire.junitcore.JUnitCoreWrapper.execute(JUnitCoreWrapper.java:83)
at org.apache.maven.surefire.junitcore.JUnitCoreWrapper.execute(JUnitCoreWrapper.java:75)
at org.apache.maven.surefire.junitcore.JUnitCoreProvider.invoke(JUnitCoreProvider.java:159)
at org.apache.maven.surefire.booter.ForkedBooter.invokeProviderInSameClassLoader(ForkedBooter.java:373)
at org.apache.maven.surefire.booter.ForkedBooter.runSuitesInProcess(ForkedBooter.java:334)
at org.apache.maven.surefire.booter.ForkedBooter.execute(ForkedBooter.java:119)
at org.apache.maven.surefire.booter.ForkedBooter.main(ForkedBooter.java:407)
Caused by: java.net.ConnectException: Call From asf917.gq1.ygridcore.net/67.195.81.137 to localhost:36340 failed on connection exception: java.net.ConnectException: Connection refused; For more details see: http://wiki.apache.org/hadoop/ConnectionRefused
at sun.reflect.GeneratedConstructorAccessor192.newInstance(Unknown Source)
at sun.reflect.DelegatingConstructorAccessorImpl.newInstance(DelegatingConstructorAccessorImpl.java:45)
at java.lang.reflect.Constructor.newInstance(Constructor.java:423)
at org.apache.hadoop.net.NetUtils.wrapWithMessage(NetUtils.java:791)
at org.apache.hadoop.net.NetUtils.wrapException(NetUtils.java:731)
at org.apache.hadoop.ipc.Client.call(Client.java:1472)
at org.apache.hadoop.ipc.Client.call(Client.java:1399)
at org.apache.hadoop.ipc.ProtobufRpcEngine$Invoker.invoke(ProtobufRpcEngine.java:232)
at com.sun.proxy.$Proxy25.create(Unknown Source)
at org.apache.hadoop.hdfs.protocolPB.ClientNamenodeProtocolTranslatorPB.create(ClientNamenodeProtocolTranslatorPB.java:295)
at sun.reflect.GeneratedMethodAccessor109.invoke(Unknown Source)
at sun.reflect.DelegatingMethodAccessorImpl.invoke(DelegatingMethodAccessorImpl.java:43)
at java.lang.reflect.Method.invoke(Method.java:498)
at org.apache.hadoop.io.retry.RetryInvocationHandler.invokeMethod(RetryInvocationHandler.java:187)
at org.apache.hadoop.io.retry.RetryInvocationHandler.invoke(RetryInvocationHandler.java:102)
at com.sun.proxy.$Proxy26.create(Unknown Source)
at org.apache.hadoop.hdfs.DFSOutputStream.newStreamForCreate(DFSOutputStream.java:1725)
at org.apache.hadoop.hdfs.DFSClient.create(DFSClient.java:1668)
at org.apache.hadoop.hdfs.DFSClient.create(DFSClient.java:1593)
at org.apache.hadoop.hdfs.DistributedFileSystem$6.doCall(DistributedFileSystem.java:397)
at org.apache.hadoop.hdfs.DistributedFileSystem$6.doCall(DistributedFileSystem.java:393)
at org.apache.hadoop.fs.FileSystemLinkResolver.resolve(FileSystemLinkResolver.java:81)
at org.apache.hadoop.hdfs.DistributedFileSystem.create(DistributedFileSystem.java:393)
at org.apache.hadoop.hdfs.DistributedFileSystem.create(DistributedFileSystem.java:337)
at org.apache.hadoop.fs.FileSystem.create(FileSystem.java:908)
at org.apache.hadoop.fs.FileSystem.create(FileSystem.java:889)
at org.apache.oozie.tools.OozieSharelibCLI$CopyTaskCallable.call(OozieSharelibCLI.java:414)
at org.apache.oozie.tools.OozieSharelibCLI$CopyTaskCallable.call(OozieSharelibCLI.java:378)
at java.util.concurrent.FutureTask.run(FutureTask.java:266)
at java.util.concurrent.ThreadPoolExecutor.runWorker(ThreadPoolExecutor.java:1149)
at java.util.concurrent.ThreadPoolExecutor$Worker.run(ThreadPoolExecutor.java:624)
at java.lang.Thread.run(Thread.java:748)
Caused by: java.net.ConnectException: Connection refused
at sun.nio.ch.SocketChannelImpl.checkConnect(Native Method)
at sun.nio.ch.SocketChannelImpl.finishConnect(SocketChannelImpl.java:717)
at org.apache.hadoop.net.SocketIOWithTimeout.connect(SocketIOWithTimeout.java:206)
at org.apache.hadoop.net.NetUtils.connect(NetUtils.java:530)
at org.apache.hadoop.net.NetUtils.connect(NetUtils.java:494)
at org.apache.hadoop.ipc.Client$Connection.setupConnection(Client.java:607)
at org.apache.hadoop.ipc.Client$Connection.setupIOstreams(Client.java:705)
at org.apache.hadoop.ipc.Client$Connection.access$2800(Client.java:368)
at org.apache.hadoop.ipc.Client.getConnection(Client.java:1521)
at org.apache.hadoop.ipc.Client.call(Client.java:1438)
... 26 more
FAILED: org.apache.oozie.tools.TestCopyTaskCallable.testCallCopyTaskOneThread
Error Message:
java.net.ConnectException: Call From asf917.gq1.ygridcore.net/67.195.81.137 to localhost:36340 failed on connection exception: java.net.ConnectException: Connection refused; For more details see: http://wiki.apache.org/hadoop/ConnectionRefused
Stack Trace:
java.util.concurrent.ExecutionException: java.net.ConnectException: Call From asf917.gq1.ygridcore.net/67.195.81.137 to localhost:36340 failed on connection exception: java.net.ConnectException: Connection refused; For more details see: http://wiki.apache.org/hadoop/ConnectionRefused
at java.util.concurrent.FutureTask.report(FutureTask.java:122)
at java.util.concurrent.FutureTask.get(FutureTask.java:192)
at org.apache.oozie.tools.TestCopyTaskCallable.performAndCheckCallCopyTask(TestCopyTaskCallable.java:129)
at org.apache.oozie.tools.TestCopyTaskCallable.testCallCopyTaskOneThread(TestCopyTaskCallable.java:93)
at sun.reflect.NativeMethodAccessorImpl.invoke0(Native Method)
at sun.reflect.NativeMethodAccessorImpl.invoke(NativeMethodAccessorImpl.java:62)
at sun.reflect.DelegatingMethodAccessorImpl.invoke(DelegatingMethodAccessorImpl.java:43)
at java.lang.reflect.Method.invoke(Method.java:498)
at junit.framework.TestCase.runTest(TestCase.java:176)
at junit.framework.TestCase.runBare(TestCase.java:141)
at junit.framework.TestResult$1.protect(TestResult.java:122)
at junit.framework.TestResult.runProtected(TestResult.java:142)
at junit.framework.TestResult.run(TestResult.java:125)
at junit.framework.TestCase.run(TestCase.java:129)
at junit.framework.TestSuite.runTest(TestSuite.java:255)
at junit.framework.TestSuite.run(TestSuite.java:250)
at org.junit.internal.runners.JUnit38ClassRunner.run(JUnit38ClassRunner.java:84)
at org.junit.runners.Suite.runChild(Suite.java:127)
at org.junit.runners.Suite.runChild(Suite.java:26)
at org.junit.runners.ParentRunner$3.run(ParentRunner.java:238)
at org.junit.runners.ParentRunner$1.schedule(ParentRunner.java:63)
at org.junit.runners.ParentRunner.runChildren(ParentRunner.java:236)
at org.junit.runners.ParentRunner.access$000(ParentRunner.java:53)
at org.junit.runners.ParentRunner$2.evaluate(ParentRunner.java:229)
at org.junit.runners.ParentRunner.run(ParentRunner.java:309)
at org.junit.runners.Suite.runChild(Suite.java:127)
at org.junit.runners.Suite.runChild(Suite.java:26)
at org.junit.runners.ParentRunner$3.run(ParentRunner.java:238)
at org.apache.maven.surefire.junitcore.pc.Scheduler$1.run(Scheduler.java:410)
at org.apache.maven.surefire.junitcore.pc.InvokerStrategy.schedule(InvokerStrategy.java:54)
at org.apache.maven.surefire.junitcore.pc.Scheduler.schedule(Scheduler.java:367)
at org.junit.runners.ParentRunner.runChildren(ParentRunner.java:236)
at org.junit.runners.ParentRunner.access$000(ParentRunner.java:53)
at org.junit.runners.ParentRunner$2.evaluate(ParentRunner.java:229)
at org.junit.runners.ParentRunner.run(ParentRunner.java:309)
at org.apache.maven.surefire.junitcore.pc.ParallelComputerBuilder$PC$1.run(ParallelComputerBuilder.java:593)
at org.apache.maven.surefire.junitcore.JUnitCore.run(JUnitCore.java:55)
at org.apache.maven.surefire.junitcore.JUnitCoreWrapper.createRequestAndRun(JUnitCoreWrapper.java:137)
at org.apache.maven.surefire.junitcore.JUnitCoreWrapper.executeEager(JUnitCoreWrapper.java:107)
at org.apache.maven.surefire.junitcore.JUnitCoreWrapper.execute(JUnitCoreWrapper.java:83)
at org.apache.maven.surefire.junitcore.JUnitCoreWrapper.execute(JUnitCoreWrapper.java:75)
at org.apache.maven.surefire.junitcore.JUnitCoreProvider.invoke(JUnitCoreProvider.java:159)
at org.apache.maven.surefire.booter.ForkedBooter.invokeProviderInSameClassLoader(ForkedBooter.java:373)
at org.apache.maven.surefire.booter.ForkedBooter.runSuitesInProcess(ForkedBooter.java:334)
at org.apache.maven.surefire.booter.ForkedBooter.execute(ForkedBooter.java:119)
at org.apache.maven.surefire.booter.ForkedBooter.main(ForkedBooter.java:407)
Caused by: java.net.ConnectException: Call From asf917.gq1.ygridcore.net/67.195.81.137 to localhost:36340 failed on connection exception: java.net.ConnectException: Connection refused; For more details see: http://wiki.apache.org/hadoop/ConnectionRefused
at sun.reflect.GeneratedConstructorAccessor192.newInstance(Unknown Source)
at sun.reflect.DelegatingConstructorAccessorImpl.newInstance(DelegatingConstructorAccessorImpl.java:45)
at java.lang.reflect.Constructor.newInstance(Constructor.java:423)
at org.apache.hadoop.net.NetUtils.wrapWithMessage(NetUtils.java:791)
at org.apache.hadoop.net.NetUtils.wrapException(NetUtils.java:731)
at org.apache.hadoop.ipc.Client.call(Client.java:1472)
at org.apache.hadoop.ipc.Client.call(Client.java:1399)
at org.apache.hadoop.ipc.ProtobufRpcEngine$Invoker.invoke(ProtobufRpcEngine.java:232)
at com.sun.proxy.$Proxy25.create(Unknown Source)
at org.apache.hadoop.hdfs.protocolPB.ClientNamenodeProtocolTranslatorPB.create(ClientNamenodeProtocolTranslatorPB.java:295)
at sun.reflect.GeneratedMethodAccessor109.invoke(Unknown Source)
at sun.reflect.DelegatingMethodAccessorImpl.invoke(DelegatingMethodAccessorImpl.java:43)
at java.lang.reflect.Method.invoke(Method.java:498)
at org.apache.hadoop.io.retry.RetryInvocationHandler.invokeMethod(RetryInvocationHandler.java:187)
at org.apache.hadoop.io.retry.RetryInvocationHandler.invoke(RetryInvocationHandler.java:102)
at com.sun.proxy.$Proxy26.create(Unknown Source)
at org.apache.hadoop.hdfs.DFSOutputStream.newStreamForCreate(DFSOutputStream.java:1725)
at org.apache.hadoop.hdfs.DFSClient.create(DFSClient.java:1668)
at org.apache.hadoop.hdfs.DFSClient.create(DFSClient.java:1593)
at org.apache.hadoop.hdfs.DistributedFileSystem$6.doCall(DistributedFileSystem.java:397)
at org.apache.hadoop.hdfs.DistributedFileSystem$6.doCall(DistributedFileSystem.java:393)
at org.apache.hadoop.fs.FileSystemLinkResolver.resolve(FileSystemLinkResolver.java:81)
at org.apache.hadoop.hdfs.DistributedFileSystem.create(DistributedFileSystem.java:393)
at org.apache.hadoop.hdfs.DistributedFileSystem.create(DistributedFileSystem.java:337)
at org.apache.hadoop.fs.FileSystem.create(FileSystem.java:908)
at org.apache.hadoop.fs.FileSystem.create(FileSystem.java:889)
at org.apache.oozie.tools.OozieSharelibCLI$CopyTaskCallable.call(OozieSharelibCLI.java:414)
at org.apache.oozie.tools.OozieSharelibCLI$CopyTaskCallable.call(OozieSharelibCLI.java:378)
at java.util.concurrent.FutureTask.run(FutureTask.java:266)
at java.util.concurrent.ThreadPoolExecutor.runWorker(ThreadPoolExecutor.java:1149)
at java.util.concurrent.ThreadPoolExecutor$Worker.run(ThreadPoolExecutor.java:624)
at java.lang.Thread.run(Thread.java:748)
Caused by: java.net.ConnectException: Connection refused
at sun.nio.ch.SocketChannelImpl.checkConnect(Native Method)
at sun.nio.ch.SocketChannelImpl.finishConnect(SocketChannelImpl.java:717)
at org.apache.hadoop.net.SocketIOWithTimeout.connect(SocketIOWithTimeout.java:206)
at org.apache.hadoop.net.NetUtils.connect(NetUtils.java:530)
at org.apache.hadoop.net.NetUtils.connect(NetUtils.java:494)
at org.apache.hadoop.ipc.Client$Connection.setupConnection(Client.java:607)
at org.apache.hadoop.ipc.Client$Connection.setupIOstreams(Client.java:705)
at org.apache.hadoop.ipc.Client$Connection.access$2800(Client.java:368)
at org.apache.hadoop.ipc.Client.getConnection(Client.java:1521)
at org.apache.hadoop.ipc.Client.call(Client.java:1438)
... 26 more
FAILED: org.apache.oozie.util.TestZKUtilsWithSecurity.testNewUsingACLs
Error Message:
Call From asf917.gq1.ygridcore.net/67.195.81.137 to localhost:44067 failed on connection exception: java.net.ConnectException: Connection refused; For more details see: http://wiki.apache.org/hadoop/ConnectionRefused
Stack Trace:
java.net.ConnectException: Call From asf917.gq1.ygridcore.net/67.195.81.137 to localhost:44067 failed on connection exception: java.net.ConnectException: Connection refused; For more details see: http://wiki.apache.org/hadoop/ConnectionRefused
at sun.reflect.NativeConstructorAccessorImpl.newInstance0(Native Method)
at sun.reflect.NativeConstructorAccessorImpl.newInstance(NativeConstructorAccessorImpl.java:62)
at sun.reflect.DelegatingConstructorAccessorImpl.newInstance(DelegatingConstructorAccessorImpl.java:45)
at java.lang.reflect.Constructor.newInstance(Constructor.java:423)
at org.apache.hadoop.net.NetUtils.wrapWithMessage(NetUtils.java:791)
at org.apache.hadoop.net.NetUtils.wrapException(NetUtils.java:731)
at org.apache.hadoop.ipc.Client.call(Client.java:1472)
at org.apache.hadoop.ipc.Client.call(Client.java:1399)
at org.apache.hadoop.ipc.ProtobufRpcEngine$Invoker.invoke(ProtobufRpcEngine.java:232)
at com.sun.proxy.$Proxy15.getFileInfo(Unknown Source)
at org.apache.hadoop.hdfs.protocolPB.ClientNamenodeProtocolTranslatorPB.getFileInfo(ClientNamenodeProtocolTranslatorPB.java:752)
at sun.reflect.NativeMethodAccessorImpl.invoke0(Native Method)
at sun.reflect.NativeMethodAccessorImpl.invoke(NativeMethodAccessorImpl.java:62)
at sun.reflect.DelegatingMethodAccessorImpl.invoke(DelegatingMethodAccessorImpl.java:43)
at java.lang.reflect.Method.invoke(Method.java:498)
at org.apache.hadoop.io.retry.RetryInvocationHandler.invokeMethod(RetryInvocationHandler.java:187)
at org.apache.hadoop.io.retry.RetryInvocationHandler.invoke(RetryInvocationHandler.java:102)
at com.sun.proxy.$Proxy16.getFileInfo(Unknown Source)
at org.apache.hadoop.hdfs.DFSClient.getFileInfo(DFSClient.java:1988)
at org.apache.hadoop.hdfs.DistributedFileSystem$18.doCall(DistributedFileSystem.java:1118)
at org.apache.hadoop.hdfs.DistributedFileSystem$18.doCall(DistributedFileSystem.java:1114)
at org.apache.hadoop.fs.FileSystemLinkResolver.resolve(FileSystemLinkResolver.java:81)
at org.apache.hadoop.hdfs.DistributedFileSystem.getFileStatus(DistributedFileSystem.java:1114)
at org.apache.hadoop.fs.FileSystem.exists(FileSystem.java:1400)
at org.apache.oozie.test.XFsTestCase.initFileSystem(XFsTestCase.java:92)
at org.apache.oozie.test.XFsTestCase.setUp(XFsTestCase.java:81)
at org.apache.oozie.test.XHCatTestCase.setUp(XHCatTestCase.java:42)
at org.apache.oozie.test.ZKXTestCase.setUp(ZKXTestCase.java:70)
at org.apache.oozie.test.ZKXTestCaseWithSecurity.setUp(ZKXTestCaseWithSecurity.java:53)
at org.apache.oozie.util.TestZKUtilsWithSecurity.setUp(TestZKUtilsWithSecurity.java:36)
at junit.framework.TestCase.runBare(TestCase.java:139)
at junit.framework.TestResult$1.protect(TestResult.java:122)
at junit.framework.TestResult.runProtected(TestResult.java:142)
at junit.framework.TestResult.run(TestResult.java:125)
at junit.framework.TestCase.run(TestCase.java:129)
at junit.framework.TestSuite.runTest(TestSuite.java:255)
at junit.framework.TestSuite.run(TestSuite.java:250)
at org.junit.internal.runners.JUnit38ClassRunner.run(JUnit38ClassRunner.java:84)
at org.junit.runners.Suite.runChild(Suite.java:127)
at org.junit.runners.Suite.runChild(Suite.java:26)
at org.junit.runners.ParentRunner$3.run(ParentRunner.java:238)
at org.junit.runners.ParentRunner$1.schedule(ParentRunner.java:63)
at org.junit.runners.ParentRunner.runChildren(ParentRunner.java:236)
at org.junit.runners.ParentRunner.access$000(ParentRunner.java:53)
at org.junit.runners.ParentRunner$2.evaluate(ParentRunner.java:229)
at org.junit.runners.ParentRunner.run(ParentRunner.java:309)
at org.junit.runners.Suite.runChild(Suite.java:127)
at org.junit.runners.Suite.runChild(Suite.java:26)
at org.junit.runners.ParentRunner$3.run(ParentRunner.java:238)
at org.apache.maven.surefire.junitcore.pc.Scheduler$1.run(Scheduler.java:410)
at org.apache.maven.surefire.junitcore.pc.InvokerStrategy.schedule(InvokerStrategy.java:54)
at org.apache.maven.surefire.junitcore.pc.Scheduler.schedule(Scheduler.java:367)
at org.junit.runners.ParentRunner.runChildren(ParentRunner.java:236)
at org.junit.runners.ParentRunner.access$000(ParentRunner.java:53)
at org.junit.runners.ParentRunner$2.evaluate(ParentRunner.java:229)
at org.junit.runners.ParentRunner.run(ParentRunner.java:309)
at org.apache.maven.surefire.junitcore.pc.ParallelComputerBuilder$PC$1.run(ParallelComputerBuilder.java:593)
at org.apache.maven.surefire.junitcore.JUnitCore.run(JUnitCore.java:55)
at org.apache.maven.surefire.junitcore.JUnitCoreWrapper.createRequestAndRun(JUnitCoreWrapper.java:137)
at org.apache.maven.surefire.junitcore.JUnitCoreWrapper.executeEager(JUnitCoreWrapper.java:107)
at org.apache.maven.surefire.junitcore.JUnitCoreWrapper.execute(JUnitCoreWrapper.java:83)
at org.apache.maven.surefire.junitcore.JUnitCoreWrapper.execute(JUnitCoreWrapper.java:75)
at org.apache.maven.surefire.junitcore.JUnitCoreProvider.invoke(JUnitCoreProvider.java:159)
at org.apache.maven.surefire.booter.ForkedBooter.invokeProviderInSameClassLoader(ForkedBooter.java:373)
at org.apache.maven.surefire.booter.ForkedBooter.runSuitesInProcess(ForkedBooter.java:334)
at org.apache.maven.surefire.booter.ForkedBooter.execute(ForkedBooter.java:119)
at org.apache.maven.surefire.booter.ForkedBooter.main(ForkedBooter.java:407)
Caused by: java.net.ConnectException: Connection refused
at sun.nio.ch.SocketChannelImpl.checkConnect(Native Method)
at sun.nio.ch.SocketChannelImpl.finishConnect(SocketChannelImpl.java:717)
at org.apache.hadoop.net.SocketIOWithTimeout.connect(SocketIOWithTimeout.java:206)
at org.apache.hadoop.net.NetUtils.connect(NetUtils.java:530)
at org.apache.hadoop.net.NetUtils.connect(NetUtils.java:494)
at org.apache.hadoop.ipc.Client$Connection.setupConnection(Client.java:607)
at org.apache.hadoop.ipc.Client$Connection.setupIOstreams(Client.java:705)
at org.apache.hadoop.ipc.Client$Connection.access$2800(Client.java:368)
at org.apache.hadoop.ipc.Client.getConnection(Client.java:1521)
at org.apache.hadoop.ipc.Client.call(Client.java:1438)
... 60 more
Failed: OOZIE-3370 PreCommit Build #897
Posted by Apache Jenkins Server <je...@builds.apache.org>.
Jira: https://issues.apache.org/jira/browse/OOZIE-3370
Build: https://builds.apache.org/job/PreCommit-OOZIE-Build/897/
###################################################################################
########################## LAST 100 LINES OF THE CONSOLE ###########################
[...truncated 1.89 MB...]
[TRACE] New XMLLib present, calling 'xmllint --xpath' to get bug instance counts
[DEBUG] There are no new bugs found in [sharelib/git].
[TRACE] New XMLLib present, calling 'xmllint --xpath' to get bug instance counts
[DEBUG] There are no new bugs found in [sharelib/distcp].
[TRACE] New XMLLib present, calling 'xmllint --xpath' to get bug instance counts
[DEBUG] There are no new bugs found in [sharelib/spark].
[TRACE] New XMLLib present, calling 'xmllint --xpath' to get bug instance counts
[DEBUG] There are no new bugs found in [client].
[INFO] There are no new bugs found totally].
[TRACE] FindBugs diffs checked and reports created
[TRACE] Summary file size is 2561 bytes
[TRACE] Full summary file size is 1471 bytes
[TRACE] File [/home/jenkins/jenkins-slave/workspace/PreCommit-OOZIE-Build/test-patch/tmp/FINDBUGS_DIFF/diff/findbugs-diff-0.1.0-all.jar] removed
[TRACE] File [/home/jenkins/jenkins-slave/workspace/PreCommit-OOZIE-Build/test-patch/tmp/FINDBUGS_DIFF/diff/findbugs-diff-0.1.0-all.jar.md5sum] removed
Running test-patch task BACKWARDS_COMPATIBILITY
Running test-patch task TESTS
Running test-patch task DISTRO
Testing JIRA OOZIE-3370
Cleaning local git workspace
----------------------------
+1 PATCH_APPLIES
+1 CLEAN
-1 RAW_PATCH_ANALYSIS
+1 the patch does not introduce any @author tags
+1 the patch does not introduce any tabs
+1 the patch does not introduce any trailing spaces
+1 the patch does not introduce any star imports
+1 the patch does not introduce any line longer than 132
-1 the patch does not add/modify any testcase
+1 RAT
+1 the patch does not seem to introduce new RAT warnings
+1 JAVADOC
+1 Javadoc generation succeeded with the patch
+1 the patch does not seem to introduce new Javadoc warning(s)
WARNING: the current HEAD has 100 Javadoc warning(s)
+1 COMPILE
+1 HEAD compiles
+1 patch compiles
+1 the patch does not seem to introduce new javac warnings
+1 There are no new bugs found in total.
+1 There are no new bugs found in [examples].
+1 There are no new bugs found in [webapp].
+1 There are no new bugs found in [core].
+1 There are no new bugs found in [tools].
+1 There are no new bugs found in [fluent-job/fluent-job-api].
+1 There are no new bugs found in [server].
+1 There are no new bugs found in [docs].
+1 There are no new bugs found in [sharelib/hive2].
+1 There are no new bugs found in [sharelib/pig].
+1 There are no new bugs found in [sharelib/streaming].
+1 There are no new bugs found in [sharelib/hive].
+1 There are no new bugs found in [sharelib/hcatalog].
+1 There are no new bugs found in [sharelib/sqoop].
+1 There are no new bugs found in [sharelib/oozie].
+1 There are no new bugs found in [sharelib/git].
+1 There are no new bugs found in [sharelib/distcp].
+1 There are no new bugs found in [sharelib/spark].
+1 There are no new bugs found in [client].
+1 BACKWARDS_COMPATIBILITY
+1 the patch does not change any JPA Entity/Colum/Basic/Lob/Transient annotations
+1 the patch does not modify JPA files
+1 TESTS
Tests run: 3062
Tests failed at first run:
TestSubWorkflowActionExecutor#testSubWorkflowRerun
TestCoordActionsKillXCommand#testActionKillCommandActionNumbers
TestWorkflowActionRetryInfoXCommand#testRetryConsoleUrlForked
For the complete list of flaky tests, see TEST-SUMMARY-FULL files.
+1 DISTRO
+1 distro tarball builds with the patch
----------------------------
-1 Overall result, please check the reported -1(s)
There is at least one warning, please check
The full output of the test-patch run is available at
https://builds.apache.org/job/PreCommit-OOZIE-Build/897/
Adding comment to JIRA
% Total % Received % Xferd Average Speed Time Time Time Current
Dload Upload Total Spent Left Speed
0 0 0 0 0 0 0 0 --:--:-- --:--:-- --:--:-- 0 0 0 0 0 0 0 0 0 --:--:-- --:--:-- --:--:-- 0{"self":"https://issues.apache.org/jira/rest/api/2/issue/13192235/comment/16656814","id":"16656814","author":{"self":"https://issues.apache.org/jira/rest/api/2/user?username=hadoopqa","name":"hadoopqa","key":"hadoopqa","avatarUrls":{"48x48":"https://issues.apache.org/jira/secure/useravatar?ownerId=hadoopqa&avatarId=10393","24x24":"https://issues.apache.org/jira/secure/useravatar?size=small&ownerId=hadoopqa&avatarId=10393","16x16":"https://issues.apache.org/jira/secure/useravatar?size=xsmall&ownerId=hadoopqa&avatarId=10393","32x32":"https://issues.apache.org/jira/secure/useravatar?size=medium&ownerId=hadoopqa&avatarId=10393"},"displayName":"Hadoop QA","active":true,"timeZone":"Etc/UTC"},"body":"\nTesting JIRA OOZIE-3370\n\nCleaning local git workspace\n\n----------------------------\n\n{color:green}+1 PATCH_APPLIES{color}\n{color:green}+1 CLEAN{color}\n{color:red}-1 RAW_PATCH_ANALYSIS{color}\n. {color:green}+1{color} the patch does not introduce any @author tags\n. {color:green}+1{color} the patch does not introduce any tabs\n. {color:green}+1{color} the patch does not introduce any trailing spaces\n. {color:green}+1{color} the patch does not introduce any star imports\n. {color:green}+1{color} the patch does not introduce any line longer than 132\n. {color:red}-1{color} the patch does not add/modify any testcase\n{color:green}+1 RAT{color}\n. {color:green}+1{color} the patch does not seem to introduce new RAT warnings\n{color:green}+1 JAVADOC{color}\n. {color:green}+1{color} Javadoc generation succeeded with the patch\n. {color:green}+1{color} the patch does not seem to introduce new Javadoc warning(s)\n. {color:orange}WARNING{color}: the current HEAD has 100 Javadoc warning(s)\n{color:green}+1 COMPILE{color}\n. {color:green}+1{color} HEAD compiles\n. {color:green}+1{color} patch compiles\n. {color:green}+1{color} the patch does not seem to introduce new javac warnings\n{color:green}+1{color} There are no new bugs found in total.\n. {color:green}+1{color} There are no new bugs found in [examples].\n. {color:green}+1{color} There are no new bugs found in [webapp].\n. {color:green}+1{color} There are no new bugs found in [core].\n. {color:green}+1{color} There are no new bugs found in [tools].\n. {color:green}+1{color} There are no new bugs found in [fluent-job/fluent-job-api].\n. {color:green}+1{color} There are no new bugs found in [server].\n. {color:green}+1{color} There are no new bugs found in [docs].\n. {color:green}+1{color} There are no new bugs found in [sharelib/hive2].\n. {color:green}+1{color} There are no new bugs found in [sharelib/pig].\n. {color:green}+1{color} There are no new bugs found in [sharelib/streaming].\n. {color:green}+1{color} There are no new bugs found in [sharelib/hive].\n. {color:green}+1{color} There are no new bugs found in [sharelib/hcatalog].\n. {color:green}+1{color} There are no new bugs found in [sharelib/sqoop].\n. {color:green}+1{color} There are no new bugs found in [sharelib/oozie].\n. {color:green}+1{color} There are no new bugs found in [sharelib/git].\n. {color:green}+1{color} There are no new bugs found in [sharelib/distcp].\n. {color:green}+1{color} There are no new bugs found in [sharelib/spark].\n. {color:green}+1{color} There are no new bugs found in [client].\n{color:green}+1 BACKWARDS_COMPATIBILITY{color}\n. {color:green}+1{color} the patch does not change any JPA Entity/Colum/Basic/Lob/Transient annotations\n. {color:green}+1{color} the patch does not modify JPA files\n{color:green}+1 TESTS{color}\n. Tests run: 3062\n. {color:orange}Tests failed at first run:{color}\nTestSubWorkflowActionExecutor#testSubWorkflowRerun\nTestCoordActionsKillXCommand#testActionKillCommandActionNumbers\nTestWorkflowActionRetryInfoXCommand#testRetryConsoleUrlForked\n. For the complete list of flaky tests, see TEST-SUMMARY-FULL files.\n{color:green}+1 DISTRO{color}\n. {color:green}+1{color} distro tarball builds with the patch \n\n----------------------------\n{color:red}*-1 Overall result, please check the reported -1(s)*{color}\n\n{co100 8552 0 4964 100 3588 5153 3724 --:--:-- --:--:-- --:--:-- 5149
lor:red}. There is at least one warning, please check{color}\n\nThe full output of the test-patch run is available at\n\n. https://builds.apache.org/job/PreCommit-OOZIE-Build/897/\n\n","updateAuthor":{"self":"https://issues.apache.org/jira/rest/api/2/user?username=hadoopqa","name":"hadoopqa","key":"hadoopqa","avatarUrls":{"48x48":"https://issues.apache.org/jira/secure/useravatar?ownerId=hadoopqa&avatarId=10393","24x24":"https://issues.apache.org/jira/secure/useravatar?size=small&ownerId=hadoopqa&avatarId=10393","16x16":"https://issues.apache.org/jira/secure/useravatar?size=xsmall&ownerId=hadoopqa&avatarId=10393","32x32":"https://issues.apache.org/jira/secure/useravatar?size=medium&ownerId=hadoopqa&avatarId=10393"},"displayName":"Hadoop QA","active":true,"timeZone":"Etc/UTC"},"created":"2018-10-19T13:34:49.298+0000","updated":"2018-10-19T13:34:49.298+0000"}
test-patch exit code: 1
Build step 'Execute shell' marked build as failure
[description-setter] Description set: OOZIE-3370
Archiving artifacts
[Fast Archiver] Compressed 3.02 MB of artifacts by 18.6% relative to #889
Recording test results
Email was triggered for: Failure - Any
Sending email for trigger: Failure - Any
###################################################################################
############################## FAILED TESTS (if any) ##############################
All tests passed
Failed: OOZIE-3370 PreCommit Build #896
Posted by Apache Jenkins Server <je...@builds.apache.org>.
Jira: https://issues.apache.org/jira/browse/OOZIE-3370
Build: https://builds.apache.org/job/PreCommit-OOZIE-Build/896/
###################################################################################
########################## LAST 100 LINES OF THE CONSOLE ###########################
[...truncated 1.89 MB...]
[TRACE] New XMLLib present, calling 'xmllint --xpath' to get bug instance counts
[DEBUG] There are no new bugs found in [sharelib/hive].
[TRACE] New XMLLib present, calling 'xmllint --xpath' to get bug instance counts
[DEBUG] There are no new bugs found in [sharelib/git].
[TRACE] New XMLLib present, calling 'xmllint --xpath' to get bug instance counts
[DEBUG] There are no new bugs found in [sharelib/hive2].
[TRACE] New XMLLib present, calling 'xmllint --xpath' to get bug instance counts
[DEBUG] There are no new bugs found in [sharelib/pig].
[TRACE] New XMLLib present, calling 'xmllint --xpath' to get bug instance counts
[DEBUG] There are no new bugs found in [sharelib/spark].
[INFO] There are no new bugs found totally].
[TRACE] FindBugs diffs checked and reports created
[TRACE] Summary file size is 2560 bytes
[TRACE] Full summary file size is 1471 bytes
[TRACE] File [/home/jenkins/jenkins-slave/workspace/PreCommit-OOZIE-Build/test-patch/tmp/FINDBUGS_DIFF/diff/findbugs-diff-0.1.0-all.jar] removed
[TRACE] File [/home/jenkins/jenkins-slave/workspace/PreCommit-OOZIE-Build/test-patch/tmp/FINDBUGS_DIFF/diff/findbugs-diff-0.1.0-all.jar.md5sum] removed
Running test-patch task BACKWARDS_COMPATIBILITY
Running test-patch task TESTS
Running test-patch task DISTRO
Testing JIRA OOZIE-3370
Cleaning local git workspace
----------------------------
+1 PATCH_APPLIES
+1 CLEAN
+1 RAW_PATCH_ANALYSIS
+1 the patch does not introduce any @author tags
+1 the patch does not introduce any tabs
+1 the patch does not introduce any trailing spaces
+1 the patch does not introduce any star imports
+1 the patch does not introduce any line longer than 132
+1 the patch adds/modifies 4 testcase(s)
+1 RAT
+1 the patch does not seem to introduce new RAT warnings
+1 JAVADOC
+1 Javadoc generation succeeded with the patch
+1 the patch does not seem to introduce new Javadoc warning(s)
WARNING: the current HEAD has 100 Javadoc warning(s)
+1 COMPILE
+1 HEAD compiles
+1 patch compiles
+1 the patch does not seem to introduce new javac warnings
+1 There are no new bugs found in total.
+1 There are no new bugs found in [server].
+1 There are no new bugs found in [client].
+1 There are no new bugs found in [core].
+1 There are no new bugs found in [fluent-job/fluent-job-api].
+1 There are no new bugs found in [docs].
+1 There are no new bugs found in [tools].
+1 There are no new bugs found in [examples].
+1 There are no new bugs found in [webapp].
+1 There are no new bugs found in [sharelib/streaming].
+1 There are no new bugs found in [sharelib/sqoop].
+1 There are no new bugs found in [sharelib/distcp].
+1 There are no new bugs found in [sharelib/oozie].
+1 There are no new bugs found in [sharelib/hcatalog].
+1 There are no new bugs found in [sharelib/hive].
+1 There are no new bugs found in [sharelib/git].
+1 There are no new bugs found in [sharelib/hive2].
+1 There are no new bugs found in [sharelib/pig].
+1 There are no new bugs found in [sharelib/spark].
+1 BACKWARDS_COMPATIBILITY
+1 the patch does not change any JPA Entity/Colum/Basic/Lob/Transient annotations
+1 the patch does not modify JPA files
+1 TESTS
Tests run: 3062
Tests failed at first run:
TestSubWorkflowActionExecutor#testSubWorkflowRerun
For the complete list of flaky tests, see TEST-SUMMARY-FULL files.
+1 DISTRO
+1 distro tarball builds with the patch
----------------------------
+1 Overall result, good!, no -1s
There is at least one warning, please check
The full output of the test-patch run is available at
https://builds.apache.org/job/PreCommit-OOZIE-Build/896/
Adding comment to JIRA
% Total % Received % Xferd Average Speed Time Time Time Current
Dload Upload Total Spent Left Speed
0 0 0 0 0 0 0 0 --:--:-- --:--:-- --:--:-- 0 0 0 0 0 0 0 0 0 --:--:-- --:--:-- --:--:-- 0{"self":"https://issues.apache.org/jira/rest/api/2/issue/13192235/comment/16653742","id":"16653742","author":{"self":"https://issues.apache.org/jira/rest/api/2/user?username=hadoopqa","name":"hadoopqa","key":"hadoopqa","avatarUrls":{"48x48":"https://issues.apache.org/jira/secure/useravatar?ownerId=hadoopqa&avatarId=10393","24x24":"https://issues.apache.org/jira/secure/useravatar?size=small&ownerId=hadoopqa&avatarId=10393","16x16":"https://issues.apache.org/jira/secure/useravatar?size=xsmall&ownerId=hadoopqa&avatarId=10393","32x32":"https://issues.apache.org/jira/secure/useravatar?size=medium&ownerId=hadoopqa&avatarId=10393"},"displayName":"Hadoop QA","active":true,"timeZone":"Etc/UTC"},"body":"\nTesting JIRA OOZIE-3370\n\nCleaning local git workspace\n\n----------------------------\n\n{color:green}+1 PATCH_APPLIES{color}\n{color:green}+1 CLEAN{color}\n{color:green}+1 RAW_PATCH_ANALYSIS{color}\n. {color:green}+1{color} the patch does not introduce any @author tags\n. {color:green}+1{color} the patch does not introduce any tabs\n. {color:green}+1{color} the patch does not introduce any trailing spaces\n. {color:green}+1{color} the patch does not introduce any star imports\n. {color:green}+1{color} the patch does not introduce any line longer than 132\n. {color:green}+1{color} the patch adds/modifies 4 testcase(s)\n{color:green}+1 RAT{color}\n. {color:green}+1{color} the patch does not seem to introduce new RAT warnings\n{color:green}+1 JAVADOC{color}\n. {color:green}+1{color} Javadoc generation succeeded with the patch\n. {color:green}+1{color} the patch does not seem to introduce new Javadoc warning(s)\n. {color:orange}WARNING{color}: the current HEAD has 100 Javadoc warning(s)\n{color:green}+1 COMPILE{color}\n. {color:green}+1{color} HEAD compiles\n. {color:green}+1{color} patch compiles\n. {color:green}+1{color} the patch does not seem to introduce new javac warnings\n{color:green}+1{color} There are no new bugs found in total.\n. {color:green}+1{color} There are no new bugs found in [server].\n. {color:green}+1{color} There are no new bugs found in [client].\n. {color:green}+1{color} There are no new bugs found in [core].\n. {color:green}+1{color} There are no new bugs found in [fluent-job/fluent-job-api].\n. {color:green}+1{color} There are no new bugs found in [docs].\n. {color:green}+1{color} There are no new bugs found in [tools].\n. {color:green}+1{color} There are no new bugs found in [examples].\n. {color:green}+1{color} There are no new bugs found in [webapp].\n. {color:green}+1{color} There are no new bugs found in [sharelib/streaming].\n. {color:green}+1{color} There are no new bugs found in [sharelib/sqoop].\n. {color:green}+1{color} There are no new bugs found in [sharelib/distcp].\n. {color:green}+1{color} There are no new bugs found in [sharelib/oozie].\n. {color:green}+1{color} There are no new bugs found in [sharelib/hcatalog].\n. {color:green}+1{color} There are no new bugs found in [sharelib/hive].\n. {color:green}+1{color} There are no new bugs found in [sharelib/git].\n. {color:green}+1{color} There are no new bugs found in [sharelib/hive2].\n. {color:green}+1{color} There are no new bugs found in [sharelib/pig].\n. {color:green}+1{color} There are no new bugs found in [sharelib/spark].\n{color:green}+1 BACKWARDS_COMPATIBILITY{color}\n. {color:green}+1{color} the patch does not change any JPA Entity/Colum/Basic/Lob/Transient annotations\n. {color:green}+1{color} the patch does not modify JPA files\n{color:green}+1 TESTS{color}\n. Tests run: 3062\n. {color:orange}Tests failed at first run:{color}\nTestSubWorkflowActionExecutor#testSubWorkflowRerun\n. For the complete list of flaky tests, see TEST-SUMMARY-FULL files.\n{color:green}+1 DISTRO{color}\n. {color:green}+1{color} distro tarball builds with the patch \n\n----------------------------\n{color:green}*+1 Overall result, good!, no -1s*{color}\n\n{color:red}. There is at least one warning, please check{color}\n\nThe full output of the test-patch run is available at\n\n. https://builds.apache.100 8262 0 4819 100 3443 7328 5235 --:--:-- --:--:-- --:--:-- 7323
org/job/PreCommit-OOZIE-Build/896/\n\n","updateAuthor":{"self":"https://issues.apache.org/jira/rest/api/2/user?username=hadoopqa","name":"hadoopqa","key":"hadoopqa","avatarUrls":{"48x48":"https://issues.apache.org/jira/secure/useravatar?ownerId=hadoopqa&avatarId=10393","24x24":"https://issues.apache.org/jira/secure/useravatar?size=small&ownerId=hadoopqa&avatarId=10393","16x16":"https://issues.apache.org/jira/secure/useravatar?size=xsmall&ownerId=hadoopqa&avatarId=10393","32x32":"https://issues.apache.org/jira/secure/useravatar?size=medium&ownerId=hadoopqa&avatarId=10393"},"displayName":"Hadoop QA","active":true,"timeZone":"Etc/UTC"},"created":"2018-10-17T15:36:22.917+0000","updated":"2018-10-17T15:36:22.917+0000"}
test-patch exit code: 0
[description-setter] Description set: OOZIE-3370
Archiving artifacts
[Fast Archiver] Compressed 3.05 MB of artifacts by 26.7% relative to #889
Recording test results
ERROR: Step ?Publish JUnit test result report? failed: No test report files were found. Configuration error?
Email was triggered for: Failure - Any
Sending email for trigger: Failure - Any
###################################################################################
############################## FAILED TESTS (if any) ##############################
No tests ran.
Failed: OOZIE-3362 PreCommit Build #895
Posted by Apache Jenkins Server <je...@builds.apache.org>.
Jira: https://issues.apache.org/jira/browse/OOZIE-3362
Build: https://builds.apache.org/job/PreCommit-OOZIE-Build/895/
###################################################################################
########################## LAST 100 LINES OF THE CONSOLE ###########################
[...truncated 1.89 MB...]
[DEBUG] There are no new bugs found in [server].
[INFO] There are no new bugs found totally].
[TRACE] FindBugs diffs checked and reports created
[TRACE] Summary file size is 2561 bytes
[TRACE] Full summary file size is 1471 bytes
[TRACE] File [/home/jenkins/jenkins-slave/workspace/PreCommit-OOZIE-Build/test-patch/tmp/FINDBUGS_DIFF/diff/findbugs-diff-0.1.0-all.jar] removed
[TRACE] File [/home/jenkins/jenkins-slave/workspace/PreCommit-OOZIE-Build/test-patch/tmp/FINDBUGS_DIFF/diff/findbugs-diff-0.1.0-all.jar.md5sum] removed
Running test-patch task BACKWARDS_COMPATIBILITY
Running test-patch task TESTS
xargs: WARNING: a NUL character occurred in the input. It cannot be passed through in the argument list. Did you mean to use the --null option?
Running test-patch task DISTRO
Testing JIRA OOZIE-3362
Cleaning local git workspace
----------------------------
+1 PATCH_APPLIES
+1 CLEAN
-1 RAW_PATCH_ANALYSIS
+1 the patch does not introduce any @author tags
+1 the patch does not introduce any tabs
+1 the patch does not introduce any trailing spaces
+1 the patch does not introduce any star imports
+1 the patch does not introduce any line longer than 132
-1 the patch does not add/modify any testcase
+1 RAT
+1 the patch does not seem to introduce new RAT warnings
+1 JAVADOC
+1 Javadoc generation succeeded with the patch
+1 the patch does not seem to introduce new Javadoc warning(s)
WARNING: the current HEAD has 100 Javadoc warning(s)
+1 COMPILE
+1 HEAD compiles
+1 patch compiles
+1 the patch does not seem to introduce new javac warnings
+1 There are no new bugs found in total.
+1 There are no new bugs found in [docs].
+1 There are no new bugs found in [fluent-job/fluent-job-api].
+1 There are no new bugs found in [client].
+1 There are no new bugs found in [tools].
+1 There are no new bugs found in [webapp].
+1 There are no new bugs found in [sharelib/sqoop].
+1 There are no new bugs found in [sharelib/hcatalog].
+1 There are no new bugs found in [sharelib/pig].
+1 There are no new bugs found in [sharelib/spark].
+1 There are no new bugs found in [sharelib/hive2].
+1 There are no new bugs found in [sharelib/streaming].
+1 There are no new bugs found in [sharelib/git].
+1 There are no new bugs found in [sharelib/oozie].
+1 There are no new bugs found in [sharelib/distcp].
+1 There are no new bugs found in [sharelib/hive].
+1 There are no new bugs found in [core].
+1 There are no new bugs found in [examples].
+1 There are no new bugs found in [server].
+1 BACKWARDS_COMPATIBILITY
+1 the patch does not change any JPA Entity/Colum/Basic/Lob/Transient annotations
+1 the patch does not modify JPA files
-1 TESTS
Tests run : 3057
Tests failed : 1
Tests in error : 0
Tests timed out : 0
-1 [ERROR] There are [1] test failures in [core]. Listing only the first [5] ones
testRetryConsoleUrlForked:org.apache.oozie.command.wf.TestWorkflowActionRetryInfoXCommand
Check console output for the full list of errors/failures
Tests failed at first run:
TestSubWorkflowActionExecutor#testSubWorkflowRerun
For the complete list of flaky tests, see TEST-SUMMARY-FULL files.
+1 DISTRO
+1 distro tarball builds with the patch
----------------------------
-1 Overall result, please check the reported -1(s)
There is at least one warning, please check
The full output of the test-patch run is available at
https://builds.apache.org/job/PreCommit-OOZIE-Build/895/
Adding comment to JIRA
% Total % Received % Xferd Average Speed Time Time Time Current
Dload Upload Total Spent Left Speed
0 0 0 0 0 0 0 0 --:--:-- --:--:-- --:--:-- 0 0 0 0 0 0 0 0 0 --:--:-- --:--:-- --:--:-- 0{"self":"https://issues.apache.org/jira/rest/api/2/issue/13190347/comment/16653733","id":"16653733","author":{"self":"https://issues.apache.org/jira/rest/api/2/user?username=hadoopqa","name":"hadoopqa","key":"hadoopqa","avatarUrls":{"48x48":"https://issues.apache.org/jira/secure/useravatar?ownerId=hadoopqa&avatarId=10393","24x24":"https://issues.apache.org/jira/secure/useravatar?size=small&ownerId=hadoopqa&avatarId=10393","16x16":"https://issues.apache.org/jira/secure/useravatar?size=xsmall&ownerId=hadoopqa&avatarId=10393","32x32":"https://issues.apache.org/jira/secure/useravatar?size=medium&ownerId=hadoopqa&avatarId=10393"},"displayName":"Hadoop QA","active":true,"timeZone":"Etc/UTC"},"body":"\nTesting JIRA OOZIE-3362\n\nCleaning local git workspace\n\n----------------------------\n\n{color:green}+1 PATCH_APPLIES{color}\n{color:green}+1 CLEAN{color}\n{color:red}-1 RAW_PATCH_ANALYSIS{color}\n. {color:green}+1{color} the patch does not introduce any @author tags\n. {color:green}+1{color} the patch does not introduce any tabs\n. {color:green}+1{color} the patch does not introduce any trailing spaces\n. {color:green}+1{color} the patch does not introduce any star imports\n. {color:green}+1{color} the patch does not introduce any line longer than 132\n. {color:red}-1{color} the patch does not add/modify any testcase\n{color:green}+1 RAT{color}\n. {color:green}+1{color} the patch does not seem to introduce new RAT warnings\n{color:green}+1 JAVADOC{color}\n. {color:green}+1{color} Javadoc generation succeeded with the patch\n. {color:green}+1{color} the patch does not seem to introduce new Javadoc warning(s)\n. {color:orange}WARNING{color}: the current HEAD has 100 Javadoc warning(s)\n{color:green}+1 COMPILE{color}\n. {color:green}+1{color} HEAD compiles\n. {color:green}+1{color} patch compiles\n. {color:green}+1{color} the patch does not seem to introduce new javac warnings\n{color:green}+1{color} There are no new bugs found in total.\n. {color:green}+1{color} There are no new bugs found in [docs].\n. {color:green}+1{color} There are no new bugs found in [fluent-job/fluent-job-api].\n. {color:green}+1{color} There are no new bugs found in [client].\n. {color:green}+1{color} There are no new bugs found in [tools].\n. {color:green}+1{color} There are no new bugs found in [webapp].\n. {color:green}+1{color} There are no new bugs found in [sharelib/sqoop].\n. {color:green}+1{color} There are no new bugs found in [sharelib/hcatalog].\n. {color:green}+1{color} There are no new bugs found in [sharelib/pig].\n. {color:green}+1{color} There are no new bugs found in [sharelib/spark].\n. {color:green}+1{color} There are no new bugs found in [sharelib/hive2].\n. {color:green}+1{color} There are no new bugs found in [sharelib/streaming].\n. {color:green}+1{color} There are no new bugs found in [sharelib/git].\n. {color:green}+1{color} There are no new bugs found in [sharelib/oozie].\n. {color:green}+1{color} There are no new bugs found in [sharelib/distcp].\n. {color:green}+1{color} There are no new bugs found in [sharelib/hive].\n. {color:green}+1{color} There are no new bugs found in [core].\n. {color:green}+1{color} There are no new bugs found in [examples].\n. {color:green}+1{color} There are no new bugs found in [server].\n{color:green}+1 BACKWARDS_COMPATIBILITY{color}\n. {color:green}+1{color} the patch does not change any JPA Entity/Colum/Basic/Lob/Transient annotations\n. {color:green}+1{color} the patch does not modify JPA files\n{color:red}-1 TESTS{color}\n. Tests run : 3057\n. Tests failed : 1\n. Tests in error : 0\n. Tests timed out : 0\n\n{color:red}-1{color} [ERROR] There are [1] test failures in [core]. Listing only the first [5] ones\ntestRetryConsoleUrlForked:org.apache.oozie.command.wf.TestWorkflowActionRetryInfoXCommand\n\nCheck console output for the full list of errors/failures\n. {color:orange}Tests failed at first run:{color}\nTestSubWorkflowActionExecutor#testSubWorkflowRerun\n. For the complete list of flaky tests, see TEST-SUMMARY-FULL f100 8980 0 5178 100 3802 5159 3788 0:00:01 0:00:01 --:--:-- 5162
iles.\n{color:green}+1 DISTRO{color}\n. {color:green}+1{color} distro tarball builds with the patch \n\n----------------------------\n{color:red}*-1 Overall result, please check the reported -1(s)*{color}\n\n{color:red}. There is at least one warning, please check{color}\n\nThe full output of the test-patch run is available at\n\n. https://builds.apache.org/job/PreCommit-OOZIE-Build/895/\n\n","updateAuthor":{"self":"https://issues.apache.org/jira/rest/api/2/user?username=hadoopqa","name":"hadoopqa","key":"hadoopqa","avatarUrls":{"48x48":"https://issues.apache.org/jira/secure/useravatar?ownerId=hadoopqa&avatarId=10393","24x24":"https://issues.apache.org/jira/secure/useravatar?size=small&ownerId=hadoopqa&avatarId=10393","16x16":"https://issues.apache.org/jira/secure/useravatar?size=xsmall&ownerId=hadoopqa&avatarId=10393","32x32":"https://issues.apache.org/jira/secure/useravatar?size=medium&ownerId=hadoopqa&avatarId=10393"},"displayName":"Hadoop QA","active":true,"timeZone":"Etc/UTC"},"created":"2018-10-17T15:22:18.516+0000","updated":"2018-10-17T15:22:18.516+0000"}
test-patch exit code: 1
Build step 'Execute shell' marked build as failure
[description-setter] Description set: OOZIE-3362
Archiving artifacts
[Fast Archiver] Compressed 3.04 MB of artifacts by 35.0% relative to #889
Recording test results
Email was triggered for: Failure - Any
Sending email for trigger: Failure - Any
###################################################################################
############################## FAILED TESTS (if any) ##############################
1 tests failed.
FAILED: org.apache.oozie.command.wf.TestWorkflowActionRetryInfoXCommand.testRetryConsoleUrlForked
Error Message:
expected:<2> but was:<1>
Stack Trace:
junit.framework.AssertionFailedError: expected:<2> but was:<1>
at junit.framework.Assert.fail(Assert.java:57)
at junit.framework.Assert.failNotEquals(Assert.java:329)
at junit.framework.Assert.assertEquals(Assert.java:78)
at junit.framework.Assert.assertEquals(Assert.java:234)
at junit.framework.Assert.assertEquals(Assert.java:241)
at junit.framework.TestCase.assertEquals(TestCase.java:409)
at org.apache.oozie.command.wf.TestWorkflowActionRetryInfoXCommand.validateRetryConsoleUrl(TestWorkflowActionRetryInfoXCommand.java:172)
at org.apache.oozie.command.wf.TestWorkflowActionRetryInfoXCommand.testRetryConsoleUrlForked(TestWorkflowActionRetryInfoXCommand.java:125)
at sun.reflect.NativeMethodAccessorImpl.invoke0(Native Method)
at sun.reflect.NativeMethodAccessorImpl.invoke(NativeMethodAccessorImpl.java:62)
at sun.reflect.DelegatingMethodAccessorImpl.invoke(DelegatingMethodAccessorImpl.java:43)
at java.lang.reflect.Method.invoke(Method.java:498)
at junit.framework.TestCase.runTest(TestCase.java:176)
at junit.framework.TestCase.runBare(TestCase.java:141)
at junit.framework.TestResult$1.protect(TestResult.java:122)
at junit.framework.TestResult.runProtected(TestResult.java:142)
at junit.framework.TestResult.run(TestResult.java:125)
at junit.framework.TestCase.run(TestCase.java:129)
at junit.framework.TestSuite.runTest(TestSuite.java:255)
at junit.framework.TestSuite.run(TestSuite.java:250)
at org.junit.internal.runners.JUnit38ClassRunner.run(JUnit38ClassRunner.java:84)
at org.junit.runners.Suite.runChild(Suite.java:127)
at org.junit.runners.Suite.runChild(Suite.java:26)
at org.junit.runners.ParentRunner$3.run(ParentRunner.java:238)
at org.junit.runners.ParentRunner$1.schedule(ParentRunner.java:63)
at org.junit.runners.ParentRunner.runChildren(ParentRunner.java:236)
at org.junit.runners.ParentRunner.access$000(ParentRunner.java:53)
at org.junit.runners.ParentRunner$2.evaluate(ParentRunner.java:229)
at org.junit.runners.ParentRunner.run(ParentRunner.java:309)
at org.junit.runners.Suite.runChild(Suite.java:127)
at org.junit.runners.Suite.runChild(Suite.java:26)
at org.junit.runners.ParentRunner$3.run(ParentRunner.java:238)
at org.apache.maven.surefire.junitcore.pc.Scheduler$1.run(Scheduler.java:410)
at org.apache.maven.surefire.junitcore.pc.InvokerStrategy.schedule(InvokerStrategy.java:54)
at org.apache.maven.surefire.junitcore.pc.Scheduler.schedule(Scheduler.java:367)
at org.junit.runners.ParentRunner.runChildren(ParentRunner.java:236)
at org.junit.runners.ParentRunner.access$000(ParentRunner.java:53)
at org.junit.runners.ParentRunner$2.evaluate(ParentRunner.java:229)
at org.junit.runners.ParentRunner.run(ParentRunner.java:309)
at org.apache.maven.surefire.junitcore.pc.ParallelComputerBuilder$PC$1.run(ParallelComputerBuilder.java:593)
at org.apache.maven.surefire.junitcore.JUnitCore.run(JUnitCore.java:55)
at org.apache.maven.surefire.junitcore.JUnitCoreWrapper.createRequestAndRun(JUnitCoreWrapper.java:137)
at org.apache.maven.surefire.junitcore.JUnitCoreWrapper.executeEager(JUnitCoreWrapper.java:107)
at org.apache.maven.surefire.junitcore.JUnitCoreWrapper.execute(JUnitCoreWrapper.java:83)
at org.apache.maven.surefire.junitcore.JUnitCoreWrapper.execute(JUnitCoreWrapper.java:75)
at org.apache.maven.surefire.junitcore.JUnitCoreProvider.invoke(JUnitCoreProvider.java:159)
at org.apache.maven.surefire.booter.ForkedBooter.invokeProviderInSameClassLoader(ForkedBooter.java:373)
at org.apache.maven.surefire.booter.ForkedBooter.runSuitesInProcess(ForkedBooter.java:334)
at org.apache.maven.surefire.booter.ForkedBooter.execute(ForkedBooter.java:119)
at org.apache.maven.surefire.booter.ForkedBooter.main(ForkedBooter.java:407)
Failed: OOZIE-3369 PreCommit Build #894
Posted by Apache Jenkins Server <je...@builds.apache.org>.
Jira: https://issues.apache.org/jira/browse/OOZIE-3369
Build: https://builds.apache.org/job/PreCommit-OOZIE-Build/894/
###################################################################################
########################## LAST 100 LINES OF THE CONSOLE ###########################
[...truncated 1.89 MB...]
[TRACE] New XMLLib present, calling 'xmllint --xpath' to get bug instance counts
[DEBUG] There are no new bugs found in [core].
[TRACE] New XMLLib present, calling 'xmllint --xpath' to get bug instance counts
[DEBUG] There are no new bugs found in [tools].
[TRACE] New XMLLib present, calling 'xmllint --xpath' to get bug instance counts
[DEBUG] There are no new bugs found in [server].
[TRACE] New XMLLib present, calling 'xmllint --xpath' to get bug instance counts
[DEBUG] There are no new bugs found in [fluent-job/fluent-job-api].
[INFO] There are no new bugs found totally].
[TRACE] FindBugs diffs checked and reports created
[TRACE] Summary file size is 2561 bytes
[TRACE] Full summary file size is 1471 bytes
[TRACE] File [/home/jenkins/jenkins-slave/workspace/PreCommit-OOZIE-Build/test-patch/tmp/FINDBUGS_DIFF/diff/findbugs-diff-0.1.0-all.jar] removed
[TRACE] File [/home/jenkins/jenkins-slave/workspace/PreCommit-OOZIE-Build/test-patch/tmp/FINDBUGS_DIFF/diff/findbugs-diff-0.1.0-all.jar.md5sum] removed
Running test-patch task BACKWARDS_COMPATIBILITY
Running test-patch task TESTS
Running test-patch task DISTRO
Testing JIRA OOZIE-3369
Cleaning local git workspace
----------------------------
+1 PATCH_APPLIES
+1 CLEAN
-1 RAW_PATCH_ANALYSIS
+1 the patch does not introduce any @author tags
+1 the patch does not introduce any tabs
+1 the patch does not introduce any trailing spaces
+1 the patch does not introduce any star imports
+1 the patch does not introduce any line longer than 132
-1 the patch does not add/modify any testcase
+1 RAT
+1 the patch does not seem to introduce new RAT warnings
+1 JAVADOC
+1 Javadoc generation succeeded with the patch
+1 the patch does not seem to introduce new Javadoc warning(s)
WARNING: the current HEAD has 100 Javadoc warning(s)
+1 COMPILE
+1 HEAD compiles
+1 patch compiles
+1 the patch does not seem to introduce new javac warnings
+1 There are no new bugs found in total.
+1 There are no new bugs found in [docs].
+1 There are no new bugs found in [webapp].
+1 There are no new bugs found in [sharelib/distcp].
+1 There are no new bugs found in [sharelib/hive].
+1 There are no new bugs found in [sharelib/spark].
+1 There are no new bugs found in [sharelib/hive2].
+1 There are no new bugs found in [sharelib/hcatalog].
+1 There are no new bugs found in [sharelib/git].
+1 There are no new bugs found in [sharelib/streaming].
+1 There are no new bugs found in [sharelib/pig].
+1 There are no new bugs found in [sharelib/sqoop].
+1 There are no new bugs found in [sharelib/oozie].
+1 There are no new bugs found in [examples].
+1 There are no new bugs found in [client].
+1 There are no new bugs found in [core].
+1 There are no new bugs found in [tools].
+1 There are no new bugs found in [server].
+1 There are no new bugs found in [fluent-job/fluent-job-api].
+1 BACKWARDS_COMPATIBILITY
+1 the patch does not change any JPA Entity/Colum/Basic/Lob/Transient annotations
+1 the patch does not modify JPA files
+1 TESTS
Tests run: 3057
Tests failed at first run:
TestSubWorkflowActionExecutor#testSubWorkflowRerun
TestCoordActionsKillXCommand#testActionKillCommandDate
For the complete list of flaky tests, see TEST-SUMMARY-FULL files.
+1 DISTRO
+1 distro tarball builds with the patch
----------------------------
-1 Overall result, please check the reported -1(s)
There is at least one warning, please check
The full output of the test-patch run is available at
https://builds.apache.org/job/PreCommit-OOZIE-Build/894/
Adding comment to JIRA
% Total % Received % Xferd Average Speed Time Time Time Current
Dload Upload Total Spent Left Speed
0 0 0 0 0 0 0 0 --:--:-- --:--:-- --:--:-- 0100 3516 0 0 100 3516 0 3497 0:00:01 0:00:01 --:--:-- 3498{"self":"https://issues.apache.org/jira/rest/api/2/issue/13191594/comment/16650430","id":"16650430","author":{"self":"https://issues.apache.org/jira/rest/api/2/user?username=hadoopqa","name":"hadoopqa","key":"hadoopqa","avatarUrls":{"48x48":"https://issues.apache.org/jira/secure/useravatar?ownerId=hadoopqa&avatarId=10393","24x24":"https://issues.apache.org/jira/secure/useravatar?size=small&ownerId=hadoopqa&avatarId=10393","16x16":"https://issues.apache.org/jira/secure/useravatar?size=xsmall&ownerId=hadoopqa&avatarId=10393","32x32":"https://issues.apache.org/jira/secure/useravatar?size=medium&ownerId=hadoopqa&avatarId=10393"},"displayName":"Hadoop QA","active":true,"timeZone":"Etc/UTC"},"body":"\nTesting JIRA OOZIE-3369\n\nCleaning local git workspace\n\n----------------------------\n\n{color:green}+1 PATCH_APPLIES{color}\n{color:green}+1 CLEAN{color}\n{color:red}-1 RAW_PATCH_ANALYSIS{color}\n. {color:green}+1{color} the patch does not introduce any @author tags\n. {color:green}+1{color} the patch does not introduce any tabs\n. {color:green}+1{color} the patch does not introduce any trailing spaces\n. {color:green}+1{color} the patch does not introduce any star imports\n. {color:green}+1{color} the patch does not introduce any line longer than 132\n. {color:red}-1{color} the patch does not add/modify any testcase\n{color:green}+1 RAT{color}\n. {color:green}+1{color} the patch does not seem to introduce new RAT warnings\n{color:green}+1 JAVADOC{color}\n. {color:green}+1{color} Javadoc generation succeeded with the patch\n. {color:green}+1{color} the patch does not seem to introduce new Javadoc warning(s)\n. {color:orange}WARNING{color}: the current HEAD has 100 Javadoc warning(s)\n{color:green}+1 COMPILE{color}\n. {color:green}+1{color} HEAD compiles\n. {color:green}+1{color} patch compiles\n. {color:green}+1{color} the patch does not seem to introduce new javac warnings\n{color:green}+1{color} There are no new bugs found in total.\n. {color:green}+1{color} There are no new bugs found in [docs].\n. {color:green}+1{color} There are no new bugs found in [webapp].\n. {color:green}+1{color} There are no new bugs found in [sharelib/distcp].\n. {color:green}+1{color} There are no new bugs found in [sharelib/hive].\n. {color:green}+1{color} There are no new bugs found in [sharelib/spark].\n. {color:green}+1{color} There are no new bugs found in [sharelib/hive2].\n. {color:green}+1{color} There are no new bugs found in [sharelib/hcatalog].\n. {color:green}+1{color} There are no new bugs found in [sharelib/git].\n. {color:green}+1{color} There are no new bugs found in [sharelib/streaming].\n. {color:green}+1{color} There are no new bugs found in [sharelib/pig].\n. {color:green}+1{color} There are no new bugs found in [sharelib/sqoop].\n. {color:green}+1{color} There are no new bugs found in [sharelib/oozie].\n. {color:green}+1{color} There are no new bugs found in [examples].\n. {color:green}+1{color} There are no new bugs found in [client].\n. {color:green}+1{color} There are no new bugs found in [core].\n. {color:green}+1{color} There are no new bugs found in [tools].\n. {color:green}+1{color} There are no new bugs found in [server].\n. {color:green}+1{color} There are no new bugs found in [fluent-job/fluent-job-api].\n{color:green}+1 BACKWARDS_COMPATIBILITY{color}\n. {color:green}+1{color} the patch does not change any JPA Entity/Colum/Basic/Lob/Transient annotations\n. {color:green}+1{color} the patch does not modify JPA files\n{color:green}+1 TESTS{color}\n. Tests run: 3057\n. {color:orange}Tests failed at first run:{color}\nTestSubWorkflowActionExecutor#testSubWorkflowRerun\nTestCoordActionsKillXCommand#testActionKillCommandDate\n. For the complete list of flaky tests, see TEST-SUMMARY-FULL files.\n{color:green}+1 DISTRO{color}\n. {color:green}+1{color} distro tarball builds with the patch \n\n----------------------------\n{color:red}*-1 Overall result, please check the reported -1(s)*{color}\n\n{color:red}. There is at least one warning, please check{color}\n\nThe full100 8408 0 4892 100 3516 4864 3496 0:00:01 0:00:01 --:--:-- 4867
output of the test-patch run is available at\n\n. https://builds.apache.org/job/PreCommit-OOZIE-Build/894/\n\n","updateAuthor":{"self":"https://issues.apache.org/jira/rest/api/2/user?username=hadoopqa","name":"hadoopqa","key":"hadoopqa","avatarUrls":{"48x48":"https://issues.apache.org/jira/secure/useravatar?ownerId=hadoopqa&avatarId=10393","24x24":"https://issues.apache.org/jira/secure/useravatar?size=small&ownerId=hadoopqa&avatarId=10393","16x16":"https://issues.apache.org/jira/secure/useravatar?size=xsmall&ownerId=hadoopqa&avatarId=10393","32x32":"https://issues.apache.org/jira/secure/useravatar?size=medium&ownerId=hadoopqa&avatarId=10393"},"displayName":"Hadoop QA","active":true,"timeZone":"Etc/UTC"},"created":"2018-10-15T16:16:01.503+0000","updated":"2018-10-15T16:16:01.503+0000"}
test-patch exit code: 1
Build step 'Execute shell' marked build as failure
[description-setter] Description set: OOZIE-3369
Archiving artifacts
[Fast Archiver] Compressed 3.02 MB of artifacts by 36.2% relative to #889
Recording test results
ERROR: Step ?Publish JUnit test result report? failed: No test report files were found. Configuration error?
Email was triggered for: Failure - Any
Sending email for trigger: Failure - Any
###################################################################################
############################## FAILED TESTS (if any) ##############################
No tests ran.
Failed: OOZIE-3368 PreCommit Build #893
Posted by Apache Jenkins Server <je...@builds.apache.org>.
Jira: https://issues.apache.org/jira/browse/OOZIE-3368
Build: https://builds.apache.org/job/PreCommit-OOZIE-Build/893/
###################################################################################
########################## LAST 100 LINES OF THE CONSOLE ###########################
[...truncated 1.90 MB...]
[INFO] There are no new bugs found totally].
[TRACE] FindBugs diffs checked and reports created
[TRACE] Summary file size is 2561 bytes
[TRACE] Full summary file size is 1471 bytes
[TRACE] File [/home/jenkins/jenkins-slave/workspace/PreCommit-OOZIE-Build/test-patch/tmp/FINDBUGS_DIFF/diff/findbugs-diff-0.1.0-all.jar] removed
[TRACE] File [/home/jenkins/jenkins-slave/workspace/PreCommit-OOZIE-Build/test-patch/tmp/FINDBUGS_DIFF/diff/findbugs-diff-0.1.0-all.jar.md5sum] removed
Running test-patch task BACKWARDS_COMPATIBILITY
Running test-patch task TESTS
xargs: WARNING: a NUL character occurred in the input. It cannot be passed through in the argument list. Did you mean to use the --null option?
Running test-patch task DISTRO
Testing JIRA OOZIE-3368
Cleaning local git workspace
----------------------------
+1 PATCH_APPLIES
+1 CLEAN
-1 RAW_PATCH_ANALYSIS
+1 the patch does not introduce any @author tags
+1 the patch does not introduce any tabs
+1 the patch does not introduce any trailing spaces
+1 the patch does not introduce any star imports
+1 the patch does not introduce any line longer than 132
-1 the patch does not add/modify any testcase
+1 RAT
+1 the patch does not seem to introduce new RAT warnings
+1 JAVADOC
+1 Javadoc generation succeeded with the patch
+1 the patch does not seem to introduce new Javadoc warning(s)
WARNING: the current HEAD has 100 Javadoc warning(s)
+1 COMPILE
+1 HEAD compiles
+1 patch compiles
+1 the patch does not seem to introduce new javac warnings
+1 There are no new bugs found in total.
+1 There are no new bugs found in [fluent-job/fluent-job-api].
+1 There are no new bugs found in [client].
+1 There are no new bugs found in [docs].
+1 There are no new bugs found in [tools].
+1 There are no new bugs found in [webapp].
+1 There are no new bugs found in [core].
+1 There are no new bugs found in [server].
+1 There are no new bugs found in [sharelib/pig].
+1 There are no new bugs found in [sharelib/distcp].
+1 There are no new bugs found in [sharelib/hive2].
+1 There are no new bugs found in [sharelib/oozie].
+1 There are no new bugs found in [sharelib/hcatalog].
+1 There are no new bugs found in [sharelib/hive].
+1 There are no new bugs found in [sharelib/streaming].
+1 There are no new bugs found in [sharelib/git].
+1 There are no new bugs found in [sharelib/sqoop].
+1 There are no new bugs found in [sharelib/spark].
+1 There are no new bugs found in [examples].
+1 BACKWARDS_COMPATIBILITY
+1 the patch does not change any JPA Entity/Colum/Basic/Lob/Transient annotations
+1 the patch does not modify JPA files
-1 TESTS
Tests run : 3056
Tests failed : 0
Tests in error : 1
Tests timed out : 0
-1 [ERROR] There are [1] test errors in [zookeeper-security-tests]. Listing only the first [5] ones
testNewUsingACLs:org.apache.oozie.util.TestZKUtilsWithSecurity
Check console output for the full list of errors/failures
Tests failed at first run:
TestSubWorkflowActionExecutor#testSubWorkflowRerun
TestCoordActionsKillXCommand#testActionKillCommandActionNumbers
For the complete list of flaky tests, see TEST-SUMMARY-FULL files.
+1 DISTRO
+1 distro tarball builds with the patch
----------------------------
-1 Overall result, please check the reported -1(s)
There is at least one warning, please check
The full output of the test-patch run is available at
https://builds.apache.org/job/PreCommit-OOZIE-Build/893/
Adding comment to JIRA
% Total % Received % Xferd Average Speed Time Time Time Current
Dload Upload Total Spent Left Speed
0 0 0 0 0 0 0 0 --:--:-- --:--:-- --:--:-- 0 0 3858 0 0 0 0 0 0 --:--:-- --:--:-- --:--:-- 0{"self":"https://issues.apache.org/jira/rest/api/2/issue/13191379/comment/16648977","id":"16648977","author":{"self":"https://issues.apache.org/jira/rest/api/2/user?username=hadoopqa","name":"hadoopqa","key":"hadoopqa","avatarUrls":{"48x48":"https://issues.apache.org/jira/secure/useravatar?ownerId=hadoopqa&avatarId=10393","24x24":"https://issues.apache.org/jira/secure/useravatar?size=small&ownerId=hadoopqa&avatarId=10393","16x16":"https://issues.apache.org/jira/secure/useravatar?size=xsmall&ownerId=hadoopqa&avatarId=10393","32x32":"https://issues.apache.org/jira/secure/useravatar?size=medium&ownerId=hadoopqa&avatarId=10393"},"displayName":"Hadoop QA","active":true,"timeZone":"Etc/UTC"},"body":"\nTesting JIRA OOZIE-3368\n\nCleaning local git workspace\n\n----------------------------\n\n{color:green}+1 PATCH_APPLIES{color}\n{color:green}+1 CLEAN{color}\n{color:red}-1 RAW_PATCH_ANALYSIS{color}\n. {color:green}+1{color} the patch does not introduce any @author tags\n. {color:green}+1{color} the patch does not introduce any tabs\n. {color:green}+1{color} the patch does not introduce any trailing spaces\n. {color:green}+1{color} the patch does not introduce any star imports\n. {color:green}+1{color} the patch does not introduce any line longer than 132\n. {color:red}-1{color} the patch does not add/modify any testcase\n{color:green}+1 RAT{color}\n. {color:green}+1{color} the patch does not seem to introduce new RAT warnings\n{color:green}+1 JAVADOC{color}\n. {color:green}+1{color} Javadoc generation succeeded with the patch\n. {color:green}+1{color} the patch does not seem to introduce new Javadoc warning(s)\n. {color:orange}WARNING{color}: the current HEAD has 100 Javadoc warning(s)\n{color:green}+1 COMPILE{color}\n. {color:green}+1{color} HEAD compiles\n. {color:green}+1{color} patch compiles\n. {color:green}+1{color} the patch does not seem to introduce new javac warnings\n{color:green}+1{color} There are no new bugs found in total.\n. {color:green}+1{color} There are no new bugs found in [fluent-job/fluent-job-api].\n. {color:green}+1{color} There are no new bugs found in [client].\n. {color:green}+1{color} There are no new bugs found in [docs].\n. {color:green}+1{color} There are no new bugs found in [tools].\n. {color:green}+1{color} There are no new bugs found in [webapp].\n. {color:green}+1{color} There are no new bugs found in [core].\n. {color:green}+1{color} There are no new bugs found in [server].\n. {color:green}+1{color} There are no new bugs found in [sharelib/pig].\n. {color:green}+1{color} There are no new bugs found in [sharelib/distcp].\n. {color:green}+1{color} There are no new bugs found in [sharelib/hive2].\n. {color:green}+1{color} There are no new bugs found in [sharelib/oozie].\n. {color:green}+1{color} There are no new bugs found in [sharelib/hcatalog].\n. {color:green}+1{color} There are no new bugs found in [sharelib/hive].\n. {color:green}+1{color} There are no new bugs found in [sharelib/streaming].\n. {color:green}+1{color} There are no new bugs found in [sharelib/git].\n. {color:green}+1{color} There are no new bugs found in [sharelib/sqoop].\n. {color:green}+1{color} There are no new bugs found in [sharelib/spark].\n. {color:green}+1{color} There are no new bugs found in [examples].\n{color:green}+1 BACKWARDS_COMPATIBILITY{color}\n. {color:green}+1{color} the patch does not change any JPA Entity/Colum/Basic/Lob/Transient annotations\n. {color:green}+1{color} the patch does not modify JPA files\n{color:red}-1 TESTS{color}\n. Tests run : 3056\n. Tests failed : 0\n. Tests in error : 1\n. Tests timed out : 0\n\n{color:red}-1{color} [ERROR] There are [1] test errors in [zookeeper-security-tests]. Listing only the first [5] ones\ntestNewUsingACLs:org.apache.oozie.util.TestZKUtilsWithSecurity\n\nCheck console output for the full list of errors/failures\n. {color:orange}Tests failed at first run:{color}\nTestSubWorkflowActionExecutor#testSubWorkflowRerun\nTestCoordActionsKillXCommand#testActionKillCommandActionNumbers\n. For t100 9092 0 5234 100 3858 6291 4637 --:--:-- --:--:-- --:--:-- 6290
he complete list of flaky tests, see TEST-SUMMARY-FULL files.\n{color:green}+1 DISTRO{color}\n. {color:green}+1{color} distro tarball builds with the patch \n\n----------------------------\n{color:red}*-1 Overall result, please check the reported -1(s)*{color}\n\n{color:red}. There is at least one warning, please check{color}\n\nThe full output of the test-patch run is available at\n\n. https://builds.apache.org/job/PreCommit-OOZIE-Build/893/\n\n","updateAuthor":{"self":"https://issues.apache.org/jira/rest/api/2/user?username=hadoopqa","name":"hadoopqa","key":"hadoopqa","avatarUrls":{"48x48":"https://issues.apache.org/jira/secure/useravatar?ownerId=hadoopqa&avatarId=10393","24x24":"https://issues.apache.org/jira/secure/useravatar?size=small&ownerId=hadoopqa&avatarId=10393","16x16":"https://issues.apache.org/jira/secure/useravatar?size=xsmall&ownerId=hadoopqa&avatarId=10393","32x32":"https://issues.apache.org/jira/secure/useravatar?size=medium&ownerId=hadoopqa&avatarId=10393"},"displayName":"Hadoop QA","active":true,"timeZone":"Etc/UTC"},"created":"2018-10-13T14:28:47.399+0000","updated":"2018-10-13T14:28:47.399+0000"}
test-patch exit code: 1
Build step 'Execute shell' marked build as failure
[description-setter] Description set: OOZIE-3368
Archiving artifacts
[Fast Archiver] Compressed 2.93 MB of artifacts by 50.1% relative to #889
Recording test results
Email was triggered for: Failure - Any
Sending email for trigger: Failure - Any
###################################################################################
############################## FAILED TESTS (if any) ##############################
1 tests failed.
FAILED: org.apache.oozie.util.TestZKUtilsWithSecurity.testNewUsingACLs
Error Message:
Call From asf915.gq1.ygridcore.net/67.195.81.159 to localhost:37707 failed on connection exception: java.net.ConnectException: Connection refused; For more details see: http://wiki.apache.org/hadoop/ConnectionRefused
Stack Trace:
java.net.ConnectException: Call From asf915.gq1.ygridcore.net/67.195.81.159 to localhost:37707 failed on connection exception: java.net.ConnectException: Connection refused; For more details see: http://wiki.apache.org/hadoop/ConnectionRefused
at sun.reflect.NativeConstructorAccessorImpl.newInstance0(Native Method)
at sun.reflect.NativeConstructorAccessorImpl.newInstance(NativeConstructorAccessorImpl.java:62)
at sun.reflect.DelegatingConstructorAccessorImpl.newInstance(DelegatingConstructorAccessorImpl.java:45)
at java.lang.reflect.Constructor.newInstance(Constructor.java:423)
at org.apache.hadoop.net.NetUtils.wrapWithMessage(NetUtils.java:791)
at org.apache.hadoop.net.NetUtils.wrapException(NetUtils.java:731)
at org.apache.hadoop.ipc.Client.call(Client.java:1472)
at org.apache.hadoop.ipc.Client.call(Client.java:1399)
at org.apache.hadoop.ipc.ProtobufRpcEngine$Invoker.invoke(ProtobufRpcEngine.java:232)
at com.sun.proxy.$Proxy15.getFileInfo(Unknown Source)
at org.apache.hadoop.hdfs.protocolPB.ClientNamenodeProtocolTranslatorPB.getFileInfo(ClientNamenodeProtocolTranslatorPB.java:752)
at sun.reflect.NativeMethodAccessorImpl.invoke0(Native Method)
at sun.reflect.NativeMethodAccessorImpl.invoke(NativeMethodAccessorImpl.java:62)
at sun.reflect.DelegatingMethodAccessorImpl.invoke(DelegatingMethodAccessorImpl.java:43)
at java.lang.reflect.Method.invoke(Method.java:498)
at org.apache.hadoop.io.retry.RetryInvocationHandler.invokeMethod(RetryInvocationHandler.java:187)
at org.apache.hadoop.io.retry.RetryInvocationHandler.invoke(RetryInvocationHandler.java:102)
at com.sun.proxy.$Proxy16.getFileInfo(Unknown Source)
at org.apache.hadoop.hdfs.DFSClient.getFileInfo(DFSClient.java:1988)
at org.apache.hadoop.hdfs.DistributedFileSystem$18.doCall(DistributedFileSystem.java:1118)
at org.apache.hadoop.hdfs.DistributedFileSystem$18.doCall(DistributedFileSystem.java:1114)
at org.apache.hadoop.fs.FileSystemLinkResolver.resolve(FileSystemLinkResolver.java:81)
at org.apache.hadoop.hdfs.DistributedFileSystem.getFileStatus(DistributedFileSystem.java:1114)
at org.apache.hadoop.fs.FileSystem.exists(FileSystem.java:1400)
at org.apache.oozie.test.XFsTestCase.initFileSystem(XFsTestCase.java:92)
at org.apache.oozie.test.XFsTestCase.setUp(XFsTestCase.java:81)
at org.apache.oozie.test.XHCatTestCase.setUp(XHCatTestCase.java:42)
at org.apache.oozie.test.ZKXTestCase.setUp(ZKXTestCase.java:70)
at org.apache.oozie.test.ZKXTestCaseWithSecurity.setUp(ZKXTestCaseWithSecurity.java:53)
at org.apache.oozie.util.TestZKUtilsWithSecurity.setUp(TestZKUtilsWithSecurity.java:36)
at junit.framework.TestCase.runBare(TestCase.java:139)
at junit.framework.TestResult$1.protect(TestResult.java:122)
at junit.framework.TestResult.runProtected(TestResult.java:142)
at junit.framework.TestResult.run(TestResult.java:125)
at junit.framework.TestCase.run(TestCase.java:129)
at junit.framework.TestSuite.runTest(TestSuite.java:255)
at junit.framework.TestSuite.run(TestSuite.java:250)
at org.junit.internal.runners.JUnit38ClassRunner.run(JUnit38ClassRunner.java:84)
at org.junit.runners.Suite.runChild(Suite.java:127)
at org.junit.runners.Suite.runChild(Suite.java:26)
at org.junit.runners.ParentRunner$3.run(ParentRunner.java:238)
at org.junit.runners.ParentRunner$1.schedule(ParentRunner.java:63)
at org.junit.runners.ParentRunner.runChildren(ParentRunner.java:236)
at org.junit.runners.ParentRunner.access$000(ParentRunner.java:53)
at org.junit.runners.ParentRunner$2.evaluate(ParentRunner.java:229)
at org.junit.runners.ParentRunner.run(ParentRunner.java:309)
at org.junit.runners.Suite.runChild(Suite.java:127)
at org.junit.runners.Suite.runChild(Suite.java:26)
at org.junit.runners.ParentRunner$3.run(ParentRunner.java:238)
at org.apache.maven.surefire.junitcore.pc.Scheduler$1.run(Scheduler.java:410)
at org.apache.maven.surefire.junitcore.pc.InvokerStrategy.schedule(InvokerStrategy.java:54)
at org.apache.maven.surefire.junitcore.pc.Scheduler.schedule(Scheduler.java:367)
at org.junit.runners.ParentRunner.runChildren(ParentRunner.java:236)
at org.junit.runners.ParentRunner.access$000(ParentRunner.java:53)
at org.junit.runners.ParentRunner$2.evaluate(ParentRunner.java:229)
at org.junit.runners.ParentRunner.run(ParentRunner.java:309)
at org.apache.maven.surefire.junitcore.pc.ParallelComputerBuilder$PC$1.run(ParallelComputerBuilder.java:593)
at org.apache.maven.surefire.junitcore.JUnitCore.run(JUnitCore.java:55)
at org.apache.maven.surefire.junitcore.JUnitCoreWrapper.createRequestAndRun(JUnitCoreWrapper.java:137)
at org.apache.maven.surefire.junitcore.JUnitCoreWrapper.executeEager(JUnitCoreWrapper.java:107)
at org.apache.maven.surefire.junitcore.JUnitCoreWrapper.execute(JUnitCoreWrapper.java:83)
at org.apache.maven.surefire.junitcore.JUnitCoreWrapper.execute(JUnitCoreWrapper.java:75)
at org.apache.maven.surefire.junitcore.JUnitCoreProvider.invoke(JUnitCoreProvider.java:159)
at org.apache.maven.surefire.booter.ForkedBooter.invokeProviderInSameClassLoader(ForkedBooter.java:373)
at org.apache.maven.surefire.booter.ForkedBooter.runSuitesInProcess(ForkedBooter.java:334)
at org.apache.maven.surefire.booter.ForkedBooter.execute(ForkedBooter.java:119)
at org.apache.maven.surefire.booter.ForkedBooter.main(ForkedBooter.java:407)
Caused by: java.net.ConnectException: Connection refused
at sun.nio.ch.SocketChannelImpl.checkConnect(Native Method)
at sun.nio.ch.SocketChannelImpl.finishConnect(SocketChannelImpl.java:717)
at org.apache.hadoop.net.SocketIOWithTimeout.connect(SocketIOWithTimeout.java:206)
at org.apache.hadoop.net.NetUtils.connect(NetUtils.java:530)
at org.apache.hadoop.net.NetUtils.connect(NetUtils.java:494)
at org.apache.hadoop.ipc.Client$Connection.setupConnection(Client.java:607)
at org.apache.hadoop.ipc.Client$Connection.setupIOstreams(Client.java:705)
at org.apache.hadoop.ipc.Client$Connection.access$2800(Client.java:368)
at org.apache.hadoop.ipc.Client.getConnection(Client.java:1521)
at org.apache.hadoop.ipc.Client.call(Client.java:1438)
... 60 more