You are viewing a plain text version of this content. The canonical link for it is here.
Posted to dev@lucene.apache.org by Policeman Jenkins Server <je...@thetaphi.de> on 2014/01/07 03:32:48 UTC
[JENKINS] Lucene-Solr-trunk-Linux (64bit/jdk1.7.0_60-ea-b02) -
Build # 8992 - Failure!
Build: http://jenkins.thetaphi.de/job/Lucene-Solr-trunk-Linux/8992/
Java: 64bit/jdk1.7.0_60-ea-b02 -XX:-UseCompressedOops -XX:+UseConcMarkSweepGC
1 tests failed.
REGRESSION: org.apache.solr.cloud.CollectionsAPIDistributedZkTest.testDistribSearch
Error Message:
Stack Trace:
java.lang.AssertionError
at __randomizedtesting.SeedInfo.seed([B8E15445FEB7CCB2:3907DA5D89E8AC8E]:0)
at org.junit.Assert.fail(Assert.java:92)
at org.junit.Assert.assertTrue(Assert.java:43)
at org.junit.Assert.assertFalse(Assert.java:68)
at org.junit.Assert.assertFalse(Assert.java:79)
at org.apache.solr.cloud.CollectionsAPIDistributedZkTest.deleteCollectionWithDownNodes(CollectionsAPIDistributedZkTest.java:390)
at org.apache.solr.cloud.CollectionsAPIDistributedZkTest.doTest(CollectionsAPIDistributedZkTest.java:203)
at org.apache.solr.BaseDistributedSearchTestCase.testDistribSearch(BaseDistributedSearchTestCase.java:867)
at sun.reflect.NativeMethodAccessorImpl.invoke0(Native Method)
at sun.reflect.NativeMethodAccessorImpl.invoke(NativeMethodAccessorImpl.java:57)
at sun.reflect.DelegatingMethodAccessorImpl.invoke(DelegatingMethodAccessorImpl.java:43)
at java.lang.reflect.Method.invoke(Method.java:606)
at com.carrotsearch.randomizedtesting.RandomizedRunner.invoke(RandomizedRunner.java:1559)
at com.carrotsearch.randomizedtesting.RandomizedRunner.access$600(RandomizedRunner.java:79)
at com.carrotsearch.randomizedtesting.RandomizedRunner$6.evaluate(RandomizedRunner.java:737)
at com.carrotsearch.randomizedtesting.RandomizedRunner$7.evaluate(RandomizedRunner.java:773)
at com.carrotsearch.randomizedtesting.RandomizedRunner$8.evaluate(RandomizedRunner.java:787)
at com.carrotsearch.randomizedtesting.rules.SystemPropertiesRestoreRule$1.evaluate(SystemPropertiesRestoreRule.java:53)
at org.apache.lucene.util.TestRuleSetupTeardownChained$1.evaluate(TestRuleSetupTeardownChained.java:50)
at org.apache.lucene.util.TestRuleFieldCacheSanity$1.evaluate(TestRuleFieldCacheSanity.java:51)
at org.apache.lucene.util.AbstractBeforeAfterRule$1.evaluate(AbstractBeforeAfterRule.java:46)
at com.carrotsearch.randomizedtesting.rules.SystemPropertiesInvariantRule$1.evaluate(SystemPropertiesInvariantRule.java:55)
at org.apache.lucene.util.TestRuleThreadAndTestName$1.evaluate(TestRuleThreadAndTestName.java:49)
at org.apache.lucene.util.TestRuleIgnoreAfterMaxFailures$1.evaluate(TestRuleIgnoreAfterMaxFailures.java:70)
at org.apache.lucene.util.TestRuleMarkFailure$1.evaluate(TestRuleMarkFailure.java:48)
at com.carrotsearch.randomizedtesting.rules.StatementAdapter.evaluate(StatementAdapter.java:36)
at com.carrotsearch.randomizedtesting.ThreadLeakControl$StatementRunner.run(ThreadLeakControl.java:358)
at com.carrotsearch.randomizedtesting.ThreadLeakControl.forkTimeoutingTask(ThreadLeakControl.java:782)
at com.carrotsearch.randomizedtesting.ThreadLeakControl$3.evaluate(ThreadLeakControl.java:442)
at com.carrotsearch.randomizedtesting.RandomizedRunner.runSingleTest(RandomizedRunner.java:746)
at com.carrotsearch.randomizedtesting.RandomizedRunner$3.evaluate(RandomizedRunner.java:648)
at com.carrotsearch.randomizedtesting.RandomizedRunner$4.evaluate(RandomizedRunner.java:682)
at com.carrotsearch.randomizedtesting.RandomizedRunner$5.evaluate(RandomizedRunner.java:693)
at com.carrotsearch.randomizedtesting.rules.StatementAdapter.evaluate(StatementAdapter.java:36)
at com.carrotsearch.randomizedtesting.rules.SystemPropertiesRestoreRule$1.evaluate(SystemPropertiesRestoreRule.java:53)
at org.apache.lucene.util.AbstractBeforeAfterRule$1.evaluate(AbstractBeforeAfterRule.java:46)
at org.apache.lucene.util.TestRuleStoreClassName$1.evaluate(TestRuleStoreClassName.java:42)
at com.carrotsearch.randomizedtesting.rules.SystemPropertiesInvariantRule$1.evaluate(SystemPropertiesInvariantRule.java:55)
at com.carrotsearch.randomizedtesting.rules.NoShadowingOrOverridesOnMethodsRule$1.evaluate(NoShadowingOrOverridesOnMethodsRule.java:39)
at com.carrotsearch.randomizedtesting.rules.NoShadowingOrOverridesOnMethodsRule$1.evaluate(NoShadowingOrOverridesOnMethodsRule.java:39)
at com.carrotsearch.randomizedtesting.rules.StatementAdapter.evaluate(StatementAdapter.java:36)
at org.apache.lucene.util.TestRuleAssertionsRequired$1.evaluate(TestRuleAssertionsRequired.java:43)
at org.apache.lucene.util.TestRuleMarkFailure$1.evaluate(TestRuleMarkFailure.java:48)
at org.apache.lucene.util.TestRuleIgnoreAfterMaxFailures$1.evaluate(TestRuleIgnoreAfterMaxFailures.java:70)
at org.apache.lucene.util.TestRuleIgnoreTestSuites$1.evaluate(TestRuleIgnoreTestSuites.java:55)
at com.carrotsearch.randomizedtesting.rules.StatementAdapter.evaluate(StatementAdapter.java:36)
at com.carrotsearch.randomizedtesting.ThreadLeakControl$StatementRunner.run(ThreadLeakControl.java:358)
at java.lang.Thread.run(Thread.java:744)
Build Log:
[...truncated 10506 lines...]
[junit4] Suite: org.apache.solr.cloud.CollectionsAPIDistributedZkTest
[junit4] 2> 825629 T2051 oas.BaseDistributedSearchTestCase.initHostContext Setting hostContext system property: /_p/
[junit4] 2> 825632 T2051 oas.SolrTestCaseJ4.setUp ###Starting testDistribSearch
[junit4] 2> Creating dataDir: /mnt/ssd/jenkins/workspace/Lucene-Solr-trunk-Linux/solr/build/solr-core/test/J1/./solrtest-CollectionsAPIDistributedZkTest-1389061295721
[junit4] 2> 825633 T2051 oasc.ZkTestServer.run STARTING ZK TEST SERVER
[junit4] 2> 825633 T2052 oasc.ZkTestServer$ZKServerMain.runFromConfig Starting server
[junit4] 2> 825733 T2051 oasc.ZkTestServer.run start zk server on port:55169
[junit4] 2> 825734 T2051 oascc.ConnectionManager.waitForConnected Waiting for client to connect to ZooKeeper
[junit4] 2> 825804 T2058 oascc.ConnectionManager.process Watcher org.apache.solr.common.cloud.ConnectionManager@22a42a56 name:ZooKeeperConnection Watcher:127.0.0.1:55169 got event WatchedEvent state:SyncConnected type:None path:null path:null type:None
[junit4] 2> 825804 T2051 oascc.ConnectionManager.waitForConnected Client is connected to ZooKeeper
[junit4] 2> 825804 T2051 oascc.SolrZkClient.makePath makePath: /solr
[junit4] 2> 825809 T2051 oascc.ConnectionManager.waitForConnected Waiting for client to connect to ZooKeeper
[junit4] 2> 825810 T2060 oascc.ConnectionManager.process Watcher org.apache.solr.common.cloud.ConnectionManager@2d5cd0d7 name:ZooKeeperConnection Watcher:127.0.0.1:55169/solr got event WatchedEvent state:SyncConnected type:None path:null path:null type:None
[junit4] 2> 825811 T2051 oascc.ConnectionManager.waitForConnected Client is connected to ZooKeeper
[junit4] 2> 825811 T2051 oascc.SolrZkClient.makePath makePath: /collections/collection1
[junit4] 2> 825814 T2051 oascc.SolrZkClient.makePath makePath: /collections/collection1/shards
[junit4] 2> 825816 T2051 oascc.SolrZkClient.makePath makePath: /collections/control_collection
[junit4] 2> 825818 T2051 oascc.SolrZkClient.makePath makePath: /collections/control_collection/shards
[junit4] 2> 825820 T2051 oasc.AbstractZkTestCase.putConfig put /mnt/ssd/jenkins/workspace/Lucene-Solr-trunk-Linux/solr/build/solr-core/test-files/solr/collection1/conf/solrconfig-tlog.xml to /configs/conf1/solrconfig.xml
[junit4] 2> 825820 T2051 oascc.SolrZkClient.makePath makePath: /configs/conf1/solrconfig.xml
[junit4] 2> 825824 T2051 oasc.AbstractZkTestCase.putConfig put /mnt/ssd/jenkins/workspace/Lucene-Solr-trunk-Linux/solr/build/solr-core/test-files/solr/collection1/conf/schema.xml to /configs/conf1/schema.xml
[junit4] 2> 825825 T2051 oascc.SolrZkClient.makePath makePath: /configs/conf1/schema.xml
[junit4] 2> 825828 T2051 oasc.AbstractZkTestCase.putConfig put /mnt/ssd/jenkins/workspace/Lucene-Solr-trunk-Linux/solr/build/solr-core/test-files/solr/collection1/conf/solrconfig.snippet.randomindexconfig.xml to /configs/conf1/solrconfig.snippet.randomindexconfig.xml
[junit4] 2> 825828 T2051 oascc.SolrZkClient.makePath makePath: /configs/conf1/solrconfig.snippet.randomindexconfig.xml
[junit4] 2> 825831 T2051 oasc.AbstractZkTestCase.putConfig put /mnt/ssd/jenkins/workspace/Lucene-Solr-trunk-Linux/solr/build/solr-core/test-files/solr/collection1/conf/stopwords.txt to /configs/conf1/stopwords.txt
[junit4] 2> 825831 T2051 oascc.SolrZkClient.makePath makePath: /configs/conf1/stopwords.txt
[junit4] 2> 825833 T2051 oasc.AbstractZkTestCase.putConfig put /mnt/ssd/jenkins/workspace/Lucene-Solr-trunk-Linux/solr/build/solr-core/test-files/solr/collection1/conf/protwords.txt to /configs/conf1/protwords.txt
[junit4] 2> 825834 T2051 oascc.SolrZkClient.makePath makePath: /configs/conf1/protwords.txt
[junit4] 2> 825836 T2051 oasc.AbstractZkTestCase.putConfig put /mnt/ssd/jenkins/workspace/Lucene-Solr-trunk-Linux/solr/build/solr-core/test-files/solr/collection1/conf/currency.xml to /configs/conf1/currency.xml
[junit4] 2> 825836 T2051 oascc.SolrZkClient.makePath makePath: /configs/conf1/currency.xml
[junit4] 2> 825838 T2051 oasc.AbstractZkTestCase.putConfig put /mnt/ssd/jenkins/workspace/Lucene-Solr-trunk-Linux/solr/build/solr-core/test-files/solr/collection1/conf/enumsConfig.xml to /configs/conf1/enumsConfig.xml
[junit4] 2> 825838 T2051 oascc.SolrZkClient.makePath makePath: /configs/conf1/enumsConfig.xml
[junit4] 2> 825842 T2051 oasc.AbstractZkTestCase.putConfig put /mnt/ssd/jenkins/workspace/Lucene-Solr-trunk-Linux/solr/build/solr-core/test-files/solr/collection1/conf/open-exchange-rates.json to /configs/conf1/open-exchange-rates.json
[junit4] 2> 825842 T2051 oascc.SolrZkClient.makePath makePath: /configs/conf1/open-exchange-rates.json
[junit4] 2> 825846 T2051 oasc.AbstractZkTestCase.putConfig put /mnt/ssd/jenkins/workspace/Lucene-Solr-trunk-Linux/solr/build/solr-core/test-files/solr/collection1/conf/mapping-ISOLatin1Accent.txt to /configs/conf1/mapping-ISOLatin1Accent.txt
[junit4] 2> 825846 T2051 oascc.SolrZkClient.makePath makePath: /configs/conf1/mapping-ISOLatin1Accent.txt
[junit4] 2> 825849 T2051 oasc.AbstractZkTestCase.putConfig put /mnt/ssd/jenkins/workspace/Lucene-Solr-trunk-Linux/solr/build/solr-core/test-files/solr/collection1/conf/old_synonyms.txt to /configs/conf1/old_synonyms.txt
[junit4] 2> 825849 T2051 oascc.SolrZkClient.makePath makePath: /configs/conf1/old_synonyms.txt
[junit4] 2> 825851 T2051 oasc.AbstractZkTestCase.putConfig put /mnt/ssd/jenkins/workspace/Lucene-Solr-trunk-Linux/solr/build/solr-core/test-files/solr/collection1/conf/synonyms.txt to /configs/conf1/synonyms.txt
[junit4] 2> 825852 T2051 oascc.SolrZkClient.makePath makePath: /configs/conf1/synonyms.txt
[junit4] 2> Using new style solr.xml
[junit4] 2> 825855 T2051 oascc.ConnectionManager.waitForConnected Waiting for client to connect to ZooKeeper
[junit4] 2> 825856 T2062 oascc.ConnectionManager.process Watcher org.apache.solr.common.cloud.ConnectionManager@7e779e5d name:ZooKeeperConnection Watcher:127.0.0.1:55169 got event WatchedEvent state:SyncConnected type:None path:null path:null type:None
[junit4] 2> 825856 T2051 oascc.ConnectionManager.waitForConnected Client is connected to ZooKeeper
[junit4] 2> 825857 T2051 oascc.SolrZkClient.makePath makePath: /solr
[junit4] 2> 825859 T2051 oascc.ConnectionManager.waitForConnected Waiting for client to connect to ZooKeeper
[junit4] 2> 825860 T2064 oascc.ConnectionManager.process Watcher org.apache.solr.common.cloud.ConnectionManager@d3d58b7 name:ZooKeeperConnection Watcher:127.0.0.1:55169/solr got event WatchedEvent state:SyncConnected type:None path:null path:null type:None
[junit4] 2> 825861 T2051 oascc.ConnectionManager.waitForConnected Client is connected to ZooKeeper
[junit4] 2> 825861 T2051 oasc.AbstractZkTestCase.putConfig put /mnt/ssd/jenkins/workspace/Lucene-Solr-trunk-Linux/solr/build/solr-core/test-files/solr/collection1/conf/solrconfig.xml to /configs/conf2/solrconfig.xml
[junit4] 2> 825862 T2051 oascc.SolrZkClient.makePath makePath: /configs/conf2/solrconfig.xml
[junit4] 2> 825865 T2051 oasc.AbstractZkTestCase.putConfig put /mnt/ssd/jenkins/workspace/Lucene-Solr-trunk-Linux/solr/build/solr-core/test-files/solr/collection1/conf/schema.xml to /configs/conf2/schema.xml
[junit4] 2> 825865 T2051 oascc.SolrZkClient.makePath makePath: /configs/conf2/schema.xml
[junit4] 2> 825868 T2051 oasc.AbstractZkTestCase.putConfig put /mnt/ssd/jenkins/workspace/Lucene-Solr-trunk-Linux/solr/build/solr-core/test-files/solr/collection1/conf/solrconfig.snippet.randomindexconfig.xml to /configs/conf2/solrconfig.snippet.randomindexconfig.xml
[junit4] 2> 825868 T2051 oascc.SolrZkClient.makePath makePath: /configs/conf2/solrconfig.snippet.randomindexconfig.xml
[junit4] 2> 825871 T2051 oasc.AbstractZkTestCase.putConfig put /mnt/ssd/jenkins/workspace/Lucene-Solr-trunk-Linux/solr/build/solr-core/test-files/solr/collection1/conf/stopwords.txt to /configs/conf2/stopwords.txt
[junit4] 2> 825871 T2051 oascc.SolrZkClient.makePath makePath: /configs/conf2/stopwords.txt
[junit4] 2> 825873 T2051 oasc.AbstractZkTestCase.putConfig put /mnt/ssd/jenkins/workspace/Lucene-Solr-trunk-Linux/solr/build/solr-core/test-files/solr/collection1/conf/protwords.txt to /configs/conf2/protwords.txt
[junit4] 2> 825874 T2051 oascc.SolrZkClient.makePath makePath: /configs/conf2/protwords.txt
[junit4] 2> 825876 T2051 oasc.AbstractZkTestCase.putConfig put /mnt/ssd/jenkins/workspace/Lucene-Solr-trunk-Linux/solr/build/solr-core/test-files/solr/collection1/conf/currency.xml to /configs/conf2/currency.xml
[junit4] 2> 825877 T2051 oascc.SolrZkClient.makePath makePath: /configs/conf2/currency.xml
[junit4] 2> 825880 T2051 oasc.AbstractZkTestCase.putConfig put /mnt/ssd/jenkins/workspace/Lucene-Solr-trunk-Linux/solr/build/solr-core/test-files/solr/collection1/conf/open-exchange-rates.json to /configs/conf2/open-exchange-rates.json
[junit4] 2> 825881 T2051 oascc.SolrZkClient.makePath makePath: /configs/conf2/open-exchange-rates.json
[junit4] 2> 825886 T2051 oasc.AbstractZkTestCase.putConfig put /mnt/ssd/jenkins/workspace/Lucene-Solr-trunk-Linux/solr/build/solr-core/test-files/solr/collection1/conf/mapping-ISOLatin1Accent.txt to /configs/conf2/mapping-ISOLatin1Accent.txt
[junit4] 2> 825887 T2051 oascc.SolrZkClient.makePath makePath: /configs/conf2/mapping-ISOLatin1Accent.txt
[junit4] 2> 825892 T2051 oasc.AbstractZkTestCase.putConfig put /mnt/ssd/jenkins/workspace/Lucene-Solr-trunk-Linux/solr/build/solr-core/test-files/solr/collection1/conf/old_synonyms.txt to /configs/conf2/old_synonyms.txt
[junit4] 2> 825892 T2051 oascc.SolrZkClient.makePath makePath: /configs/conf2/old_synonyms.txt
[junit4] 2> 825897 T2051 oasc.AbstractZkTestCase.putConfig put /mnt/ssd/jenkins/workspace/Lucene-Solr-trunk-Linux/solr/build/solr-core/test-files/solr/collection1/conf/synonyms.txt to /configs/conf2/synonyms.txt
[junit4] 2> 825897 T2051 oascc.SolrZkClient.makePath makePath: /configs/conf2/synonyms.txt
[junit4] 2> 825902 T2051 oasc.AbstractZkTestCase.putConfig put /mnt/ssd/jenkins/workspace/Lucene-Solr-trunk-Linux/solr/build/solr-core/test-files/solr/collection1/conf/elevate.xml to /configs/conf2/elevate.xml
[junit4] 2> 825902 T2051 oascc.SolrZkClient.makePath makePath: /configs/conf2/elevate.xml
[junit4] 2> 826000 T2051 oejs.Server.doStart jetty-8.1.10.v20130312
[junit4] 2> 826004 T2051 oejs.AbstractConnector.doStart Started SelectChannelConnector@127.0.0.1:50556
[junit4] 2> 826004 T2051 oass.SolrDispatchFilter.init SolrDispatchFilter.init()
[junit4] 2> 826005 T2051 oasc.SolrResourceLoader.locateSolrHome JNDI not configured for solr (NoInitialContextEx)
[junit4] 2> 826005 T2051 oasc.SolrResourceLoader.locateSolrHome using system property solr.solr.home: ./org.apache.solr.cloud.CollectionsAPIDistributedZkTest-controljetty-1389061295997
[junit4] 2> 826006 T2051 oasc.SolrResourceLoader.<init> new SolrResourceLoader for directory: './org.apache.solr.cloud.CollectionsAPIDistributedZkTest-controljetty-1389061295997/'
[junit4] 2> 826017 T2051 oasc.ConfigSolr.fromFile Loading container configuration from /mnt/ssd/jenkins/workspace/Lucene-Solr-trunk-Linux/solr/build/solr-core/test/J1/./org.apache.solr.cloud.CollectionsAPIDistributedZkTest-controljetty-1389061295997/solr.xml
[junit4] 2> 826043 T2051 oasc.ConfigSolrXml.<init> Config-defined core root directory:
[junit4] 2> 826044 T2051 oasc.CoreContainer.<init> New CoreContainer 1501505596
[junit4] 2> 826044 T2051 oasc.CoreContainer.load Loading cores into CoreContainer [instanceDir=./org.apache.solr.cloud.CollectionsAPIDistributedZkTest-controljetty-1389061295997/]
[junit4] 2> 826044 T2051 oashc.HttpShardHandlerFactory.getParameter Setting socketTimeout to: 90000
[junit4] 2> 826044 T2051 oashc.HttpShardHandlerFactory.getParameter Setting urlScheme to: http://
[junit4] 2> 826045 T2051 oashc.HttpShardHandlerFactory.getParameter Setting connTimeout to: 15000
[junit4] 2> 826045 T2051 oashc.HttpShardHandlerFactory.getParameter Setting maxConnectionsPerHost to: 20
[junit4] 2> 826045 T2051 oashc.HttpShardHandlerFactory.getParameter Setting corePoolSize to: 0
[junit4] 2> 826045 T2051 oashc.HttpShardHandlerFactory.getParameter Setting maximumPoolSize to: 2147483647
[junit4] 2> 826046 T2051 oashc.HttpShardHandlerFactory.getParameter Setting maxThreadIdleTime to: 5
[junit4] 2> 826046 T2051 oashc.HttpShardHandlerFactory.getParameter Setting sizeOfQueue to: -1
[junit4] 2> 826046 T2051 oashc.HttpShardHandlerFactory.getParameter Setting fairnessPolicy to: false
[junit4] 2> 826048 T2051 oasl.LogWatcher.createWatcher SLF4J impl is org.slf4j.impl.Log4jLoggerFactory
[junit4] 2> 826048 T2051 oasl.LogWatcher.newRegisteredLogWatcher Registering Log Listener [Log4j (org.slf4j.impl.Log4jLoggerFactory)]
[junit4] 2> 826048 T2051 oasc.CoreContainer.load Host Name: 127.0.0.1
[junit4] 2> 826049 T2051 oasc.ZkContainer.initZooKeeper Zookeeper client=127.0.0.1:55169/solr
[junit4] 2> 826049 T2051 oasc.ZkController.checkChrootPath zkHost includes chroot
[junit4] 2> 826050 T2051 oascc.ConnectionManager.waitForConnected Waiting for client to connect to ZooKeeper
[junit4] 2> 826052 T2075 oascc.ConnectionManager.process Watcher org.apache.solr.common.cloud.ConnectionManager@2b2aa90b name:ZooKeeperConnection Watcher:127.0.0.1:55169 got event WatchedEvent state:SyncConnected type:None path:null path:null type:None
[junit4] 2> 826052 T2051 oascc.ConnectionManager.waitForConnected Client is connected to ZooKeeper
[junit4] 2> 826057 T2051 oascc.ConnectionManager.waitForConnected Waiting for client to connect to ZooKeeper
[junit4] 2> 826059 T2077 oascc.ConnectionManager.process Watcher org.apache.solr.common.cloud.ConnectionManager@36ddfd93 name:ZooKeeperConnection Watcher:127.0.0.1:55169/solr got event WatchedEvent state:SyncConnected type:None path:null path:null type:None
[junit4] 2> 826059 T2051 oascc.ConnectionManager.waitForConnected Client is connected to ZooKeeper
[junit4] 2> 826062 T2051 oascc.SolrZkClient.makePath makePath: /overseer/queue
[junit4] 2> 826067 T2051 oascc.SolrZkClient.makePath makePath: /overseer/collection-queue-work
[junit4] 2> 826072 T2051 oascc.SolrZkClient.makePath makePath: /live_nodes
[junit4] 2> 826076 T2051 oasc.ZkController.createEphemeralLiveNode Register node as live in ZooKeeper:/live_nodes/127.0.0.1:50556__p
[junit4] 2> 826077 T2051 oascc.SolrZkClient.makePath makePath: /live_nodes/127.0.0.1:50556__p
[junit4] 2> 826083 T2051 oascc.SolrZkClient.makePath makePath: /overseer_elect
[junit4] 2> 826086 T2051 oascc.SolrZkClient.makePath makePath: /overseer_elect/election
[junit4] 2> 826095 T2051 oascc.SolrZkClient.makePath makePath: /overseer_elect/leader
[junit4] 2> 826099 T2051 oasc.Overseer.start Overseer (id=91033521076502533-127.0.0.1:50556__p-n_0000000000) starting
[junit4] 2> 826105 T2051 oascc.SolrZkClient.makePath makePath: /overseer/queue-work
[junit4] 2> 826111 T2079 oasc.OverseerCollectionProcessor.run Process current queue of collection creations
[junit4] 2> 826112 T2051 oascc.SolrZkClient.makePath makePath: /clusterstate.json
[junit4] 2> 826116 T2051 oascc.SolrZkClient.makePath makePath: /aliases.json
[junit4] 2> 826119 T2051 oascc.ZkStateReader.createClusterStateWatchersAndUpdate Updating cluster state from ZooKeeper...
[junit4] 2> 826125 T2078 oasc.Overseer$ClusterStateUpdater.run Starting to work on the main queue
[junit4] 2> 826128 T2051 oasc.CorePropertiesLocator.discover Looking for core definitions underneath /mnt/ssd/jenkins/workspace/Lucene-Solr-trunk-Linux/solr/build/solr-core/test/J1/./org.apache.solr.cloud.CollectionsAPIDistributedZkTest-controljetty-1389061295997
[junit4] 2> 826129 T2051 oasc.CorePropertiesLocator.discoverUnder Found core conf in /mnt/ssd/jenkins/workspace/Lucene-Solr-trunk-Linux/solr/build/solr-core/test/J1/./org.apache.solr.cloud.CollectionsAPIDistributedZkTest-controljetty-1389061295997/conf/
[junit4] 2> 826162 T2051 oasc.CorePropertiesLocator.discover Found 1 core definitions
[junit4] 2> 826162 T2051 oass.SolrDispatchFilter.init user.dir=/mnt/ssd/jenkins/workspace/Lucene-Solr-trunk-Linux/solr/build/solr-core/test/J1
[junit4] 2> 826163 T2051 oass.SolrDispatchFilter.init SolrDispatchFilter.init() done
[junit4] 2> 826163 T2051 oascc.ConnectionManager.waitForConnected Waiting for client to connect to ZooKeeper
[junit4] 2> 826165 T2082 oascc.ConnectionManager.process Watcher org.apache.solr.common.cloud.ConnectionManager@35e7fc25 name:ZooKeeperConnection Watcher:127.0.0.1:55169/solr got event WatchedEvent state:SyncConnected type:None path:null path:null type:None
[junit4] 2> 826165 T2051 oascc.ConnectionManager.waitForConnected Client is connected to ZooKeeper
[junit4] 2> 826168 T2051 oascc.ZkStateReader.createClusterStateWatchersAndUpdate Updating cluster state from ZooKeeper...
[junit4] 2> 826173 T2051 oasc.ChaosMonkey.monkeyLog monkey: init - expire sessions:false cause connection loss:false
[junit4] 2> 826244 T2051 oejs.Server.doStart jetty-8.1.10.v20130312
[junit4] 2> 826246 T2051 oejs.AbstractConnector.doStart Started SelectChannelConnector@127.0.0.1:58053
[junit4] 2> 826247 T2051 oass.SolrDispatchFilter.init SolrDispatchFilter.init()
[junit4] 2> 826248 T2051 oasc.SolrResourceLoader.locateSolrHome JNDI not configured for solr (NoInitialContextEx)
[junit4] 2> 826248 T2051 oasc.SolrResourceLoader.locateSolrHome using system property solr.solr.home: ../../../../../../../../../../mnt/ssd/jenkins/workspace/Lucene-Solr-trunk-Linux/solr/build/solr-core/test/J1/./org.apache.solr.cloud.CollectionsAPIDistributedZkTest-jetty1-1389061296261
[junit4] 2> 826249 T2051 oasc.SolrResourceLoader.<init> new SolrResourceLoader for directory: '../../../../../../../../../../mnt/ssd/jenkins/workspace/Lucene-Solr-trunk-Linux/solr/build/solr-core/test/J1/./org.apache.solr.cloud.CollectionsAPIDistributedZkTest-jetty1-1389061296261/'
[junit4] 2> 826268 T2051 oasc.ConfigSolr.fromFile Loading container configuration from /mnt/ssd/jenkins/workspace/Lucene-Solr-trunk-Linux/solr/build/solr-core/test/J1/../../../../../../../../../../mnt/ssd/jenkins/workspace/Lucene-Solr-trunk-Linux/solr/build/solr-core/test/J1/./org.apache.solr.cloud.CollectionsAPIDistributedZkTest-jetty1-1389061296261/solr.xml
[junit4] 2> 826288 T2051 oasc.ConfigSolrXml.<init> Config-defined core root directory:
[junit4] 2> 826289 T2051 oasc.CoreContainer.<init> New CoreContainer 850945646
[junit4] 2> 826289 T2051 oasc.CoreContainer.load Loading cores into CoreContainer [instanceDir=../../../../../../../../../../mnt/ssd/jenkins/workspace/Lucene-Solr-trunk-Linux/solr/build/solr-core/test/J1/./org.apache.solr.cloud.CollectionsAPIDistributedZkTest-jetty1-1389061296261/]
[junit4] 2> 826289 T2051 oashc.HttpShardHandlerFactory.getParameter Setting socketTimeout to: 90000
[junit4] 2> 826290 T2051 oashc.HttpShardHandlerFactory.getParameter Setting urlScheme to: http://
[junit4] 2> 826290 T2051 oashc.HttpShardHandlerFactory.getParameter Setting connTimeout to: 15000
[junit4] 2> 826290 T2051 oashc.HttpShardHandlerFactory.getParameter Setting maxConnectionsPerHost to: 20
[junit4] 2> 826290 T2051 oashc.HttpShardHandlerFactory.getParameter Setting corePoolSize to: 0
[junit4] 2> 826291 T2051 oashc.HttpShardHandlerFactory.getParameter Setting maximumPoolSize to: 2147483647
[junit4] 2> 826291 T2051 oashc.HttpShardHandlerFactory.getParameter Setting maxThreadIdleTime to: 5
[junit4] 2> 826291 T2051 oashc.HttpShardHandlerFactory.getParameter Setting sizeOfQueue to: -1
[junit4] 2> 826291 T2051 oashc.HttpShardHandlerFactory.getParameter Setting fairnessPolicy to: false
[junit4] 2> 826293 T2051 oasl.LogWatcher.createWatcher SLF4J impl is org.slf4j.impl.Log4jLoggerFactory
[junit4] 2> 826293 T2051 oasl.LogWatcher.newRegisteredLogWatcher Registering Log Listener [Log4j (org.slf4j.impl.Log4jLoggerFactory)]
[junit4] 2> 826294 T2051 oasc.CoreContainer.load Host Name: 127.0.0.1
[junit4] 2> 826294 T2051 oasc.ZkContainer.initZooKeeper Zookeeper client=127.0.0.1:55169/solr
[junit4] 2> 826294 T2051 oasc.ZkController.checkChrootPath zkHost includes chroot
[junit4] 2> 826295 T2051 oascc.ConnectionManager.waitForConnected Waiting for client to connect to ZooKeeper
[junit4] 2> 826296 T2093 oascc.ConnectionManager.process Watcher org.apache.solr.common.cloud.ConnectionManager@684cd9c5 name:ZooKeeperConnection Watcher:127.0.0.1:55169 got event WatchedEvent state:SyncConnected type:None path:null path:null type:None
[junit4] 2> 826297 T2051 oascc.ConnectionManager.waitForConnected Client is connected to ZooKeeper
[junit4] 2> 826301 T2051 oascc.ConnectionManager.waitForConnected Waiting for client to connect to ZooKeeper
[junit4] 2> 826303 T2095 oascc.ConnectionManager.process Watcher org.apache.solr.common.cloud.ConnectionManager@935acaf name:ZooKeeperConnection Watcher:127.0.0.1:55169/solr got event WatchedEvent state:SyncConnected type:None path:null path:null type:None
[junit4] 2> 826303 T2051 oascc.ConnectionManager.waitForConnected Client is connected to ZooKeeper
[junit4] 2> 826311 T2051 oascc.ZkStateReader.createClusterStateWatchersAndUpdate Updating cluster state from ZooKeeper...
[junit4] 2> 827318 T2051 oasc.ZkController.createEphemeralLiveNode Register node as live in ZooKeeper:/live_nodes/127.0.0.1:58053__p
[junit4] 2> 827320 T2051 oascc.SolrZkClient.makePath makePath: /live_nodes/127.0.0.1:58053__p
[junit4] 2> 827326 T2077 oascc.ZkStateReader$3.process Updating live nodes... (2)
[junit4] 2> 827326 T2082 oascc.ZkStateReader$3.process Updating live nodes... (2)
[junit4] 2> 827326 T2095 oascc.ZkStateReader$3.process Updating live nodes... (2)
[junit4] 2> 827334 T2051 oasc.CorePropertiesLocator.discover Looking for core definitions underneath /mnt/ssd/jenkins/workspace/Lucene-Solr-trunk-Linux/solr/build/solr-core/test/J1/../../../../../../../../../../mnt/ssd/jenkins/workspace/Lucene-Solr-trunk-Linux/solr/build/solr-core/test/J1/./org.apache.solr.cloud.CollectionsAPIDistributedZkTest-jetty1-1389061296261
[junit4] 2> 827336 T2051 oasc.CorePropertiesLocator.discoverUnder Found core conf in /mnt/ssd/jenkins/workspace/Lucene-Solr-trunk-Linux/solr/build/solr-core/test/J1/../../../../../../../../../../mnt/ssd/jenkins/workspace/Lucene-Solr-trunk-Linux/solr/build/solr-core/test/J1/./org.apache.solr.cloud.CollectionsAPIDistributedZkTest-jetty1-1389061296261/conf/
[junit4] 2> 827380 T2051 oasc.CorePropertiesLocator.discover Found 1 core definitions
[junit4] 2> 827381 T2051 oass.SolrDispatchFilter.init user.dir=/mnt/ssd/jenkins/workspace/Lucene-Solr-trunk-Linux/solr/build/solr-core/test/J1
[junit4] 2> 827381 T2051 oass.SolrDispatchFilter.init SolrDispatchFilter.init() done
[junit4] 2> 827444 T2051 oejs.Server.doStart jetty-8.1.10.v20130312
[junit4] 2> 827448 T2051 oejs.AbstractConnector.doStart Started SelectChannelConnector@127.0.0.1:51036
[junit4] 2> 827450 T2051 oass.SolrDispatchFilter.init SolrDispatchFilter.init()
[junit4] 2> 827450 T2051 oasc.SolrResourceLoader.locateSolrHome JNDI not configured for solr (NoInitialContextEx)
[junit4] 2> 827451 T2051 oasc.SolrResourceLoader.locateSolrHome using system property solr.solr.home: ../../../../../../../../../../mnt/ssd/jenkins/workspace/Lucene-Solr-trunk-Linux/solr/build/solr-core/test/J1/./org.apache.solr.cloud.CollectionsAPIDistributedZkTest-jetty2-1389061297469
[junit4] 2> 827451 T2051 oasc.SolrResourceLoader.<init> new SolrResourceLoader for directory: '../../../../../../../../../../mnt/ssd/jenkins/workspace/Lucene-Solr-trunk-Linux/solr/build/solr-core/test/J1/./org.apache.solr.cloud.CollectionsAPIDistributedZkTest-jetty2-1389061297469/'
[junit4] 2> 827466 T2051 oasc.ConfigSolr.fromFile Loading container configuration from /mnt/ssd/jenkins/workspace/Lucene-Solr-trunk-Linux/solr/build/solr-core/test/J1/../../../../../../../../../../mnt/ssd/jenkins/workspace/Lucene-Solr-trunk-Linux/solr/build/solr-core/test/J1/./org.apache.solr.cloud.CollectionsAPIDistributedZkTest-jetty2-1389061297469/solr.xml
[junit4] 2> 827488 T2051 oasc.ConfigSolrXml.<init> Config-defined core root directory:
[junit4] 2> 827488 T2051 oasc.CoreContainer.<init> New CoreContainer 1130564148
[junit4] 2> 827488 T2051 oasc.CoreContainer.load Loading cores into CoreContainer [instanceDir=../../../../../../../../../../mnt/ssd/jenkins/workspace/Lucene-Solr-trunk-Linux/solr/build/solr-core/test/J1/./org.apache.solr.cloud.CollectionsAPIDistributedZkTest-jetty2-1389061297469/]
[junit4] 2> 827489 T2051 oashc.HttpShardHandlerFactory.getParameter Setting socketTimeout to: 90000
[junit4] 2> 827489 T2051 oashc.HttpShardHandlerFactory.getParameter Setting urlScheme to: http://
[junit4] 2> 827489 T2051 oashc.HttpShardHandlerFactory.getParameter Setting connTimeout to: 15000
[junit4] 2> 827489 T2051 oashc.HttpShardHandlerFactory.getParameter Setting maxConnectionsPerHost to: 20
[junit4] 2> 827490 T2051 oashc.HttpShardHandlerFactory.getParameter Setting corePoolSize to: 0
[junit4] 2> 827490 T2051 oashc.HttpShardHandlerFactory.getParameter Setting maximumPoolSize to: 2147483647
[junit4] 2> 827490 T2051 oashc.HttpShardHandlerFactory.getParameter Setting maxThreadIdleTime to: 5
[junit4] 2> 827490 T2051 oashc.HttpShardHandlerFactory.getParameter Setting sizeOfQueue to: -1
[junit4] 2> 827490 T2051 oashc.HttpShardHandlerFactory.getParameter Setting fairnessPolicy to: false
[junit4] 2> 827492 T2051 oasl.LogWatcher.createWatcher SLF4J impl is org.slf4j.impl.Log4jLoggerFactory
[junit4] 2> 827492 T2051 oasl.LogWatcher.newRegisteredLogWatcher Registering Log Listener [Log4j (org.slf4j.impl.Log4jLoggerFactory)]
[junit4] 2> 827493 T2051 oasc.CoreContainer.load Host Name: 127.0.0.1
[junit4] 2> 827493 T2051 oasc.ZkContainer.initZooKeeper Zookeeper client=127.0.0.1:55169/solr
[junit4] 2> 827493 T2051 oasc.ZkController.checkChrootPath zkHost includes chroot
[junit4] 2> 827494 T2051 oascc.ConnectionManager.waitForConnected Waiting for client to connect to ZooKeeper
[junit4] 2> 827496 T2107 oascc.ConnectionManager.process Watcher org.apache.solr.common.cloud.ConnectionManager@1b32fe7c name:ZooKeeperConnection Watcher:127.0.0.1:55169 got event WatchedEvent state:SyncConnected type:None path:null path:null type:None
[junit4] 2> 827496 T2051 oascc.ConnectionManager.waitForConnected Client is connected to ZooKeeper
[junit4] 2> 827501 T2051 oascc.ConnectionManager.waitForConnected Waiting for client to connect to ZooKeeper
[junit4] 2> 827504 T2109 oascc.ConnectionManager.process Watcher org.apache.solr.common.cloud.ConnectionManager@3f2cbe23 name:ZooKeeperConnection Watcher:127.0.0.1:55169/solr got event WatchedEvent state:SyncConnected type:None path:null path:null type:None
[junit4] 2> 827504 T2051 oascc.ConnectionManager.waitForConnected Client is connected to ZooKeeper
[junit4] 2> 827512 T2051 oascc.ZkStateReader.createClusterStateWatchersAndUpdate Updating cluster state from ZooKeeper...
[junit4] 2> 828518 T2051 oasc.ZkController.createEphemeralLiveNode Register node as live in ZooKeeper:/live_nodes/127.0.0.1:51036__p
[junit4] 2> 828520 T2051 oascc.SolrZkClient.makePath makePath: /live_nodes/127.0.0.1:51036__p
[junit4] 2> 828526 T2082 oascc.ZkStateReader$3.process Updating live nodes... (3)
[junit4] 2> 828527 T2077 oascc.ZkStateReader$3.process Updating live nodes... (3)
[junit4] 2> 828527 T2109 oascc.ZkStateReader$3.process Updating live nodes... (3)
[junit4] 2> 828527 T2095 oascc.ZkStateReader$3.process Updating live nodes... (3)
[junit4] 2> 828535 T2051 oasc.CorePropertiesLocator.discover Looking for core definitions underneath /mnt/ssd/jenkins/workspace/Lucene-Solr-trunk-Linux/solr/build/solr-core/test/J1/../../../../../../../../../../mnt/ssd/jenkins/workspace/Lucene-Solr-trunk-Linux/solr/build/solr-core/test/J1/./org.apache.solr.cloud.CollectionsAPIDistributedZkTest-jetty2-1389061297469
[junit4] 2> 828537 T2051 oasc.CorePropertiesLocator.discoverUnder Found core conf in /mnt/ssd/jenkins/workspace/Lucene-Solr-trunk-Linux/solr/build/solr-core/test/J1/../../../../../../../../../../mnt/ssd/jenkins/workspace/Lucene-Solr-trunk-Linux/solr/build/solr-core/test/J1/./org.apache.solr.cloud.CollectionsAPIDistributedZkTest-jetty2-1389061297469/conf/
[junit4] 2> 828570 T2051 oasc.CorePropertiesLocator.discover Found 1 core definitions
[junit4] 2> 828570 T2051 oass.SolrDispatchFilter.init user.dir=/mnt/ssd/jenkins/workspace/Lucene-Solr-trunk-Linux/solr/build/solr-core/test/J1
[junit4] 2> 828571 T2051 oass.SolrDispatchFilter.init SolrDispatchFilter.init() done
[junit4] 2> 828644 T2051 oejs.Server.doStart jetty-8.1.10.v20130312
[junit4] 2> 828646 T2051 oejs.AbstractConnector.doStart Started SelectChannelConnector@127.0.0.1:36283
[junit4] 2> 828647 T2051 oass.SolrDispatchFilter.init SolrDispatchFilter.init()
[junit4] 2> 828648 T2051 oasc.SolrResourceLoader.locateSolrHome JNDI not configured for solr (NoInitialContextEx)
[junit4] 2> 828649 T2051 oasc.SolrResourceLoader.locateSolrHome using system property solr.solr.home: ../../../../../../../../../../mnt/ssd/jenkins/workspace/Lucene-Solr-trunk-Linux/solr/build/solr-core/test/J1/./org.apache.solr.cloud.CollectionsAPIDistributedZkTest-jetty3-1389061298659
[junit4] 2> 828649 T2051 oasc.SolrResourceLoader.<init> new SolrResourceLoader for directory: '../../../../../../../../../../mnt/ssd/jenkins/workspace/Lucene-Solr-trunk-Linux/solr/build/solr-core/test/J1/./org.apache.solr.cloud.CollectionsAPIDistributedZkTest-jetty3-1389061298659/'
[junit4] 2> 828669 T2051 oasc.ConfigSolr.fromFile Loading container configuration from /mnt/ssd/jenkins/workspace/Lucene-Solr-trunk-Linux/solr/build/solr-core/test/J1/../../../../../../../../../../mnt/ssd/jenkins/workspace/Lucene-Solr-trunk-Linux/solr/build/solr-core/test/J1/./org.apache.solr.cloud.CollectionsAPIDistributedZkTest-jetty3-1389061298659/solr.xml
[junit4] 2> 828697 T2051 oasc.ConfigSolrXml.<init> Config-defined core root directory:
[junit4] 2> 828698 T2051 oasc.CoreContainer.<init> New CoreContainer 114484210
[junit4] 2> 828698 T2051 oasc.CoreContainer.load Loading cores into CoreContainer [instanceDir=../../../../../../../../../../mnt/ssd/jenkins/workspace/Lucene-Solr-trunk-Linux/solr/build/solr-core/test/J1/./org.apache.solr.cloud.CollectionsAPIDistributedZkTest-jetty3-1389061298659/]
[junit4] 2> 828700 T2051 oashc.HttpShardHandlerFactory.getParameter Setting socketTimeout to: 90000
[junit4] 2> 828700 T2051 oashc.HttpShardHandlerFactory.getParameter Setting urlScheme to: http://
[junit4] 2> 828700 T2051 oashc.HttpShardHandlerFactory.getParameter Setting connTimeout to: 15000
[junit4] 2> 828701 T2051 oashc.HttpShardHandlerFactory.getParameter Setting maxConnectionsPerHost to: 20
[junit4] 2> 828701 T2051 oashc.HttpShardHandlerFactory.getParameter Setting corePoolSize to: 0
[junit4] 2> 828702 T2051 oashc.HttpShardHandlerFactory.getParameter Setting maximumPoolSize to: 2147483647
[junit4] 2> 828702 T2051 oashc.HttpShardHandlerFactory.getParameter Setting maxThreadIdleTime to: 5
[junit4] 2> 828703 T2051 oashc.HttpShardHandlerFactory.getParameter Setting sizeOfQueue to: -1
[junit4] 2> 828703 T2051 oashc.HttpShardHandlerFactory.getParameter Setting fairnessPolicy to: false
[junit4] 2> 828707 T2051 oasl.LogWatcher.createWatcher SLF4J impl is org.slf4j.impl.Log4jLoggerFactory
[junit4] 2> 828708 T2051 oasl.LogWatcher.newRegisteredLogWatcher Registering Log Listener [Log4j (org.slf4j.impl.Log4jLoggerFactory)]
[junit4] 2> 828708 T2051 oasc.CoreContainer.load Host Name: 127.0.0.1
[junit4] 2> 828709 T2051 oasc.ZkContainer.initZooKeeper Zookeeper client=127.0.0.1:55169/solr
[junit4] 2> 828709 T2051 oasc.ZkController.checkChrootPath zkHost includes chroot
[junit4] 2> 828710 T2051 oascc.ConnectionManager.waitForConnected Waiting for client to connect to ZooKeeper
[junit4] 2> 828712 T2121 oascc.ConnectionManager.process Watcher org.apache.solr.common.cloud.ConnectionManager@7f73285d name:ZooKeeperConnection Watcher:127.0.0.1:55169 got event WatchedEvent state:SyncConnected type:None path:null path:null type:None
[junit4] 2> 828712 T2051 oascc.ConnectionManager.waitForConnected Client is connected to ZooKeeper
[junit4] 2> 828716 T2051 oascc.ConnectionManager.waitForConnected Waiting for client to connect to ZooKeeper
[junit4] 2> 828718 T2123 oascc.ConnectionManager.process Watcher org.apache.solr.common.cloud.ConnectionManager@2ff8f754 name:ZooKeeperConnection Watcher:127.0.0.1:55169/solr got event WatchedEvent state:SyncConnected type:None path:null path:null type:None
[junit4] 2> 828718 T2051 oascc.ConnectionManager.waitForConnected Client is connected to ZooKeeper
[junit4] 2> 828729 T2051 oascc.ZkStateReader.createClusterStateWatchersAndUpdate Updating cluster state from ZooKeeper...
[junit4] 2> 829736 T2051 oasc.ZkController.createEphemeralLiveNode Register node as live in ZooKeeper:/live_nodes/127.0.0.1:36283__p
[junit4] 2> 829738 T2051 oascc.SolrZkClient.makePath makePath: /live_nodes/127.0.0.1:36283__p
[junit4] 2> 829743 T2109 oascc.ZkStateReader$3.process Updating live nodes... (4)
[junit4] 2> 829743 T2082 oascc.ZkStateReader$3.process Updating live nodes... (4)
[junit4] 2> 829744 T2095 oascc.ZkStateReader$3.process Updating live nodes... (4)
[junit4] 2> 829744 T2123 oascc.ZkStateReader$3.process Updating live nodes... (4)
[junit4] 2> 829744 T2077 oascc.ZkStateReader$3.process Updating live nodes... (4)
[junit4] 2> 829753 T2051 oasc.CorePropertiesLocator.discover Looking for core definitions underneath /mnt/ssd/jenkins/workspace/Lucene-Solr-trunk-Linux/solr/build/solr-core/test/J1/../../../../../../../../../../mnt/ssd/jenkins/workspace/Lucene-Solr-trunk-Linux/solr/build/solr-core/test/J1/./org.apache.solr.cloud.CollectionsAPIDistributedZkTest-jetty3-1389061298659
[junit4] 2> 829754 T2051 oasc.CorePropertiesLocator.discoverUnder Found core conf in /mnt/ssd/jenkins/workspace/Lucene-Solr-trunk-Linux/solr/build/solr-core/test/J1/../../../../../../../../../../mnt/ssd/jenkins/workspace/Lucene-Solr-trunk-Linux/solr/build/solr-core/test/J1/./org.apache.solr.cloud.CollectionsAPIDistributedZkTest-jetty3-1389061298659/conf/
[junit4] 2> 829788 T2051 oasc.CorePropertiesLocator.discover Found 1 core definitions
[junit4] 2> 829789 T2051 oass.SolrDispatchFilter.init user.dir=/mnt/ssd/jenkins/workspace/Lucene-Solr-trunk-Linux/solr/build/solr-core/test/J1
[junit4] 2> 829789 T2051 oass.SolrDispatchFilter.init SolrDispatchFilter.init() done
[junit4] 2> 829853 T2051 oejs.Server.doStart jetty-8.1.10.v20130312
[junit4] 2> 829857 T2051 oejs.AbstractConnector.doStart Started SelectChannelConnector@127.0.0.1:33873
[junit4] 2> 829857 T2051 oass.SolrDispatchFilter.init SolrDispatchFilter.init()
[junit4] 2> 829858 T2051 oasc.SolrResourceLoader.locateSolrHome JNDI not configured for solr (NoInitialContextEx)
[junit4] 2> 829858 T2051 oasc.SolrResourceLoader.locateSolrHome using system property solr.solr.home: ../../../../../../../../../../mnt/ssd/jenkins/workspace/Lucene-Solr-trunk-Linux/solr/build/solr-core/test/J1/./org.apache.solr.cloud.CollectionsAPIDistributedZkTest-jetty4-1389061299878
[junit4] 2> 829859 T2051 oasc.SolrResourceLoader.<init> new SolrResourceLoader for directory: '../../../../../../../../../../mnt/ssd/jenkins/workspace/Lucene-Solr-trunk-Linux/solr/build/solr-core/test/J1/./org.apache.solr.cloud.CollectionsAPIDistributedZkTest-jetty4-1389061299878/'
[junit4] 2> 829874 T2051 oasc.ConfigSolr.fromFile Loading container configuration from /mnt/ssd/jenkins/workspace/Lucene-Solr-trunk-Linux/solr/build/solr-core/test/J1/../../../../../../../../../../mnt/ssd/jenkins/workspace/Lucene-Solr-trunk-Linux/solr/build/solr-core/test/J1/./org.apache.solr.cloud.CollectionsAPIDistributedZkTest-jetty4-1389061299878/solr.xml
[junit4] 2> 829893 T2051 oasc.ConfigSolrXml.<init> Config-defined core root directory:
[junit4] 2> 829893 T2051 oasc.CoreContainer.<init> New CoreContainer 500199642
[junit4] 2> 829894 T2051 oasc.CoreContainer.load Loading cores into CoreContainer [instanceDir=../../../../../../../../../../mnt/ssd/jenkins/workspace/Lucene-Solr-trunk-Linux/solr/build/solr-core/test/J1/./org.apache.solr.cloud.CollectionsAPIDistributedZkTest-jetty4-1389061299878/]
[junit4] 2> 829894 T2051 oashc.HttpShardHandlerFactory.getParameter Setting socketTimeout to: 90000
[junit4] 2> 829894 T2051 oashc.HttpShardHandlerFactory.getParameter Setting urlScheme to: http://
[junit4] 2> 829895 T2051 oashc.HttpShardHandlerFactory.getParameter Setting connTimeout to: 15000
[junit4] 2> 829895 T2051 oashc.HttpShardHandlerFactory.getParameter Setting maxConnectionsPerHost to: 20
[junit4] 2> 829895 T2051 oashc.HttpShardHandlerFactory.getParameter Setting corePoolSize to: 0
[junit4] 2> 829895 T2051 oashc.HttpShardHandlerFactory.getParameter Setting maximumPoolSize to: 2147483647
[junit4] 2> 829895 T2051 oashc.HttpShardHandlerFactory.getParameter Setting maxThreadIdleTime to: 5
[junit4] 2> 829896 T2051 oashc.HttpShardHandlerFactory.getParameter Setting sizeOfQueue to: -1
[junit4] 2> 829896 T2051 oashc.HttpShardHandlerFactory.getParameter Setting fairnessPolicy to: false
[junit4] 2> 829898 T2051 oasl.LogWatcher.createWatcher SLF4J impl is org.slf4j.impl.Log4jLoggerFactory
[junit4] 2> 829898 T2051 oasl.LogWatcher.newRegisteredLogWatcher Registering Log Listener [Log4j (org.slf4j.impl.Log4jLoggerFactory)]
[junit4] 2> 829898 T2051 oasc.CoreContainer.load Host Name: 127.0.0.1
[junit4] 2> 829898 T2051 oasc.ZkContainer.initZooKeeper Zookeeper client=127.0.0.1:55169/solr
[junit4] 2> 829899 T2051 oasc.ZkController.checkChrootPath zkHost includes chroot
[junit4] 2> 829900 T2051 oascc.ConnectionManager.waitForConnected Waiting for client to connect to ZooKeeper
[junit4] 2> 829901 T2135 oascc.ConnectionManager.process Watcher org.apache.solr.common.cloud.ConnectionManager@5fa10780 name:ZooKeeperConnection Watcher:127.0.0.1:55169 got event WatchedEvent state:SyncConnected type:None path:null path:null type:None
[junit4] 2> 829902 T2051 oascc.ConnectionManager.waitForConnected Client is connected to ZooKeeper
[junit4] 2> 829905 T2051 oascc.ConnectionManager.waitForConnected Waiting for client to connect to ZooKeeper
[junit4] 2> 829907 T2137 oascc.ConnectionManager.process Watcher org.apache.solr.common.cloud.ConnectionManager@6eef8001 name:ZooKeeperConnection Watcher:127.0.0.1:55169/solr got event WatchedEvent state:SyncConnected type:None path:null path:null type:None
[junit4] 2> 829908 T2051 oascc.ConnectionManager.waitForConnected Client is connected to ZooKeeper
[junit4] 2> 829916 T2051 oascc.ZkStateReader.createClusterStateWatchersAndUpdate Updating cluster state from ZooKeeper...
[junit4] 2> 830922 T2051 oasc.ZkController.createEphemeralLiveNode Register node as live in ZooKeeper:/live_nodes/127.0.0.1:33873__p
[junit4] 2> 830924 T2051 oascc.SolrZkClient.makePath makePath: /live_nodes/127.0.0.1:33873__p
[junit4] 2> 830930 T2082 oascc.ZkStateReader$3.process Updating live nodes... (5)
[junit4] 2> 830931 T2137 oascc.ZkStateReader$3.process Updating live nodes... (5)
[junit4] 2> 830931 T2077 oascc.ZkStateReader$3.process Updating live nodes... (5)
[junit4] 2> 830931 T2109 oascc.ZkStateReader$3.process Updating live nodes... (5)
[junit4] 2> 830931 T2095 oascc.ZkStateReader$3.process Updating live nodes... (5)
[junit4] 2> 830931 T2123 oascc.ZkStateReader$3.process Updating live nodes... (5)
[junit4] 2> 830940 T2051 oasc.CorePropertiesLocator.discover Looking for core definitions underneath /mnt/ssd/jenkins/workspace/Lucene-Solr-trunk-Linux/solr/build/solr-core/test/J1/../../../../../../../../../../mnt/ssd/jenkins/workspace/Lucene-Solr-trunk-Linux/solr/build/solr-core/test/J1/./org.apache.solr.cloud.CollectionsAPIDistributedZkTest-jetty4-1389061299878
[junit4] 2> 830941 T2051 oasc.CorePropertiesLocator.discoverUnder Found core conf in /mnt/ssd/jenkins/workspace/Lucene-Solr-trunk-Linux/solr/build/solr-core/test/J1/../../../../../../../../../../mnt/ssd/jenkins/workspace/Lucene-Solr-trunk-Linux/solr/build/solr-core/test/J1/./org.apache.solr.cloud.CollectionsAPIDistributedZkTest-jetty4-1389061299878/conf/
[junit4] 2> 830973 T2051 oasc.CorePropertiesLocator.discover Found 1 core definitions
[junit4] 2> 830973 T2051 oass.SolrDispatchFilter.init user.dir=/mnt/ssd/jenkins/workspace/Lucene-Solr-trunk-Linux/solr/build/solr-core/test/J1
[junit4] 2> 830974 T2051 oass.SolrDispatchFilter.init SolrDispatchFilter.init() done
[junit4] 2> 830979 T2088 oasha.CollectionsHandler.handleCreateAction Creating Collection : replicationFactor=2&router.name=compositeId&wt=javabin&collection.configName=conf1&version=2&router.field=myOwnField&name=solrj_collection&action=CREATE&numShards=2
[junit4] 2> 830981 T2077 oasc.DistributedQueue$LatchChildWatcher.process LatchChildWatcher fired on path: /overseer/collection-queue-work state: SyncConnected type NodeChildrenChanged
[junit4] 2> 830983 T2079 oasc.OverseerCollectionProcessor.run Overseer Collection Processor: Get the message id:/overseer/collection-queue-work/qn-0000000000 message:{
[junit4] 2> "operation":"createcollection",
[junit4] 2> "fromApi":"true",
[junit4] 2> "name":"solrj_collection",
[junit4] 2> "replicationFactor":"2",
[junit4] 2> "collection.configName":"conf1",
[junit4] 2> "numShards":"2",
[junit4] 2> "router.name":"compositeId",
[junit4] 2> "router.field":"myOwnField"}
[junit4] 2> 830983 T2079 oasc.OverseerCollectionProcessor.processMessage WARN OverseerCollectionProcessor.processMessage : createcollection , {
[junit4] 2> "operation":"createcollection",
[junit4] 2> "fromApi":"true",
[junit4] 2> "name":"solrj_collection",
[junit4] 2> "replicationFactor":"2",
[junit4] 2> "collection.configName":"conf1",
[junit4] 2> "numShards":"2",
[junit4] 2> "router.name":"compositeId",
[junit4] 2> "router.field":"myOwnField"}
[junit4] 2> 830984 T2079 oasc.OverseerCollectionProcessor.createConfNode creating collections conf node /collections/solrj_collection
[junit4] 2> 830984 T2079 oascc.SolrZkClient.makePath makePath: /collections/solrj_collection
[junit4] 2> 830991 T2077 oasc.DistributedQueue$LatchChildWatcher.process LatchChildWatcher fired on path: /overseer/queue state: SyncConnected type NodeChildrenChanged
[junit4] 2> 830994 T2078 oascc.ZkStateReader.updateClusterState Updating cloud state from ZooKeeper...
[junit4] 2> 830995 T2078 oasc.Overseer$ClusterStateUpdater.buildCollection building a new collection: solrj_collection
[junit4] 2> 830995 T2078 oasc.Overseer$ClusterStateUpdater.createCollection Create collection solrj_collection with shards [shard1, shard2]
[junit4] 2> 830998 T2077 oasc.DistributedQueue$LatchChildWatcher.process LatchChildWatcher fired on path: /overseer/queue state: SyncConnected type NodeChildrenChanged
[junit4] 2> 830999 T2082 oascc.ZkStateReader$2.process A cluster state change: WatchedEvent state:SyncConnected type:NodeDataChanged path:/clusterstate.json, has occurred - updating... (live nodes size: 5)
[junit4] 2> 831000 T2077 oascc.ZkStateReader$2.process A cluster state change: WatchedEvent state:SyncConnected type:NodeDataChanged path:/clusterstate.json, has occurred - updating... (live nodes size: 5)
[junit4] 2> 831000 T2123 oascc.ZkStateReader$2.process A cluster state change: WatchedEvent state:SyncConnected type:NodeDataChanged path:/clusterstate.json, has occurred - updating... (live nodes size: 5)
[junit4] 2> 831000 T2137 oascc.ZkStateReader$2.process A cluster state change: WatchedEvent state:SyncConnected type:NodeDataChanged path:/clusterstate.json, has occurred - updating... (live nodes size: 5)
[junit4] 2> 831000 T2095 oascc.ZkStateReader$2.process A cluster state change: WatchedEvent state:SyncConnected type:NodeDataChanged path:/clusterstate.json, has occurred - updating... (live nodes size: 5)
[junit4] 2> 830999 T2109 oascc.ZkStateReader$2.process A cluster state change: WatchedEvent state:SyncConnected type:NodeDataChanged path:/clusterstate.json, has occurred - updating... (live nodes size: 5)
[junit4] 2> 831091 T2079 oasc.OverseerCollectionProcessor.createCollection going to create cores replicas shardNames [shard1, shard2] , repFactor : 2
[junit4] 2> 831092 T2079 oasc.OverseerCollectionProcessor.createCollection Creating shard solrj_collection_shard1_replica1 as part of slice shard1 of collection solrj_collection on 127.0.0.1:33873__p
[junit4] 2> 831092 T2079 oasc.OverseerCollectionProcessor.createCollection Creating shard solrj_collection_shard1_replica2 as part of slice shard1 of collection solrj_collection on 127.0.0.1:36283__p
[junit4] 2> 831092 T2079 oasc.OverseerCollectionProcessor.createCollection Creating shard solrj_collection_shard2_replica1 as part of slice shard2 of collection solrj_collection on 127.0.0.1:50556__p
[junit4] 2> 831093 T2079 oasc.OverseerCollectionProcessor.createCollection Creating shard solrj_collection_shard2_replica2 as part of slice shard2 of collection solrj_collection on 127.0.0.1:58053__p
[junit4] 2> 831095 T2116 oasc.ZkController.publish publishing core=solrj_collection_shard1_replica2 state=down
[junit4] 2> 831096 T2070 oasc.ZkController.publish publishing core=solrj_collection_shard2_replica1 state=down
[junit4] 2> 831096 T2091 oasc.ZkController.publish publishing core=solrj_collection_shard2_replica2 state=down
[junit4] 2> 831097 T2077 oasc.DistributedQueue$LatchChildWatcher.process LatchChildWatcher fired on path: /overseer/queue state: SyncConnected type NodeChildrenChanged
[junit4] 2> 831097 T2116 oasc.ZkController.waitForCoreNodeName look for our core node name
[junit4] 2> 831097 T2070 oasc.ZkController.waitForCoreNodeName look for our core node name
[junit4] 2> 831098 T2130 oasc.ZkController.publish publishing core=solrj_collection_shard1_replica1 state=down
[junit4] 2> 831098 T2091 oasc.ZkController.waitForCoreNodeName look for our core node name
[junit4] 2> 831099 T2077 oasc.DistributedQueue$LatchChildWatcher.process LatchChildWatcher fired on path: /overseer/queue state: SyncConnected type NodeChildrenChanged
[junit4] 2> 831099 T2078 oascc.ZkStateReader.updateClusterState Updating cloud state from ZooKeeper...
[junit4] 2> 831099 T2130 oasc.ZkController.waitForCoreNodeName look for our core node name
[junit4] 2> 831100 T2078 oasc.Overseer$ClusterStateUpdater.updateState Update state numShards=2 message={
[junit4] 2> "operation":"state",
[junit4] 2> "state":"down",
[junit4] 2> "base_url":"http://127.0.0.1:36283/_p",
[junit4] 2> "core":"solrj_collection_shard1_replica2",
[junit4] 2> "roles":null,
[junit4] 2> "node_name":"127.0.0.1:36283__p",
[junit4] 2> "shard":"shard1",
[junit4] 2> "shard_range":null,
[junit4] 2> "shard_state":"active",
[junit4] 2> "shard_parent":null,
[junit4] 2> "collection":"solrj_collection",
[junit4] 2> "numShards":"2",
[junit4] 2> "core_node_name":null}
[junit4] 2> 831107 T2078 oasc.Overseer$ClusterStateUpdater.updateState Update state numShards=2 message={
[junit4] 2> "operation":"state",
[junit4] 2> "state":"down",
[junit4] 2> "base_url":"http://127.0.0.1:50556/_p",
[junit4] 2> "core":"solrj_collection_shard2_replica1",
[junit4] 2> "roles":null,
[junit4] 2> "node_name":"127.0.0.1:50556__p",
[junit4] 2> "shard":"shard2",
[junit4] 2> "shard_range":null,
[junit4] 2> "shard_state":"active",
[junit4] 2> "shard_parent":null,
[junit4] 2> "collection":"solrj_collection",
[junit4] 2> "numShards":"2",
[junit4] 2> "core_node_name":null}
[junit4] 2> 831110 T2077 oasc.DistributedQueue$LatchChildWatcher.process LatchChildWatcher fired on path: /overseer/queue state: SyncConnected type NodeChildrenChanged
[junit4] 2> 831111 T2078 oasc.Overseer$ClusterStateUpdater.updateState Update state numShards=2 message={
[junit4] 2> "operation":"state",
[junit4] 2> "state":"down",
[junit4] 2> "base_url":"http://127.0.0.1:58053/_p",
[junit4] 2> "core":"solrj_collection_shard2_replica2",
[junit4] 2> "roles":null,
[junit4] 2> "node_name":"127.0.0.1:58053__p",
[junit4] 2> "shard":"shard2",
[junit4] 2> "shard_range":null,
[junit4] 2> "shard_state":"active",
[junit4] 2> "shard_parent":null,
[junit4] 2> "collection":"solrj_collection",
[junit4] 2> "numShards":"2",
[junit4] 2> "core_node_name":null}
[junit4] 2> 831113 T2077 oasc.DistributedQueue$LatchChildWatcher.process LatchChildWatcher fired on path: /overseer/queue state: SyncConnected type NodeChildrenChanged
[junit4] 2> 831114 T2078 oasc.Overseer$ClusterStateUpdater.updateState Update state numShards=2 message={
[junit4] 2> "operation":"state",
[junit4] 2> "state":"down",
[junit4] 2> "base_url":"http://127.0.0.1:33873/_p",
[junit4] 2> "core":"solrj_collection_shard1_replica1",
[junit4] 2> "roles":null,
[junit4] 2> "node_name":"127.0.0.1:33873__p",
[junit4] 2> "shard":"shard1",
[junit4] 2> "shard_range":null,
[junit4] 2> "shard_state":"active",
[junit4] 2> "shard_parent":null,
[junit4] 2> "collection":"solrj_collection",
[junit4] 2> "numShards":"2",
[junit4] 2> "core_node_name":null}
[junit4] 2> 831116 T2077 oasc.DistributedQueue$LatchChildWatcher.process LatchChildWatcher fired on path: /overseer/queue state: SyncConnected type NodeChildrenChanged
[junit4] 2> 831219 T2137 oascc.ZkStateReader$2.process A cluster state change: WatchedEvent state:SyncConnected type:NodeDataChanged path:/clusterstate.json, has occurred - updating... (live nodes size: 5)
[junit4] 2> 831219 T2082 oascc.ZkStateReader$2.process A cluster state change: WatchedEvent state:SyncConnected type:NodeDataChanged path:/clusterstate.json, has occurred - updating... (live nodes size: 5)
[junit4] 2> 831219 T2123 oascc.ZkStateReader$2.process A cluster state change: WatchedEvent state:SyncConnected type:NodeDataChanged path:/clusterstate.json, has occurred - updating... (live nodes size: 5)
[junit4] 2> 831219 T2109 oascc.ZkStateReader$2.process A cluster state change: WatchedEvent state:SyncConnected type:NodeDataChanged path:/clusterstate.json, has occurred - updating... (live nodes size: 5)
[junit4] 2> 831219 T2095 oascc.ZkStateReader$2.process A cluster state change: WatchedEvent state:SyncConnected type:NodeDataChanged path:/clusterstate.json, has occurred - updating... (live nodes size: 5)
[junit4] 2> 831219 T2077 oascc.ZkStateReader$2.process A cluster state change: WatchedEvent state:SyncConnected type:NodeDataChanged path:/clusterstate.json, has occurred - updating... (live nodes size: 5)
[junit4] 2> 832098 T2116 oasc.ZkController.waitForShardId waiting to find shard id in clusterstate for solrj_collection_shard1_replica2
[junit4] 2> 832098 T2070 oasc.ZkController.waitForShardId waiting to find shard id in clusterstate for solrj_collection_shard2_replica1
[junit4] 2> 832099 T2091 oasc.ZkController.waitForShardId waiting to find shard id in clusterstate for solrj_collection_shard2_replica2
[junit4] 2> 832100 T2130 oasc.ZkController.waitForShardId waiting to find shard id in clusterstate for solrj_collection_shard1_replica1
[junit4] 2> 832100 T2091 oasc.CoreContainer.create Creating SolrCore 'solrj_collection_shard2_replica2' using instanceDir: ../../../../../../../../../../mnt/ssd/jenkins/workspace/Lucene-Solr-trunk-Linux/solr/build/solr-core/test/J1/./org.apache.solr.cloud.CollectionsAPIDistributedZkTest-jetty1-1389061296261/solrj_collection_shard2_replica2
[junit4] 2> 832101 T2091 oasc.ZkController.createCollectionZkNode Check for collection zkNode:solrj_collection
[junit4] 2> 832101 T2130 oasc.CoreContainer.create Creating SolrCore 'solrj_collection_shard1_replica1' using instanceDir: ../../../../../../../../../../mnt/ssd/jenkins/workspace/Lucene-Solr-trunk-Linux/solr/build/solr-core/test/J1/./org.apache.solr.cloud.CollectionsAPIDistributedZkTest-jetty4-1389061299878/solrj_collection_shard1_replica1
[junit4] 2> 832102 T2130 oasc.ZkController.createCollectionZkNode Check for collection zkNode:solrj_collection
[junit4] 2> 832100 T2116 oasc.CoreContainer.create Creating SolrCore 'solrj_collection_shard1_replica2' using instanceDir: ../../../../../../../../../../mnt/ssd/jenkins/workspace/Lucene-Solr-trunk-Linux/solr/build/solr-core/test/J1/./org.apache.solr.cloud.CollectionsAPIDistributedZkTest-jetty3-1389061298659/solrj_collection_shard1_replica2
[junit4] 2> 832103 T2116 oasc.ZkController.createCollectionZkNode Check for collection zkNode:solrj_collection
[junit4] 2> 832100 T2070 oasc.CoreContainer.create Creating SolrCore 'solrj_collection_shard2_replica1' using instanceDir: ./org.apache.solr.cloud.CollectionsAPIDistributedZkTest-controljetty-1389061295997/solrj_collection_shard2_replica1
[junit4] 2> 832103 T2130 oasc.ZkController.createCollectionZkNode Collection zkNode exists
[junit4] 2> 832102 T2091 oasc.ZkController.createCollectionZkNode Collection zkNode exists
[junit4] 2> 832104 T2130 oascc.ZkStateReader.readConfigName Load collection config from:/collections/solrj_collection
[junit4] 2> 832104 T2116 oasc.ZkController.createCollectionZkNode Collection zkNode exists
[junit4] 2> 832106 T2116 oascc.ZkStateReader.readConfigName Load collection config from:/collections/solrj_collection
[junit4] 2> 832104 T2070 oasc.ZkController.createCollectionZkNode Check for collection zkNode:solrj_collection
[junit4] 2> 832105 T2091 oascc.ZkStateReader.readConfigName Load collection config from:/collections/solrj_collection
[junit4] 2> 832107 T2130 oasc.SolrResourceLoader.<init> new SolrResourceLoader for directory: '../../../../../../../../../../mnt/ssd/jenkins/workspace/Lucene-Solr-trunk-Linux/solr/build/solr-core/test/J1/./org.apache.solr.cloud.CollectionsAPIDistributedZkTest-jetty4-1389061299878/solrj_collection_shard1_replica1/'
[junit4] 2> 832108 T2070 oasc.ZkController.createCollectionZkNode Collection zkNode exists
[junit4] 2> 832108 T2070 oascc.ZkStateReader.readConfigName Load collection config from:/collections/solrj_collection
[junit4] 2> 832108 T2116 oasc.SolrResourceLoader.<init> new SolrResourceLoader for directory: '../../../../../../../../../../mnt/ssd/jenkins/workspace/Lucene-Solr-trunk-Linux/solr/build/solr-core/test/J1/./org.apache.solr.cloud.CollectionsAPIDistributedZkTest-jetty3-1389061298659/solrj_collection_shard1_replica2/'
[junit4] 2> 832109 T2091 oasc.SolrResourceLoader.<init> new SolrResourceLoader for directory: '../../../../../../../../../../mnt/ssd/jenkins/workspace/Lucene-Solr-trunk-Linux/solr/build/solr-core/test/J1/./org.apache.solr.cloud.CollectionsAPIDistributedZkTest-jetty1-1389061296261/solrj_collection_shard2_replica2/'
[junit4] 2> 832111 T2070 oasc.SolrResourceLoader.<init> new SolrResourceLoader for directory: './org.apache.solr.cloud.CollectionsAPIDistributedZkTest-controljetty-1389061295997/solrj_collection_shard2_replica1/'
[junit4] 2> 832150 T2116 oasc.SolrConfig.<init> Using Lucene MatchVersion: LUCENE_50
[junit4] 2> 832153 T2091 oasc.SolrConfig.<init> Using Lucene MatchVersion: LUCENE_50
[junit4] 2> 832162 T2130 oasc.SolrConfig.<init> Using Lucene MatchVersion: LUCENE_50
[junit4] 2> 832172 T2070 oasc.SolrConfig.<init> Using Lucene MatchVersion: LUCENE_50
[junit4] 2> 832180 T2116 oasc.SolrConfig.<init> Loaded SolrConfig: solrconfig.xml
[junit4] 2> 832181 T2116 oass.IndexSchema.readSchema Reading Solr Schema from schema.xml
[junit4] 2> 832182 T2091 oasc.SolrConfig.<init> Loaded SolrConfig: solrconfig.xml
[junit4] 2> 832184 T2091 oass.IndexSchema.readSchema Reading Solr Schema from schema.xml
[junit4] 2> 832188 T2116 oass.IndexSchema.readSchema [solrj_collection_shard1_replica2] Schema name=test
[junit4] 2> 832189 T2130 oasc.SolrConfig.<init> Loaded SolrConfig: solrconfig.xml
[junit4] 2> 832190 T2130 oass.IndexSchema.readSchema Reading Solr Schema from schema.xml
[junit4] 2> 832194 T2091 oass.IndexSchema.readSchema [solrj_collection_shard2_replica2] Schema name=test
[junit4] 2> 832196 T2130 oass.IndexSchema.readSchema [solrj_collection_shard1_replica1] Schema name=test
[junit4] 2> 832208 T2070 oasc.SolrConfig.<init> Loaded SolrConfig: solrconfig.xml
[junit4] 2> 832211 T2070 oass.IndexSchema.readSchema Reading Solr Schema from schema.xml
[junit4] 2> 832222 T2070 oass.IndexSchema.readSchema [solrj_collection_shard2_replica1] Schema name=test
[junit4] 2> 832470 T2116 oass.OpenExchangeRatesOrgProvider.init Initialized with rates=open-exchange-rates.json, refreshInterval=1440.
[junit4] 2> 832475 T2116 oass.IndexSchema.readSchema default search field in schema is text
[junit4] 2> 832478 T2116 oass.IndexSchema.readSchema unique key field: id
[junit4] 2> 832478 T2091 oass.OpenExchangeRatesOrgProvider.init Initialized with rates=open-exchange-rates.json, refreshInterval=1440.
[junit4] 2> 832482 T2091 oass.IndexSchema.readSchema default search field in schema is text
[junit4] 2> 832484 T2091 oass.IndexSchema.readSchema unique key field: id
[junit4] 2> 832497 T2116 oass.FileExchangeRateProvider.reload Reloading exchange rates from file currency.xml
[junit4] 2> 832497 T2130 oass.OpenExchangeRatesOrgProvider.init Initialized with rates=open-exchange-rates.json, refreshInterval=1440.
[junit4] 2> 832500 T2116 oass.FileExchangeRateProvider.reload Reloading exchange rates from file currency.xml
[junit4] 2> 832502 T2130 oass.IndexSchema.readSchema default search field in schema is text
[junit4] 2> 832504 T2116 oass.OpenExchangeRatesOrgProvider.reload Reloading exchange rates from open-exchange-rates.json
[junit4] 2> 832504 T2091 oass.FileExchangeRateProvider.reload Reloading exchange rates from file currency.xml
[junit4] 2> 832504 T2130 oass.IndexSchema.readSchema unique key field: id
[junit4] 2> 832505 T2116 oass.OpenExchangeRatesOrgProvider$OpenExchangeRates.<init> WARN Unknown key IMPORTANT NOTE
[junit4] 2> 832505 T2116 oass.OpenExchangeRatesOrgProvider$OpenExchangeRates.<init> WARN Expected key, got STRING
[junit4] 2> 832505 T2116 oass.OpenExchangeRatesOrgProvider.reload Reloading exchange rates from open-exchange-rates.json
[junit4] 2> 832506 T2116 oass.OpenExchangeRatesOrgProvider$OpenExchangeRates.<init> WARN Unknown key IMPORTANT NOTE
[junit4] 2> 832506 T2116 oass.OpenExchangeRatesOrgProvider$OpenExchangeRates.<init> WARN Expected key, got STRING
[junit4] 2> 832507 T2116 oasc.SolrCore.initDirectoryFactory org.apache.solr.core.MockDirectoryFactory
[junit4] 2> 832507 T2091 oass.FileExchangeRateProvider.reload Reloading exchange rates from file currency.xml
[junit4] 2> 832507 T2116 oasc.SolrCore.<init> [solrj_collection_shard1_replica2] Opening new SolrCore at ../../../../../../../../../../mnt/ssd/jenkins/workspace/Lucene-Solr-trunk-Linux/solr/build/solr-core/test/J1/./org.apache.solr.cloud.CollectionsAPIDistributedZkTest-jetty3-1389061298659/solrj_collection_shard1_replica2/, dataDir=../../../../../../../../../../mnt/ssd/jenkins/workspace/Lucene-Solr-trunk-Linux/solr/build/solr-core/test/J1/./org.apache.solr.cloud.CollectionsAPIDistributedZkTest-jetty3-1389061298659/solrj_collection_shard1_replica2/data/
[junit4] 2> 832508 T2116 oasc.JmxMonitoredMap.<init> JMX monitoring is enabled. Adding Solr mbeans to JMX Server: com.sun.jmx.mbeanserver.JmxMBeanServer@361b9546
[junit4] 2> 832508 T2116 oasc.CachingDirectoryFactory.get return new directory for ../../../../../../../../../../mnt/ssd/jenkins/workspace/Lucene-Solr-trunk-Linux/solr/build/solr-core/test/J1/./org.apache.solr.cloud.CollectionsAPIDistributedZkTest-jetty3-1389061298659/solrj_collection_shard1_replica2/data
[junit4] 2> 832509 T2116 oasc.SolrCore.getNewIndexDir New index directory detected: old=null new=../../../../../../../../../../mnt/ssd/jenkins/workspace/Lucene-Solr-trunk-Linux/solr/build/solr-core/test/J1/./org.apache.solr.cloud.CollectionsAPIDistributedZkTest-jetty3-1389061298659/solrj_collection_shard1_replica2/data/index/
[junit4] 2> 832509 T2116 oasc.SolrCore.initIndex WARN [solrj_collection_shard1_replica2] Solr index directory '../../../../../../../../../../mnt/ssd/jenkins/workspace/Lucene-Solr-trunk-Linux/solr/build/solr-core/test/J1/./org.apache.solr.cloud.CollectionsAPIDistributedZkTest-jetty3-1389061298659/solrj_collection_shard1_replica2/data/index' doesn't exist. Creating new index...
[junit4] 2> 832509 T2116 oasc.CachingDirectoryFactory.get return new directory for ../../../../../../../../../../mnt/ssd/jenkins/workspace/Lucene-Solr-trunk-Linux/solr/build/solr-core/test/J1/./org.apache.solr.cloud.CollectionsAPIDistributedZkTest-jetty3-1389061298659/solrj_collection_shard1_replica2/data/index
[junit4] 2> 832510 T2116 oasu.RandomMergePolicy.<init> RandomMergePolicy wrapping class org.apache.lucene.index.TieredMergePolicy: [TieredMergePolicy: maxMergeAtOnce=26, maxMergeAtOnceExplicit=20, maxMergedSegmentMB=43.7421875, floorSegmentMB=1.66015625, forceMergeDeletesPctAllowed=6.425685166470538, segmentsPerTier=47.0, maxCFSSegmentSizeMB=8.796093022207999E12, noCFSRatio=0.0
[junit4] 2> 832510 T2091 oass.OpenExchangeRatesOrgProvider.reload Reloading exchange rates from open-exchange-rates.json
[junit4] 2> 832510 T2116 oasc.SolrDeletionPolicy.onCommit SolrDeletionPolicy.onCommit: commits: num=1
[junit4] 2> commit{dir=MockDirectoryWrapper(RateLimitedDirectoryWrapper(org.apache.lucene.store.RAMDirectory@446214ff lockFactory=org.apache.lucene.store.SingleInstanceLockFactory@3333d078)),segFN=segments_1,generation=1}
[junit4] 2> 832511 T2116 oasc.SolrDeletionPolicy.updateCommits newest commit generation = 1
[junit4] 2> 832510 T2070 oass.OpenExchangeRatesOrgProvider.init Initialized with rates=open-exchange-rates.json, refreshInterval=1440.
[junit4] 2> 832511 T2091 oass.OpenExchangeRatesOrgProvider$OpenExchangeRates.<init> WARN Unknown key IMPORTANT NOTE
[junit4] 2> 832512 T2091 oass.OpenExchangeRatesOrgProvider$OpenExchangeRates.<init> WARN Expected key, got STRING
[junit4] 2> 832512 T2091 oass.OpenExchangeRatesOrgProvider.reload Reloading exchange rates from open-exchange-rates.json
[junit4] 2> 832513 T2091 oass.OpenExchangeRatesOrgProvider$OpenExchangeRates.<init> WARN Unknown key IMPORTANT NOTE
[junit4] 2> 832513 T2091 oass.OpenExchangeRatesOrgProvider$OpenExchangeRates.<init> WARN Expected key, got STRING
[junit4] 2> 832514 T2091 oasc.SolrCore.initDirectoryFactory org.apache.solr.core.MockDirectoryFactory
[junit4] 2> 832514 T2091 oasc.SolrCore.<init> [solrj_collection_shard2_replica2] Opening new SolrCore at ../../../../../../../../../../mnt/ssd/jenkins/workspace/Lucene-Solr-trunk-Linux/solr/build/solr-core/test/J1/./org.apache.solr.cloud.CollectionsAPIDistributedZkTest-jetty1-1389061296261/solrj_collection_shard2_replica2/, dataDir=../../../../../../../../../../mnt/ssd/jenkins/workspace/Lucene-Solr-trunk-Linux/solr/build/solr-core/test/J1/./org.apache.solr.cloud.CollectionsAPIDistributedZkTest-jetty1-1389061296261/solrj_collection_shard2_replica2/data/
[junit4] 2> 832514 T2116 oasup.UpdateRequestProcessorChain.init creating updateRequestProcessorChain "nodistrib"
[junit4] 2> 832514 T2091 oasc.JmxMonitoredMap.<init> JMX monitoring is enabled. Adding Solr mbeans to JMX Server: com.sun.jmx.mbeanserver.JmxMBeanServer@361b9546
[junit4] 2> 832515 T2116 oasup.UpdateRequestProcessorChain.init creating updateRequestProcessorChain "dedupe"
[junit4] 2> 832515 T2116 oasup.UpdateRequestProcessorChain.init inserting DistributedUpdateProcessorFactory into updateRequestProcessorChain "dedupe"
[junit4] 2> 832515 T2116 oasup.UpdateRequestProcessorChain.init creating updateRequestProcessorChain "stored_sig"
[junit4] 2> 832515 T2091 oasc.CachingDirectoryFactory.get return new directory for ../../../../../../../../../../mnt/ssd/jenkins/workspace/Lucene-Solr-trunk-Linux/solr/build/solr-core/test/J1/./org.apache.solr.cloud.CollectionsAPIDistributedZkTest-jetty1-1389061296261/solrj_collection_shard2_replica2/data
[junit4] 2> 832516 T2116 oasup.UpdateRequestProcessorChain.init inserting DistributedUpdateProcessorFactory into updateRequestProcessorChain "stored_sig"
[junit4] 2> 832516 T2070 oass.IndexSchema.readSchema default search field in schema is text
[junit4] 2> 832516 T2116 oasup.UpdateRequestProcessorChain.init creating updateRequestProcessorChain "distrib-dup-test-chain-explicit"
[junit4] 2> 832516 T2130 oass.FileExchangeRateProvider.reload Reloading exchange rates from file currency.xml
[junit4] 2> 832516 T2091 oasc.SolrCore.getNewIndexDir New index directory detected: old=null new=../../../../../../../../../../mnt/ssd/jenkins/workspace/Lucene-Solr-trunk-Linux/solr/build/solr-core/test/J1/./org.apache.solr.cloud.CollectionsAPIDistributedZkTest-jetty1-1389061296261/solrj_collection_shard2_replica2/data/index/
[junit4] 2> 832517 T2116 oasup.UpdateRequestProcessorChain.init creating updateRequestProcessorChain "distrib-dup-test-chain-implicit"
[junit4] 2> 832517 T2091 oasc.SolrCore.initIndex WARN [solrj_collection_shard2_replica2] Solr index directory '../../../../../../../../../../mnt/ssd/jenkins/workspace/Lucene-Solr-trunk-Linux/solr/build/solr-core/test/J1/./org.apache.solr.cloud.CollectionsAPIDistributedZkTest-jetty1-1389061296261/solrj_collection_shard2_replica2/data/index' doesn't exist. Creating new index...
[junit4] 2> 832517 T2116 oasup.UpdateRequestProcessorChain.init inserting DistributedUpdateProcessorFactory into updateRequestProcessorChain "distrib-dup-test-chain-implicit"
[junit4] 2> 832518 T2116 oasc.SolrCore.loadUpdateProcessorChains no updateRequestProcessorChain defined as default, creating implicit default
[junit4] 2> 832518 T2070 oass.IndexSchema.readSchema unique key field: id
[junit4] 2> 832518 T2091 oasc.CachingDirectoryFactory.get return new directory for ../../../../../../../../../../mnt/ssd/jenkins/workspace/Lucene-Solr-trunk-Linux/solr/build/solr-core/test/J1/./org.apache.solr.cloud.CollectionsAPIDistributedZkTest-jetty1-1389061296261/solrj_collection_shard2_replica2/data/index
[junit4] 2> 832518 T2116 oasc.RequestHandlers.initHandlersFromConfig created standard: solr.StandardRequestHandler
[junit4] 2> 832519 T2091 oasu.RandomMergePolicy.<init> RandomMergePolicy wrapping class org.apache.lucene.index.TieredMergePolicy: [TieredMergePolicy: maxMergeAtOnce=26, maxMergeAtOnceExplicit=20, maxMergedSegmentMB=43.7421875, floorSegmentMB=1.66015625, forceMergeDeletesPctAllowed=6.425685166470538, segmentsPerTier=47.0, maxCFSSegmentSizeMB=8.796093022207999E12, noCFSRatio=0.0
[junit4] 2> 832519 T2116 oasc.RequestHandlers.initHandlersFromConfig created /get: solr.RealTimeGetHandler
[junit4] 2> 832519 T2116 oasc.RequestHandlers.initHandlersFromConfig adding lazy requestHandler: solr.ReplicationHandler
[junit4] 2> 832519 T2091 oasc.SolrDeletionPolicy.onCommit SolrDeletionPolicy.onCommit: commits: num=1
[junit4] 2> commit{dir=MockDirectoryWrapper(RateLimitedDirectoryWrapper(org.apache.lucene.store.RAMDirectory@3a935c03 lockFactory=org.apache.lucene.store.SingleInstanceLockFactory@3b229554)),segFN=segments_1,generation=1}
[junit4] 2> 832520 T2091 oasc.SolrDeletionPolicy.updateCommits newest commit generation = 1
[junit4] 2> 832520 T2116 oasc.RequestHandlers.initHandlersFromConfig created /replication: solr.ReplicationHandler
[junit4] 2> 832519 T2130 oass.FileExchangeRateProvider.reload Reloading exchange rates from file currency.xml
[junit4] 2> 832521 T2116 oasc.RequestHandlers.initHandlersFromConfig created /update: solr.UpdateRequestHandler
[junit4] 2> 832521 T2116 oasc.RequestHandlers.initHandlersFromConfig created /admin/: org.apache.solr.handler.admin.AdminHandlers
[junit4] 2> 832522 T2116 oasc.RequestHandlers.initHandlersFromConfig created /admin/file: solr.admin.ShowFileRequestHandler
[junit4] 2> 832522 T2116 oasc.RequestHandlers.initHandlersFromConfig created /admin/fileedit: solr.admin.EditFileRequestHandler
[junit4] 2> 832523 T2091 oasup.UpdateRequestProcessorChain.init creating updateRequestProcessorChain "nodistrib"
[junit4] 2> 832523 T2130 oass.OpenExchangeRatesOrgProvider.reload Reloading exchange rates from open-exchange-rates.json
[junit4] 2> 832523 T2091 oasup.UpdateRequestProcessorChain.init creating updateRequestProcessorChain "dedupe"
[junit4] 2> 832524 T2091 oasup.UpdateRequestProcessorChain.init inserting DistributedUpdateProcessorFactory into updateRequestProcessorChain "dedupe"
[junit4] 2> 832524 T2091 oasup.UpdateRequestProcessorChain.init creating updateRequestProcessorChain "stored_sig"
[junit4] 2> 832524 T2130 oass.OpenExchangeRatesOrgProvider$OpenExchangeRates.<init> WARN Unknown key IMPORTANT NOTE
[junit4] 2> 832525 T2116 oashl.XMLLoader.init xsltCacheLifetimeSeconds=60
[junit4] 2> 832525 T2130 oass.OpenExchangeRatesOrgProvider$OpenExchangeRates.<init> WARN Expected key, got STRING
[junit4] 2> 832525 T2130 oass.OpenExchangeRatesOrgProvider.reload Reloading exchange rates from open-exchange-rates.json
[junit4] 2> 832525 T2091 oasup.UpdateRequestProcessorChain.init inserting DistributedUpdateProcessorFactory into updateRequestProcessorChain "stored_sig"
[junit4] 2> 832526 T2091 oasup.UpdateRequestProcessorChain.init creating updateRequestProcessorChain "distrib-dup-test-chain-explicit"
[junit4] 2> 832526 T2130 oass.OpenExchangeRatesOrgProvider$OpenExchangeRates.<init> WARN Unknown key IMPORTANT NOTE
[junit4] 2> 832527 T2130 oass.OpenExchangeRatesOrgProvider$OpenExchangeRates.<init> WARN Expected key, got STRING
[junit4] 2> 832526 T2091 oasup.UpdateRequestProcessorChain.init creating updateRequestProcessorChain "distrib-dup-test-chain-implicit"
[junit4] 2> 832527 T2116 oasu.CommitTracker.<init> Hard AutoCommit: disabled
[junit4] 2> 832527 T2130 oasc.SolrCore.initDirectoryFactory org.apache.solr.core.MockDirectoryFactory
[junit4] 2> 832527 T2116 oasu.CommitTracker.<init> Soft AutoCommit: disabled
[junit4] 2> 832527 T2091 oasup.UpdateRequestProcessorChain.init inserting DistributedUpdateProcessorFactory into updateRequestProcessorChain "distrib-dup-test-chain-implicit"
[junit4] 2> 832528 T2116 oasu.RandomMergePolicy.<init> RandomMergePolicy wrapping class org.apache.lucene.index.TieredMergePolicy: [TieredMergePolicy: maxMergeAtOnce=10, maxMergeAtOnceExplicit=29, maxMergedSegmentMB=78.0, floorSegmentMB=1.873046875, forceMergeDeletesPctAllowed=26.20751698640305, segmentsPerTier=48.0, maxCFSSegmentSizeMB=8.796093022207999E12, noCFSRatio=0.22525529456979312
[junit4] 2> 832528 T2091 oasc.SolrCore.loadUpdateProcessorChains no updateRequestProcessorChain defined as default, creating implicit default
[junit4] 2> 832528 T2130 oasc.SolrCore.<init> [solrj_collection_shard1_replica1] Opening new SolrCore at ../../../../../../../../../../mnt/ssd/jenkins/workspace/Lucene-Solr-trunk-Linux/solr/build/solr-core/test/J1/./org.apache.solr.cloud.CollectionsAPIDistributedZkTest-jetty4-1389061299878/solrj_collection_shard1_replica1/, dataDir=../../../../../../../../../../mnt/ssd/jenkins/workspace/Lucene-Solr-trunk-Linux/solr/build/solr-core/test/J1/./org.apache.solr.cloud.CollectionsAPIDistributedZkTest-jetty4-1389061299878/solrj_collection_shard1_replica1/data/
[junit4] 2> 832529 T2116 oasc.SolrDeletionPolicy.onInit SolrDeletionPolicy.onInit: commits: num=1
[junit4] 2> commit{dir=MockDirectoryWrapper(RateLimitedDirectoryWrapper(org.apache.lucene.store.RAMDirectory@446214ff lockFactory=org.apache.lucene.store.SingleInstanceLockFactory@3333d078)),segFN=segments_1,generation=1}
[junit4] 2> 832529 T2130 oasc.JmxMonitoredMap.<init> JMX monitoring is enabled. Adding Solr mbeans to JMX Server: com.sun.jmx.mbeanserver.JmxMBeanServer@361b9546
[junit4] 2> 832529 T2091 oasc.RequestHandlers.initHandlersFromConfig created standard: solr.StandardRequestHandler
[junit4] 2> 832529 T2070 oass.FileExchangeRateProvider.reload Reloading exchange rates from file currency.xml
[junit4] 2> 832530 T2130 oasc.CachingDirectoryFactory.get return new directory for ../../../../../../../../../../mnt/ssd/jenkins/workspace/Lucene-Solr-trunk-Linux/solr/build/solr-core/test/J1/./org.apache.solr.cloud.CollectionsAPIDistributedZkTest-jetty4-1389061299878/solrj_collection_shard1_replica1/data
[junit4] 2> 832529 T2116 oasc.SolrDeletionPolicy.updateCommits newest commit generation = 1
[junit4] 2> 832530 T2130 oasc.SolrCore.getNewIndexDir New index directory detected: old=null new=../../../../../../../../../../mnt/ssd/jenkins/workspace/Lucene-Solr-trunk-Linux/solr/build/solr-core/test/J1/./org.apache.solr.cloud.CollectionsAPIDistributedZkTest-jetty4-1389061299878/solrj_collection_shard1_replica1/data/index/
[junit4] 2> 832531 T2130 oasc.SolrCore.initIndex WARN [solrj_collection_shard1_replica1] Solr index directory '../../../../../../../../../../mnt/ssd/jenkins/workspace/Lucene-Solr-trunk-Linux/solr/build/solr-core/test/J1/./org.apache.solr.cloud.CollectionsAPIDistributedZkTest-jetty4-1389061299878/solrj_collection_shard1_replica1/data/index' doesn't exist. Creating new index...
[junit4] 2> 832530 T2091 oasc.RequestHandlers.initHandlersFromConfig created /get: solr.RealTimeGetHandler
[junit4] 2> 832531 T2130 oasc.CachingDirectoryFactory.get return new directory for ../../../../../../../../../../mnt/ssd/jenkins/workspace/Lucene-Solr-trunk-Linux/solr/build/solr-core/test/J1/./org.apache.solr.cloud.CollectionsAPIDistributedZkTest-jetty4-1389061299878/solrj_collection_shard1_replica1/data/index
[junit4] 2> 832530 T2116 oass.SolrIndexSearcher.<init> Opening Searcher@3a0f04b3 main
[junit4] 2> 832531 T2130 oasu.RandomMergePolicy.<init> RandomMergePolicy wrapping class org.apache.lucene.index.TieredMergePolicy: [TieredMergePolicy: maxMergeAtOnce=26, maxMergeAtOnceExplicit=20, maxMergedSegmentMB=43.7421875, floorSegmentMB=1.66015625, forceMergeDeletesPctAllowed=6.425685166470538, segmentsPerTier=47.0, maxCFSSegmentSizeMB=8.796093022207999E12, noCFSRatio=0.0
[junit4] 2> 832531 T2091 oasc.RequestHandlers.initHandlersFromConfig adding lazy requestHandler: solr.ReplicationHandler
[junit4] 2> 832532 T2091 oasc.RequestHandlers.initHandlersFromConfig created /replication: solr.ReplicationHandler
[junit4] 2> 832532 T2130 oasc.SolrDeletionPolicy.onCommit SolrDeletionPolicy.onCommit: commits: num=1
[junit4] 2> commit{dir=MockDirectoryWrapper(RateLimitedDirectoryWrapper(org.apache.lucene.store.RAMDirectory@2ffda18c lockFactory=org.apache.lucene.store.SingleInstanceLockFactory@35df1640)),segFN=segments_1,generation=1}
[junit4] 2> 832533 T2091 oasc.RequestHandlers.initHandlersFromConfig created /update: solr.UpdateRequestHandler
[junit4] 2> 832532 T2070 oass.FileExchangeRateProvider.reload Reloading exchange rates from file currency.xml
[junit4] 2> 832533 T2091 oasc.RequestHandlers.initHandlersFromConfig created /admin/: org.apache.solr.handler.admin.AdminHandlers
[junit4] 2> 832533 T2130 oasc.SolrDeletionPolicy.updateCommits newest commit generation = 1
[junit4] 2> 832534 T2091 oasc.RequestHandlers.initHandlersFromConfig created /admin/file: solr.admin.ShowFileRequestHandler
[junit4] 2> 832534 T2143 oasc.SolrCore.registerSearcher [solrj_collection_shard1_replica2] Registered new searcher Searcher@3a0f04b3 main{StandardDirectoryReader(segments_1:1:nrt)}
[junit4] 2> 832535 T2091 oasc.RequestHandlers.initHandlersFromConfig created /admin/fileedit: solr.admin.EditFileRequestHandler
[junit4] 2> 832536 T2116 oasc.CoreContainer.registerCore registering core: solrj_collection_shard1_replica2
[junit4] 2> 832536 T2116 oasc.ZkController.register Register replica - core:solrj_collection_shard1_replica2 address:http://127.0.0.1:36283/_p collection:solrj_collection shard:shard1
[junit4] 2> 832536 T2070 oass.OpenExchangeRatesOrgProvider.reload Reloading exchange rates from open-exchange-rates.json
[junit4] 2> 832536 T2091 oashl.XMLLoader.init xsltCacheLifetimeSeconds=60
[junit4] 2> 832537 T2116 oascc.SolrZkClient.makePath makePath: /collections/solrj_collection/leader_elect/shard1/election
[junit4] 2> 832537 T2070 oass.OpenExchangeRatesOrgProvider$OpenExchangeRates.<init> WARN Unknown key IMPORTANT NOTE
[junit4] 2> 832538 T2070 oass.OpenExchangeRatesOrgProvider$OpenExchangeRates.<init> WARN Expected key, got STRING
[junit4] 2> 832538 T2070 oass.OpenExchangeRatesOrgProvider.reload Reloading exchange rates from open-exchange-rates.json
[junit4] 2> 832538 T2130 oasup.UpdateRequestProcessorChain.init creating updateRequestProcessorChain "nodistrib"
[junit4] 2> 832539 T2130 oasup.UpdateRequestProcessorChain.init creating updateRequestProcessorChain "dedupe"
[junit4] 2> 832539 T2091 oasu.CommitTracker.<init> Hard AutoCommit: disabled
[junit4] 2> 832539 T2130 oasup.UpdateRequestProcessorChain.init inserting DistributedUpdateProcessorFactory into updateRequestProcessorChain "dedupe"
[junit4] 2> 832539 T2091 oasu.CommitTracker.<init> Soft AutoCommit: disabled
[junit4] 2> 832540 T2130 oasup.UpdateRequestProcessorChain.init creating updateRequestProcessorChain "stored_sig"
[junit4] 2> 832540 T2070 oass.OpenExchangeRatesOrgProvider$OpenExchangeRates.<init> WARN Unknown key IMPORTANT NOTE
[junit4] 2> 832541 T2070 oass.OpenExchangeRatesOrgProvider$OpenExchangeRates.<init> WARN Expected key, got STRING
[junit4] 2> 832540 T2130 oasup.UpdateRequestProcessorChain.init inserting DistributedUpdateProcessorFactory into updateRequestProcessorChain "stored_sig"
[junit4] 2> 832540 T2091 oasu.RandomMergePolicy.<init> RandomMergePolicy wrapping class org.apache.lucene.index.TieredMergePolicy: [TieredMergePolicy: maxMergeAtOnce=10, maxMergeAtOnceExplicit=29, maxMergedSegmentMB=78.0, floorSegmentMB=1.873046875, forceMergeDeletesPctAllowed=26.20751698640305, segmentsPerTier=48.0, maxCFSSegmentSizeMB=8.796093022207999E12, noCFSRatio=0.22525529456979312
[junit4] 2> 832541 T2130 oasup.UpdateRequestProcessorChain.init creating updateRequestProcessorChain "distrib-dup-test-chain-explicit"
[junit4] 2> 832541 T2070 oasc.SolrCore.initDirectoryFactory org.apache.solr.core.MockDirectoryFactory
[junit4] 2> 832542 T2091 oasc.SolrDeletionPolicy.onInit SolrDeletionPolicy.onInit: commits: num=1
[junit4] 2> commit{dir=MockDirectoryWrapper(RateLimitedDirectoryWrapper(org.apache.lucene.store.RAMDirectory@3a935c03 lockFactory=org.apache.lucene.store.SingleInstanceLockFactory@3b229554)),segFN=segments_1,generation=1}
[junit4] 2> 832542 T2070 oasc.SolrCore.<init> [solrj_collection_shard2_replica1] Opening new SolrCore at ./org.apache.solr.cloud.CollectionsAPIDistributedZkTest-controljetty-1389061295997/solrj_collection_shard2_replica1/, dataDir=./org.apache.solr.cloud.CollectionsAPIDistributedZkTest-controljetty-1389061295997/solrj_collection_shard2_replica1/data/
[junit4] 2> 832542 T2130 oasup.UpdateRequestProcessorChain.init creating updateRequestProcessorChain "distrib-dup-test-chain-implicit"
[junit4] 2> 832543 T2070 oasc.JmxMonitoredMap.<init> JMX monitoring is enabled. Adding Solr mbeans to JMX Server: com.sun.jmx.mbeanserver.JmxMBeanServer@361b9546
[junit4] 2> 832543 T2091 oasc.SolrDeletionPolicy.updateCommits newest commit generation = 1
[junit4] 2> 832543 T2130 oasup.UpdateRequestProcessorChain.init inserting DistributedUpdateProcessorFactory into updateRequestProcessorChain "distrib-dup-test-chain-implicit"
[junit4] 2> 832544 T2091 oass.SolrIndexSearcher.<init> Opening Searcher@52a8d879 main
[junit4] 2> 832544 T2070 oasc.CachingDirectoryFactory.get return new directory for ./org.apache.solr.cloud.CollectionsAPIDistributedZkTest-controljetty-1389061295997/solrj_collection_shard2_replica1/data
[junit4] 2> 832544 T2130 oasc.SolrCore.loadUpdateProcessorChains no updateRequestProcessorChain defined as default, creating implicit default
[junit4] 2> 832545 T2116 oasc.ShardLeaderElectionContext.runLeaderProcess Running the leader process for shard shard1
[junit4] 2> 832545 T2070 oasc.SolrCore.getNewIndexDir New index directory detected: old=null new=./org.apache.solr.cloud.CollectionsAPIDistributedZkTest-controljetty-1389061295997/solrj_collection_shard2_replica1/data/index/
[junit4] 2> 832546 T2130 oasc.RequestHandlers.initHandlersFromConfig created standard: solr.StandardRequestHandler
[junit4] 2> 832546 T2070 oasc.SolrCore.initIndex WARN [solrj_collection_shard2_replica1] Solr index directory './org.apache.solr.cloud.CollectionsAPIDistributedZkTest-controljetty-1389061295997/solrj_collection_shard2_replica1/data/index' doesn't exist. Creating new index...
[junit4] 2> 832547 T2130 oasc.RequestHandlers.initHandlersFromConfig created /get: solr.RealTimeGetHandler
[junit4] 2> 832547 T2130 oasc.RequestHandlers.initHandlersFromConfig adding lazy requestHandler: solr.ReplicationHandler
[junit4] 2> 832547 T2070 oasc.CachingDirectoryFactory.get return new directory for ./org.apache.solr.cloud.CollectionsAPIDistributedZkTest-controljetty-1389061295997/solrj_collection_shard2_replica1/data/index
[junit4] 2> 832548 T2077 oasc.DistributedQueue$LatchChildWatcher.process LatchChildWatcher fired on path: /overseer/queue state: SyncConnected type NodeChildrenChanged
[junit4] 2> 832548 T2070 oasu.RandomMergePolicy.<init> RandomMergePolicy wrapping class org.apache.lucene.index.TieredMergePolicy: [TieredMergePolicy: maxMergeAtOnce=26, maxMergeAtOnceExplicit=20, maxMergedSegmentMB=43.7421875, floorSegmentMB=1.66015625, forceMergeDeletesPctAllowed=6.425685166470538, segmentsPerTier=47.0, maxCFSSegmentSizeMB=8.796093022207999E12, noCFSRatio=0.0
[junit4] 2> 832548 T2116 oasc.ShardLeaderElectionContext.waitForReplicasToComeUp Waiting until we see more replicas up for shard shard1: total=2 found=1 timeoutin=180000
[junit4] 2> 832547 T2145 oasc.SolrCore.registerSearcher [solrj_collection_shard2_replica2] Registered new searcher Searcher@52a8d879 main{StandardDirectoryReader(segments_1:1:nrt)}
[junit4] 2> 832549 T2070 oasc.SolrDeletionPolicy.onCommit SolrDeletionPolicy.onCommit: commits: num=1
[junit4] 2> commit{dir=MockDirectoryWrapper(RateLimitedDirectoryWrapper(org.apache.lucene.store.RAMDirectory@6303effb lockFactory=org.apache.lucene.store.SingleInstanceLockFactory@ad11916)),segFN=segments_1,generation=1}
[junit4] 2> 832549 T2070 oasc.SolrDeletionPolicy.updateCommits newest commit generation = 1
[junit4] 2> 832547 T2130 oasc.RequestHandlers.initHandlersFromConfig created /replication: solr.ReplicationHandler
[junit4] 2> 832549 T2091 oasc.CoreContainer.registerCore registering core: solrj_collection_shard2_replica2
[junit4] 2> 832548 T2077 oasc.DistributedQueue$LatchChildWatcher.process LatchChildWatcher fired on path: /overseer/queue state: SyncConnected type NodeChildrenChanged
[junit4] 2> 832550 T2091 oasc.ZkController.register Register replica - core:solrj_collection_shard2_replica2 address:http://127.0.0.1:58053/_p collection:solrj_collection shard:shard2
[junit4] 2> 832550 T2130 oasc.RequestHandlers.initHandlersFromConfig created /update: solr.UpdateRequestHandler
[junit4] 2> 832550 T2077 oasc.DistributedQueue$LatchChildWatcher.process LatchChildWatcher fired on path: /overseer/queue state: SyncConnected type NodeChildrenChanged
[junit4] 2> 832551 T2130 oasc.RequestHand
[...truncated too long message...]
lr-core/test/J1/./org.apache.solr.cloud.CollectionsAPIDistributedZkTest-jetty4-1389061299878/acollectionafterbaddelete_shard1_replica2/data;done=false>>]
[junit4] 2> 964874 T2051 oasc.CachingDirectoryFactory.close Closing directory: ../../../../../../../../../../mnt/ssd/jenkins/workspace/Lucene-Solr-trunk-Linux/solr/build/solr-core/test/J1/./org.apache.solr.cloud.CollectionsAPIDistributedZkTest-jetty4-1389061299878/acollectionafterbaddelete_shard1_replica2/data
[junit4] 2> 964874 T2051 oasc.CachingDirectoryFactory.closeCacheValue looking to close ../../../../../../../../../../mnt/ssd/jenkins/workspace/Lucene-Solr-trunk-Linux/solr/build/solr-core/test/J1/./org.apache.solr.cloud.CollectionsAPIDistributedZkTest-jetty4-1389061299878/acollectionafterbaddelete_shard1_replica2/data/index [CachedDir<<refCount=0;path=../../../../../../../../../../mnt/ssd/jenkins/workspace/Lucene-Solr-trunk-Linux/solr/build/solr-core/test/J1/./org.apache.solr.cloud.CollectionsAPIDistributedZkTest-jetty4-1389061299878/acollectionafterbaddelete_shard1_replica2/data/index;done=false>>]
[junit4] 2> 964874 T2051 oasc.CachingDirectoryFactory.close Closing directory: ../../../../../../../../../../mnt/ssd/jenkins/workspace/Lucene-Solr-trunk-Linux/solr/build/solr-core/test/J1/./org.apache.solr.cloud.CollectionsAPIDistributedZkTest-jetty4-1389061299878/acollectionafterbaddelete_shard1_replica2/data/index
[junit4] 2> 964874 T2051 oasc.SolrCore.close [halfdeletedcollection_shard2_replica1] CLOSING SolrCore org.apache.solr.core.SolrCore@2e8cd336
[junit4] 2> 964880 T2051 oasu.DirectUpdateHandler2.close closing DirectUpdateHandler2{commits=0,autocommits=0,soft autocommits=0,optimizes=0,rollbacks=0,expungeDeletes=0,docsPending=0,adds=0,deletesById=0,deletesByQuery=0,errors=0,cumulative_adds=0,cumulative_deletesById=0,cumulative_deletesByQuery=0,cumulative_errors=0,transaction_logs_total_size=0,transaction_logs_total_number=0}
[junit4] 2> 964880 T2051 oasu.SolrCoreState.decrefSolrCoreState Closing SolrCoreState
[junit4] 2> 964880 T2051 oasu.DefaultSolrCoreState.closeIndexWriter SolrCoreState ref count has reached 0 - closing IndexWriter
[junit4] 2> 964881 T2051 oasu.DefaultSolrCoreState.closeIndexWriter closing IndexWriter with IndexWriterCloser
[junit4] 2> 964881 T2051 oasc.SolrCore.closeSearcher [halfdeletedcollection_shard2_replica1] Closing main searcher on request.
[junit4] 2> 964881 T2051 oasc.CachingDirectoryFactory.close Closing MockDirectoryFactory - 2 directories currently being tracked
[junit4] 2> 964881 T2051 oasc.CachingDirectoryFactory.closeCacheValue looking to close ../../../../../../../../../../mnt/ssd/jenkins/workspace/Lucene-Solr-trunk-Linux/solr/build/solr-core/test/J1/./org.apache.solr.cloud.CollectionsAPIDistributedZkTest-jetty4-1389061299878/halfdeletedcollection_shard2_replica1/data [CachedDir<<refCount=0;path=../../../../../../../../../../mnt/ssd/jenkins/workspace/Lucene-Solr-trunk-Linux/solr/build/solr-core/test/J1/./org.apache.solr.cloud.CollectionsAPIDistributedZkTest-jetty4-1389061299878/halfdeletedcollection_shard2_replica1/data;done=false>>]
[junit4] 2> 964882 T2051 oasc.CachingDirectoryFactory.close Closing directory: ../../../../../../../../../../mnt/ssd/jenkins/workspace/Lucene-Solr-trunk-Linux/solr/build/solr-core/test/J1/./org.apache.solr.cloud.CollectionsAPIDistributedZkTest-jetty4-1389061299878/halfdeletedcollection_shard2_replica1/data
[junit4] 2> 964882 T2051 oasc.CachingDirectoryFactory.closeCacheValue looking to close ../../../../../../../../../../mnt/ssd/jenkins/workspace/Lucene-Solr-trunk-Linux/solr/build/solr-core/test/J1/./org.apache.solr.cloud.CollectionsAPIDistributedZkTest-jetty4-1389061299878/halfdeletedcollection_shard2_replica1/data/index [CachedDir<<refCount=0;path=../../../../../../../../../../mnt/ssd/jenkins/workspace/Lucene-Solr-trunk-Linux/solr/build/solr-core/test/J1/./org.apache.solr.cloud.CollectionsAPIDistributedZkTest-jetty4-1389061299878/halfdeletedcollection_shard2_replica1/data/index;done=false>>]
[junit4] 2> 964882 T2051 oasc.CachingDirectoryFactory.close Closing directory: ../../../../../../../../../../mnt/ssd/jenkins/workspace/Lucene-Solr-trunk-Linux/solr/build/solr-core/test/J1/./org.apache.solr.cloud.CollectionsAPIDistributedZkTest-jetty4-1389061299878/halfdeletedcollection_shard2_replica1/data/index
[junit4] 2> 964908 T2051 oejsh.ContextHandler.doStop stopped o.e.j.s.ServletContextHandler{/_p,null}
[junit4] 2> 964962 T2051 oas.SolrTestCaseJ4.tearDown ###Ending testDistribSearch
[junit4] 2> 964967 T2051 oasc.ZkTestServer.send4LetterWord connecting to 127.0.0.1:55169 55169
[junit4] 1> client port:0.0.0.0/0.0.0.0:0
[junit4] 1> client port:0.0.0.0/0.0.0.0:55169
[junit4] 2> NOTE: reproduce with: ant test -Dtestcase=CollectionsAPIDistributedZkTest -Dtests.method=testDistribSearch -Dtests.seed=B8E15445FEB7CCB2 -Dtests.multiplier=3 -Dtests.slow=true -Dtests.locale=sl -Dtests.timezone=Etc/GMT+1 -Dtests.file.encoding=ISO-8859-1
[junit4] FAILURE 139s J1 | CollectionsAPIDistributedZkTest.testDistribSearch <<<
[junit4] > Throwable #1: java.lang.AssertionError
[junit4] > at __randomizedtesting.SeedInfo.seed([B8E15445FEB7CCB2:3907DA5D89E8AC8E]:0)
[junit4] > at org.apache.solr.cloud.CollectionsAPIDistributedZkTest.deleteCollectionWithDownNodes(CollectionsAPIDistributedZkTest.java:390)
[junit4] > at org.apache.solr.cloud.CollectionsAPIDistributedZkTest.doTest(CollectionsAPIDistributedZkTest.java:203)
[junit4] > at org.apache.solr.BaseDistributedSearchTestCase.testDistribSearch(BaseDistributedSearchTestCase.java:867)
[junit4] > at java.lang.Thread.run(Thread.java:744)
[junit4] 2> 965076 T2051 oas.SolrTestCaseJ4.deleteCore ###deleteCore
[junit4] 2> 139452 T2050 ccr.ThreadLeakControl.checkThreadLeaks WARNING Will linger awaiting termination of 3 leaked thread(s).
[junit4] 2> 966277 T2123 oascc.ZkStateReader$3.process WARN ZooKeeper watch triggered, but Solr cannot talk to ZK
[junit4] 2> 966385 T2209 oascc.ZkStateReader$3.process WARN ZooKeeper watch triggered, but Solr cannot talk to ZK
[junit4] 2> NOTE: test params are: codec=Lucene42, sim=RandomSimilarityProvider(queryNorm=true,coord=crazy): {}, locale=sl, timezone=Etc/GMT+1
[junit4] 2> NOTE: Linux 3.8.0-35-generic amd64/Oracle Corporation 1.7.0_60-ea (64-bit)/cpus=8,threads=3,free=248758480,total=518979584
[junit4] 2> NOTE: All tests run in this JVM: [LeaderElectionIntegrationTest, TestStressLucene, TestOmitPositions, FullSolrCloudDistribCmdsTest, StatsComponentTest, AssignTest, TestFieldTypeResource, TestCursorMarkWithoutUniqueKey, TestFieldCollectionResource, RangeFacetTest, DisMaxRequestHandlerTest, MinimalSchemaTest, TestDistributedGrouping, DateFieldTest, FieldFacetExtrasTest, TestUpdate, TestSchemaNameResource, XsltUpdateRequestHandlerTest, NoFacetTest, DirectSolrSpellCheckerTest, SpellCheckCollatorTest, ShardRoutingCustomTest, TestCSVLoader, TestZkChroot, RequestHandlersTest, PluginInfoTest, TestXIncludeConfig, TestPartialUpdateDeduplication, TestAtomicUpdateErrorCases, TimeZoneUtilsTest, TestPhraseSuggestions, TestSchemaResource, DocValuesMultiTest, TestImplicitCoreProperties, TestDFRSimilarityFactory, NotRequiredUniqueKeyTest, TestLazyCores, CursorMarkTest, DefaultValueUpdateProcessorTest, TestJmxIntegration, TestQuerySenderNoQuery, DocumentAnalysisRequestHandlerTest, JSONWriterTest, TestSolrQueryParserDefaultOperatorResource, TestSerializedLuceneMatchVersion, DistribCursorPagingTest, TestSolrDeletionPolicy2, TestBinaryResponseWriter, TestFoldingMultitermQuery, TestArbitraryIndexDir, TestRandomFaceting, QueryFacetTest, ChangedSchemaMergeTest, TestCoreDiscovery, TestDefaultSimilarityFactory, BlockDirectoryTest, TestIndexSearcher, TestBinaryField, AddBlockUpdateTest, PrimUtilsTest, TestUtils, TestFastOutputStream, SuggesterWFSTTest, HighlighterTest, BadIndexSchemaTest, DocValuesMissingTest, TestRecovery, FieldAnalysisRequestHandlerTest, TestComponentsName, SignatureUpdateProcessorFactoryTest, CoreContainerCoreInitFailuresTest, PreAnalyzedFieldTest, FieldFacetTest, UniqFieldsUpdateProcessorFactoryTest, BasicDistributedZk2Test, TestQueryTypes, PreAnalyzedUpdateProcessorTest, TestFieldResource, BasicZkTest, XmlUpdateRequestHandlerTest, DirectSolrConnectionTest, ZkSolrClientTest, TestCodecSupport, AliasIntegrationTest, TestCollationField, TermVectorComponentDistributedTest, CurrencyFieldXmlFileTest, CollectionsAPIDistributedZkTest]
[junit4] Completed on J1 in 140.98s, 1 test, 1 failure <<< FAILURES!
[...truncated 538 lines...]
BUILD FAILED
/mnt/ssd/jenkins/workspace/Lucene-Solr-trunk-Linux/build.xml:453: The following error occurred while executing this line:
/mnt/ssd/jenkins/workspace/Lucene-Solr-trunk-Linux/build.xml:433: The following error occurred while executing this line:
/mnt/ssd/jenkins/workspace/Lucene-Solr-trunk-Linux/build.xml:39: The following error occurred while executing this line:
/mnt/ssd/jenkins/workspace/Lucene-Solr-trunk-Linux/extra-targets.xml:37: The following error occurred while executing this line:
/mnt/ssd/jenkins/workspace/Lucene-Solr-trunk-Linux/solr/build.xml:189: The following error occurred while executing this line:
/mnt/ssd/jenkins/workspace/Lucene-Solr-trunk-Linux/solr/common-build.xml:491: The following error occurred while executing this line:
/mnt/ssd/jenkins/workspace/Lucene-Solr-trunk-Linux/lucene/common-build.xml:1304: The following error occurred while executing this line:
/mnt/ssd/jenkins/workspace/Lucene-Solr-trunk-Linux/lucene/common-build.xml:937: There were test failures: 362 suites, 1586 tests, 1 failure, 34 ignored (6 assumptions)
Total time: 45 minutes 22 seconds
Build step 'Invoke Ant' marked build as failure
Description set: Java: 64bit/jdk1.7.0_60-ea-b02 -XX:-UseCompressedOops -XX:+UseConcMarkSweepGC
Archiving artifacts
Recording test results
Email was triggered for: Failure
Sending email for trigger: Failure