You are viewing a plain text version of this content. The canonical link for it is here.
Posted to builds@lucene.apache.org by Policeman Jenkins Server via builds <bu...@lucene.apache.org> on 2026/10/19 17:34:47 UTC

[JENKINS-EA] Lucene-main-Linux (64bit/hotspot/jdk-27-ea+32) - Build # 68042 - Unstable!

Build: https://jenkins.thetaphi.de/job/Lucene-main-Linux/68042/
Java: 64bit/hotspot/jdk-27-ea+32 -XX:-UseCompressedOops -XX:+UseG1GC

1 tests failed.
FAILED:  org.apache.lucene.search.TestExplicitFloatVectorSimilarityQuery.testVectorsAboveSimilarity

Error Message:
java.lang.AssertionError: expected:<194> but was:<193>

Stack Trace:
java.lang.AssertionError: expected:<194> but was:<193>
	at __randomizedtesting.SeedInfo.seed([419932A6A08056A3:D87510823BB63108]:0)
	at org.junit.Assert.fail(Assert.java:89)
	at org.junit.Assert.failNotEquals(Assert.java:835)
	at org.junit.Assert.assertEquals(Assert.java:647)
	at org.junit.Assert.assertEquals(Assert.java:633)
	at org.apache.lucene.search.BaseExplicitVectorSimilarityQueryTestCase.testVectorsAboveSimilarity(BaseExplicitVectorSimilarityQueryTestCase.java:428)
	at org.apache.lucene.search.TestExplicitFloatVectorSimilarityQuery.testVectorsAboveSimilarity(TestExplicitFloatVectorSimilarityQuery.java:26)