You are viewing a plain text version of this content. The canonical link for it is here.
Posted to builds@lucene.apache.org by Apache Jenkins Server <je...@builds.apache.org> on 2026/01/24 04:29:59 UTC

[JENKINS] Lucene » Lucene-NightlyTests-main - Build # 1899 - Unstable!

Build: https://ci-builds.apache.org/job/Lucene/job/Lucene-NightlyTests-main/1899/

10 tests failed.
FAILED:  org.apache.lucene.backward_codecs.lucene50.TestLucene50StoredFieldsFormat.testMergeStability

Error Message:
java.lang.AssertionError: expected:<{fnm=77, fdt=73138, fdx=94, fdm=158}> but was:<{cfs=73529, cfe=150}>

Stack Trace:
java.lang.AssertionError: expected:<{fnm=77, fdt=73138, fdx=94, fdm=158}> but was:<{cfs=73529, cfe=150}>
	at __randomizedtesting.SeedInfo.seed([3800F50A26442230:4C4CB3252BAE2086]:0)
	at junit@4.13.2/org.junit.Assert.fail(Assert.java:89)
	at junit@4.13.2/org.junit.Assert.failNotEquals(Assert.java:835)
	at junit@4.13.2/org.junit.Assert.assertEquals(Assert.java:120)
	at junit@4.13.2/org.junit.Assert.assertEquals(Assert.java:146)
	at org.apache.lucene.test_framework@11.0.0-SNAPSHOT/org.apache.lucene.tests.index.BaseIndexFileFormatTestCase.testMergeStability(BaseIndexFileFormatTestCase.java:306)
	at java.base/jdk.internal.reflect.DirectMethodHandleAccessor.invoke(DirectMethodHandleAccessor.java:104)
	at java.base/java.lang.reflect.Method.invoke(Method.java:565)
	at randomizedtesting.runner@2.8.3/com.carrotsearch.randomizedtesting.RandomizedRunner.invoke(RandomizedRunner.java:1763)
	at randomizedtesting.runner@2.8.3/com.carrotsearch.randomizedtesting.RandomizedRunner$8.evaluate(RandomizedRunner.java:946)
	at randomizedtesting.runner@2.8.3/com.carrotsearch.randomizedtesting.RandomizedRunner$9.evaluate(RandomizedRunner.java:982)
	at randomizedtesting.runner@2.8.3/com.carrotsearch.randomizedtesting.RandomizedRunner$10.evaluate(RandomizedRunner.java:996)
	at org.apache.lucene.test_framework@11.0.0-SNAPSHOT/org.apache.lucene.tests.util.TestRuleSetupTeardownChained$1.evaluate(TestRuleSetupTeardownChained.java:48)
	at org.apache.lucene.test_framework@11.0.0-SNAPSHOT/org.apache.lucene.tests.util.AbstractBeforeAfterRule$1.evaluate(AbstractBeforeAfterRule.java:43)
	at org.apache.lucene.test_framework@11.0.0-SNAPSHOT/org.apache.lucene.tests.util.TestRuleThreadAndTestName$1.evaluate(TestRuleThreadAndTestName.java:45)
	at org.apache.lucene.test_framework@11.0.0-SNAPSHOT/org.apache.lucene.tests.util.TestRuleIgnoreAfterMaxFailures$1.evaluate(TestRuleIgnoreAfterMaxFailures.java:60)
	at org.apache.lucene.test_framework@11.0.0-SNAPSHOT/org.apache.lucene.tests.util.TestRuleMarkFailure$1.evaluate(TestRuleMarkFailure.java:44)
	at junit@4.13.2/org.junit.rules.RunRules.evaluate(RunRules.java:20)
	at randomizedtesting.runner@2.8.3/com.carrotsearch.randomizedtesting.rules.StatementAdapter.evaluate(StatementAdapter.java:36)
	at randomizedtesting.runner@2.8.3/com.carrotsearch.randomizedtesting.ThreadLeakControl$StatementRunner.run(ThreadLeakControl.java:390)
	at randomizedtesting.runner@2.8.3/com.carrotsearch.randomizedtesting.ThreadLeakControl.forkTimeoutingTask(ThreadLeakControl.java:843)
	at randomizedtesting.runner@2.8.3/com.carrotsearch.randomizedtesting.ThreadLeakControl$3.evaluate(ThreadLeakControl.java:490)
	at randomizedtesting.runner@2.8.3/com.carrotsearch.randomizedtesting.RandomizedRunner.runSingleTest(RandomizedRunner.java:955)
	at randomizedtesting.runner@2.8.3/com.carrotsearch.randomizedtesting.RandomizedRunner$5.evaluate(RandomizedRunner.java:840)
	at randomizedtesting.runner@2.8.3/com.carrotsearch.randomizedtesting.RandomizedRunner$6.evaluate(RandomizedRunner.java:891)
	at randomizedtesting.runner@2.8.3/com.carrotsearch.randomizedtesting.RandomizedRunner$7.evaluate(RandomizedRunner.java:902)
	at org.apache.lucene.test_framework@11.0.0-SNAPSHOT/org.apache.lucene.tests.util.AbstractBeforeAfterRule$1.evaluate(AbstractBeforeAfterRule.java:43)
	at randomizedtesting.runner@2.8.3/com.carrotsearch.randomizedtesting.rules.StatementAdapter.evaluate(StatementAdapter.java:36)
	at org.apache.lucene.test_framework@11.0.0-SNAPSHOT/org.apache.lucene.tests.util.TestRuleStoreClassName$1.evaluate(TestRuleStoreClassName.java:38)
	at randomizedtesting.runner@2.8.3/com.carrotsearch.randomizedtesting.rules.NoShadowingOrOverridesOnMethodsRule$1.evaluate(NoShadowingOrOverridesOnMethodsRule.java:40)
	at randomizedtesting.runner@2.8.3/com.carrotsearch.randomizedtesting.rules.NoShadowingOrOverridesOnMethodsRule$1.evaluate(NoShadowingOrOverridesOnMethodsRule.java:40)
	at randomizedtesting.runner@2.8.3/com.carrotsearch.randomizedtesting.rules.StatementAdapter.evaluate(StatementAdapter.java:36)
	at randomizedtesting.runner@2.8.3/com.carrotsearch.randomizedtesting.rules.StatementAdapter.evaluate(StatementAdapter.java:36)
	at org.apache.lucene.test_framework@11.0.0-SNAPSHOT/org.apache.lucene.tests.util.TestRuleAssertionsRequired$1.evaluate(TestRuleAssertionsRequired.java:52)
	at org.apache.lucene.test_framework@11.0.0-SNAPSHOT/org.apache.lucene.tests.util.AbstractBeforeAfterRule$1.evaluate(AbstractBeforeAfterRule.java:43)
	at org.apache.lucene.test_framework@11.0.0-SNAPSHOT/org.apache.lucene.tests.util.TestRuleMarkFailure$1.evaluate(TestRuleMarkFailure.java:44)
	at org.apache.lucene.test_framework@11.0.0-SNAPSHOT/org.apache.lucene.tests.util.TestRuleIgnoreAfterMaxFailures$1.evaluate(TestRuleIgnoreAfterMaxFailures.java:60)
	at org.apache.lucene.test_framework@11.0.0-SNAPSHOT/org.apache.lucene.tests.util.TestRuleIgnoreTestSuites$1.evaluate(TestRuleIgnoreTestSuites.java:47)
	at junit@4.13.2/org.junit.rules.RunRules.evaluate(RunRules.java:20)
	at randomizedtesting.runner@2.8.3/com.carrotsearch.randomizedtesting.rules.StatementAdapter.evaluate(StatementAdapter.java:36)
	at randomizedtesting.runner@2.8.3/com.carrotsearch.randomizedtesting.ThreadLeakControl$StatementRunner.run(ThreadLeakControl.java:390)
	at randomizedtesting.runner@2.8.3/com.carrotsearch.randomizedtesting.ThreadLeakControl.lambda$forkTimeoutingTask$0(ThreadLeakControl.java:850)
	at java.base/java.lang.Thread.run(Thread.java:1474)


FAILED:  org.apache.lucene.backward_codecs.lucene50.TestLucene50StoredFieldsFormatHighCompression.testMergeStability

Error Message:
java.lang.AssertionError: expected:<{fnm=77, fdt=48128, fdx=80, fdm=159}> but was:<{cfs=48506, cfe=150}>

Stack Trace:
java.lang.AssertionError: expected:<{fnm=77, fdt=48128, fdx=80, fdm=159}> but was:<{cfs=48506, cfe=150}>
	at __randomizedtesting.SeedInfo.seed([3800F50A26442230:4C4CB3252BAE2086]:0)
	at junit@4.13.2/org.junit.Assert.fail(Assert.java:89)
	at junit@4.13.2/org.junit.Assert.failNotEquals(Assert.java:835)
	at junit@4.13.2/org.junit.Assert.assertEquals(Assert.java:120)
	at junit@4.13.2/org.junit.Assert.assertEquals(Assert.java:146)
	at org.apache.lucene.test_framework@11.0.0-SNAPSHOT/org.apache.lucene.tests.index.BaseIndexFileFormatTestCase.testMergeStability(BaseIndexFileFormatTestCase.java:306)
	at java.base/jdk.internal.reflect.DirectMethodHandleAccessor.invoke(DirectMethodHandleAccessor.java:104)
	at java.base/java.lang.reflect.Method.invoke(Method.java:565)
	at randomizedtesting.runner@2.8.3/com.carrotsearch.randomizedtesting.RandomizedRunner.invoke(RandomizedRunner.java:1763)
	at randomizedtesting.runner@2.8.3/com.carrotsearch.randomizedtesting.RandomizedRunner$8.evaluate(RandomizedRunner.java:946)
	at randomizedtesting.runner@2.8.3/com.carrotsearch.randomizedtesting.RandomizedRunner$9.evaluate(RandomizedRunner.java:982)
	at randomizedtesting.runner@2.8.3/com.carrotsearch.randomizedtesting.RandomizedRunner$10.evaluate(RandomizedRunner.java:996)
	at org.apache.lucene.test_framework@11.0.0-SNAPSHOT/org.apache.lucene.tests.util.TestRuleSetupTeardownChained$1.evaluate(TestRuleSetupTeardownChained.java:48)
	at org.apache.lucene.test_framework@11.0.0-SNAPSHOT/org.apache.lucene.tests.util.AbstractBeforeAfterRule$1.evaluate(AbstractBeforeAfterRule.java:43)
	at org.apache.lucene.test_framework@11.0.0-SNAPSHOT/org.apache.lucene.tests.util.TestRuleThreadAndTestName$1.evaluate(TestRuleThreadAndTestName.java:45)
	at org.apache.lucene.test_framework@11.0.0-SNAPSHOT/org.apache.lucene.tests.util.TestRuleIgnoreAfterMaxFailures$1.evaluate(TestRuleIgnoreAfterMaxFailures.java:60)
	at org.apache.lucene.test_framework@11.0.0-SNAPSHOT/org.apache.lucene.tests.util.TestRuleMarkFailure$1.evaluate(TestRuleMarkFailure.java:44)
	at junit@4.13.2/org.junit.rules.RunRules.evaluate(RunRules.java:20)
	at randomizedtesting.runner@2.8.3/com.carrotsearch.randomizedtesting.rules.StatementAdapter.evaluate(StatementAdapter.java:36)
	at randomizedtesting.runner@2.8.3/com.carrotsearch.randomizedtesting.ThreadLeakControl$StatementRunner.run(ThreadLeakControl.java:390)
	at randomizedtesting.runner@2.8.3/com.carrotsearch.randomizedtesting.ThreadLeakControl.forkTimeoutingTask(ThreadLeakControl.java:843)
	at randomizedtesting.runner@2.8.3/com.carrotsearch.randomizedtesting.ThreadLeakControl$3.evaluate(ThreadLeakControl.java:490)
	at randomizedtesting.runner@2.8.3/com.carrotsearch.randomizedtesting.RandomizedRunner.runSingleTest(RandomizedRunner.java:955)
	at randomizedtesting.runner@2.8.3/com.carrotsearch.randomizedtesting.RandomizedRunner$5.evaluate(RandomizedRunner.java:840)
	at randomizedtesting.runner@2.8.3/com.carrotsearch.randomizedtesting.RandomizedRunner$6.evaluate(RandomizedRunner.java:891)
	at randomizedtesting.runner@2.8.3/com.carrotsearch.randomizedtesting.RandomizedRunner$7.evaluate(RandomizedRunner.java:902)
	at org.apache.lucene.test_framework@11.0.0-SNAPSHOT/org.apache.lucene.tests.util.AbstractBeforeAfterRule$1.evaluate(AbstractBeforeAfterRule.java:43)
	at randomizedtesting.runner@2.8.3/com.carrotsearch.randomizedtesting.rules.StatementAdapter.evaluate(StatementAdapter.java:36)
	at org.apache.lucene.test_framework@11.0.0-SNAPSHOT/org.apache.lucene.tests.util.TestRuleStoreClassName$1.evaluate(TestRuleStoreClassName.java:38)
	at randomizedtesting.runner@2.8.3/com.carrotsearch.randomizedtesting.rules.NoShadowingOrOverridesOnMethodsRule$1.evaluate(NoShadowingOrOverridesOnMethodsRule.java:40)
	at randomizedtesting.runner@2.8.3/com.carrotsearch.randomizedtesting.rules.NoShadowingOrOverridesOnMethodsRule$1.evaluate(NoShadowingOrOverridesOnMethodsRule.java:40)
	at randomizedtesting.runner@2.8.3/com.carrotsearch.randomizedtesting.rules.StatementAdapter.evaluate(StatementAdapter.java:36)
	at randomizedtesting.runner@2.8.3/com.carrotsearch.randomizedtesting.rules.StatementAdapter.evaluate(StatementAdapter.java:36)
	at org.apache.lucene.test_framework@11.0.0-SNAPSHOT/org.apache.lucene.tests.util.TestRuleAssertionsRequired$1.evaluate(TestRuleAssertionsRequired.java:52)
	at org.apache.lucene.test_framework@11.0.0-SNAPSHOT/org.apache.lucene.tests.util.AbstractBeforeAfterRule$1.evaluate(AbstractBeforeAfterRule.java:43)
	at org.apache.lucene.test_framework@11.0.0-SNAPSHOT/org.apache.lucene.tests.util.TestRuleMarkFailure$1.evaluate(TestRuleMarkFailure.java:44)
	at org.apache.lucene.test_framework@11.0.0-SNAPSHOT/org.apache.lucene.tests.util.TestRuleIgnoreAfterMaxFailures$1.evaluate(TestRuleIgnoreAfterMaxFailures.java:60)
	at org.apache.lucene.test_framework@11.0.0-SNAPSHOT/org.apache.lucene.tests.util.TestRuleIgnoreTestSuites$1.evaluate(TestRuleIgnoreTestSuites.java:47)
	at junit@4.13.2/org.junit.rules.RunRules.evaluate(RunRules.java:20)
	at randomizedtesting.runner@2.8.3/com.carrotsearch.randomizedtesting.rules.StatementAdapter.evaluate(StatementAdapter.java:36)
	at randomizedtesting.runner@2.8.3/com.carrotsearch.randomizedtesting.ThreadLeakControl$StatementRunner.run(ThreadLeakControl.java:390)
	at randomizedtesting.runner@2.8.3/com.carrotsearch.randomizedtesting.ThreadLeakControl.lambda$forkTimeoutingTask$0(ThreadLeakControl.java:850)
	at java.base/java.lang.Thread.run(Thread.java:1474)


FAILED:  org.apache.lucene.backward_codecs.lucene50.TestLucene50StoredFieldsFormatMergeInstance.testMergeStability

Error Message:
java.lang.AssertionError: expected:<{fnm=77, fdt=73138, fdx=94, fdm=158}> but was:<{cfs=73529, cfe=150}>

Stack Trace:
java.lang.AssertionError: expected:<{fnm=77, fdt=73138, fdx=94, fdm=158}> but was:<{cfs=73529, cfe=150}>
	at __randomizedtesting.SeedInfo.seed([3800F50A26442230:4C4CB3252BAE2086]:0)
	at junit@4.13.2/org.junit.Assert.fail(Assert.java:89)
	at junit@4.13.2/org.junit.Assert.failNotEquals(Assert.java:835)
	at junit@4.13.2/org.junit.Assert.assertEquals(Assert.java:120)
	at junit@4.13.2/org.junit.Assert.assertEquals(Assert.java:146)
	at org.apache.lucene.test_framework@11.0.0-SNAPSHOT/org.apache.lucene.tests.index.BaseIndexFileFormatTestCase.testMergeStability(BaseIndexFileFormatTestCase.java:306)
	at java.base/jdk.internal.reflect.DirectMethodHandleAccessor.invoke(DirectMethodHandleAccessor.java:104)
	at java.base/java.lang.reflect.Method.invoke(Method.java:565)
	at randomizedtesting.runner@2.8.3/com.carrotsearch.randomizedtesting.RandomizedRunner.invoke(RandomizedRunner.java:1763)
	at randomizedtesting.runner@2.8.3/com.carrotsearch.randomizedtesting.RandomizedRunner$8.evaluate(RandomizedRunner.java:946)
	at randomizedtesting.runner@2.8.3/com.carrotsearch.randomizedtesting.RandomizedRunner$9.evaluate(RandomizedRunner.java:982)
	at randomizedtesting.runner@2.8.3/com.carrotsearch.randomizedtesting.RandomizedRunner$10.evaluate(RandomizedRunner.java:996)
	at org.apache.lucene.test_framework@11.0.0-SNAPSHOT/org.apache.lucene.tests.util.TestRuleSetupTeardownChained$1.evaluate(TestRuleSetupTeardownChained.java:48)
	at org.apache.lucene.test_framework@11.0.0-SNAPSHOT/org.apache.lucene.tests.util.AbstractBeforeAfterRule$1.evaluate(AbstractBeforeAfterRule.java:43)
	at org.apache.lucene.test_framework@11.0.0-SNAPSHOT/org.apache.lucene.tests.util.TestRuleThreadAndTestName$1.evaluate(TestRuleThreadAndTestName.java:45)
	at org.apache.lucene.test_framework@11.0.0-SNAPSHOT/org.apache.lucene.tests.util.TestRuleIgnoreAfterMaxFailures$1.evaluate(TestRuleIgnoreAfterMaxFailures.java:60)
	at org.apache.lucene.test_framework@11.0.0-SNAPSHOT/org.apache.lucene.tests.util.TestRuleMarkFailure$1.evaluate(TestRuleMarkFailure.java:44)
	at junit@4.13.2/org.junit.rules.RunRules.evaluate(RunRules.java:20)
	at randomizedtesting.runner@2.8.3/com.carrotsearch.randomizedtesting.rules.StatementAdapter.evaluate(StatementAdapter.java:36)
	at randomizedtesting.runner@2.8.3/com.carrotsearch.randomizedtesting.ThreadLeakControl$StatementRunner.run(ThreadLeakControl.java:390)
	at randomizedtesting.runner@2.8.3/com.carrotsearch.randomizedtesting.ThreadLeakControl.forkTimeoutingTask(ThreadLeakControl.java:843)
	at randomizedtesting.runner@2.8.3/com.carrotsearch.randomizedtesting.ThreadLeakControl$3.evaluate(ThreadLeakControl.java:490)
	at randomizedtesting.runner@2.8.3/com.carrotsearch.randomizedtesting.RandomizedRunner.runSingleTest(RandomizedRunner.java:955)
	at randomizedtesting.runner@2.8.3/com.carrotsearch.randomizedtesting.RandomizedRunner$5.evaluate(RandomizedRunner.java:840)
	at randomizedtesting.runner@2.8.3/com.carrotsearch.randomizedtesting.RandomizedRunner$6.evaluate(RandomizedRunner.java:891)
	at randomizedtesting.runner@2.8.3/com.carrotsearch.randomizedtesting.RandomizedRunner$7.evaluate(RandomizedRunner.java:902)
	at org.apache.lucene.test_framework@11.0.0-SNAPSHOT/org.apache.lucene.tests.util.AbstractBeforeAfterRule$1.evaluate(AbstractBeforeAfterRule.java:43)
	at randomizedtesting.runner@2.8.3/com.carrotsearch.randomizedtesting.rules.StatementAdapter.evaluate(StatementAdapter.java:36)
	at org.apache.lucene.test_framework@11.0.0-SNAPSHOT/org.apache.lucene.tests.util.TestRuleStoreClassName$1.evaluate(TestRuleStoreClassName.java:38)
	at randomizedtesting.runner@2.8.3/com.carrotsearch.randomizedtesting.rules.NoShadowingOrOverridesOnMethodsRule$1.evaluate(NoShadowingOrOverridesOnMethodsRule.java:40)
	at randomizedtesting.runner@2.8.3/com.carrotsearch.randomizedtesting.rules.NoShadowingOrOverridesOnMethodsRule$1.evaluate(NoShadowingOrOverridesOnMethodsRule.java:40)
	at randomizedtesting.runner@2.8.3/com.carrotsearch.randomizedtesting.rules.StatementAdapter.evaluate(StatementAdapter.java:36)
	at randomizedtesting.runner@2.8.3/com.carrotsearch.randomizedtesting.rules.StatementAdapter.evaluate(StatementAdapter.java:36)
	at org.apache.lucene.test_framework@11.0.0-SNAPSHOT/org.apache.lucene.tests.util.TestRuleAssertionsRequired$1.evaluate(TestRuleAssertionsRequired.java:52)
	at org.apache.lucene.test_framework@11.0.0-SNAPSHOT/org.apache.lucene.tests.util.AbstractBeforeAfterRule$1.evaluate(AbstractBeforeAfterRule.java:43)
	at org.apache.lucene.test_framework@11.0.0-SNAPSHOT/org.apache.lucene.tests.util.TestRuleMarkFailure$1.evaluate(TestRuleMarkFailure.java:44)
	at org.apache.lucene.test_framework@11.0.0-SNAPSHOT/org.apache.lucene.tests.util.TestRuleIgnoreAfterMaxFailures$1.evaluate(TestRuleIgnoreAfterMaxFailures.java:60)
	at org.apache.lucene.test_framework@11.0.0-SNAPSHOT/org.apache.lucene.tests.util.TestRuleIgnoreTestSuites$1.evaluate(TestRuleIgnoreTestSuites.java:47)
	at junit@4.13.2/org.junit.rules.RunRules.evaluate(RunRules.java:20)
	at randomizedtesting.runner@2.8.3/com.carrotsearch.randomizedtesting.rules.StatementAdapter.evaluate(StatementAdapter.java:36)
	at randomizedtesting.runner@2.8.3/com.carrotsearch.randomizedtesting.ThreadLeakControl$StatementRunner.run(ThreadLeakControl.java:390)
	at randomizedtesting.runner@2.8.3/com.carrotsearch.randomizedtesting.ThreadLeakControl.lambda$forkTimeoutingTask$0(ThreadLeakControl.java:850)
	at java.base/java.lang.Thread.run(Thread.java:1474)


FAILED:  org.apache.lucene.backward_codecs.lucene50.TestLucene50TermVectorsFormat.testMergeStability

Error Message:
java.lang.AssertionError: expected:<{tvd=30287, fnm=686, nvm=283, tvm=162, tmd=820, fdm=159, pos=11197, fdt=93, tvx=93, doc=14493, tim=22700, tip=106, fdx=72, nvd=20138}> but was:<{cfs=101351, cfe=415}>

Stack Trace:
java.lang.AssertionError: expected:<{tvd=30287, fnm=686, nvm=283, tvm=162, tmd=820, fdm=159, pos=11197, fdt=93, tvx=93, doc=14493, tim=22700, tip=106, fdx=72, nvd=20138}> but was:<{cfs=101351, cfe=415}>
	at __randomizedtesting.SeedInfo.seed([3800F50A26442230:4C4CB3252BAE2086]:0)
	at junit@4.13.2/org.junit.Assert.fail(Assert.java:89)
	at junit@4.13.2/org.junit.Assert.failNotEquals(Assert.java:835)
	at junit@4.13.2/org.junit.Assert.assertEquals(Assert.java:120)
	at junit@4.13.2/org.junit.Assert.assertEquals(Assert.java:146)
	at org.apache.lucene.test_framework@11.0.0-SNAPSHOT/org.apache.lucene.tests.index.BaseIndexFileFormatTestCase.testMergeStability(BaseIndexFileFormatTestCase.java:306)
	at java.base/jdk.internal.reflect.DirectMethodHandleAccessor.invoke(DirectMethodHandleAccessor.java:104)
	at java.base/java.lang.reflect.Method.invoke(Method.java:565)
	at randomizedtesting.runner@2.8.3/com.carrotsearch.randomizedtesting.RandomizedRunner.invoke(RandomizedRunner.java:1763)
	at randomizedtesting.runner@2.8.3/com.carrotsearch.randomizedtesting.RandomizedRunner$8.evaluate(RandomizedRunner.java:946)
	at randomizedtesting.runner@2.8.3/com.carrotsearch.randomizedtesting.RandomizedRunner$9.evaluate(RandomizedRunner.java:982)
	at randomizedtesting.runner@2.8.3/com.carrotsearch.randomizedtesting.RandomizedRunner$10.evaluate(RandomizedRunner.java:996)
	at org.apache.lucene.test_framework@11.0.0-SNAPSHOT/org.apache.lucene.tests.util.TestRuleSetupTeardownChained$1.evaluate(TestRuleSetupTeardownChained.java:48)
	at org.apache.lucene.test_framework@11.0.0-SNAPSHOT/org.apache.lucene.tests.util.AbstractBeforeAfterRule$1.evaluate(AbstractBeforeAfterRule.java:43)
	at org.apache.lucene.test_framework@11.0.0-SNAPSHOT/org.apache.lucene.tests.util.TestRuleThreadAndTestName$1.evaluate(TestRuleThreadAndTestName.java:45)
	at org.apache.lucene.test_framework@11.0.0-SNAPSHOT/org.apache.lucene.tests.util.TestRuleIgnoreAfterMaxFailures$1.evaluate(TestRuleIgnoreAfterMaxFailures.java:60)
	at org.apache.lucene.test_framework@11.0.0-SNAPSHOT/org.apache.lucene.tests.util.TestRuleMarkFailure$1.evaluate(TestRuleMarkFailure.java:44)
	at junit@4.13.2/org.junit.rules.RunRules.evaluate(RunRules.java:20)
	at randomizedtesting.runner@2.8.3/com.carrotsearch.randomizedtesting.rules.StatementAdapter.evaluate(StatementAdapter.java:36)
	at randomizedtesting.runner@2.8.3/com.carrotsearch.randomizedtesting.ThreadLeakControl$StatementRunner.run(ThreadLeakControl.java:390)
	at randomizedtesting.runner@2.8.3/com.carrotsearch.randomizedtesting.ThreadLeakControl.forkTimeoutingTask(ThreadLeakControl.java:843)
	at randomizedtesting.runner@2.8.3/com.carrotsearch.randomizedtesting.ThreadLeakControl$3.evaluate(ThreadLeakControl.java:490)
	at randomizedtesting.runner@2.8.3/com.carrotsearch.randomizedtesting.RandomizedRunner.runSingleTest(RandomizedRunner.java:955)
	at randomizedtesting.runner@2.8.3/com.carrotsearch.randomizedtesting.RandomizedRunner$5.evaluate(RandomizedRunner.java:840)
	at randomizedtesting.runner@2.8.3/com.carrotsearch.randomizedtesting.RandomizedRunner$6.evaluate(RandomizedRunner.java:891)
	at randomizedtesting.runner@2.8.3/com.carrotsearch.randomizedtesting.RandomizedRunner$7.evaluate(RandomizedRunner.java:902)
	at org.apache.lucene.test_framework@11.0.0-SNAPSHOT/org.apache.lucene.tests.util.AbstractBeforeAfterRule$1.evaluate(AbstractBeforeAfterRule.java:43)
	at randomizedtesting.runner@2.8.3/com.carrotsearch.randomizedtesting.rules.StatementAdapter.evaluate(StatementAdapter.java:36)
	at org.apache.lucene.test_framework@11.0.0-SNAPSHOT/org.apache.lucene.tests.util.TestRuleStoreClassName$1.evaluate(TestRuleStoreClassName.java:38)
	at randomizedtesting.runner@2.8.3/com.carrotsearch.randomizedtesting.rules.NoShadowingOrOverridesOnMethodsRule$1.evaluate(NoShadowingOrOverridesOnMethodsRule.java:40)
	at randomizedtesting.runner@2.8.3/com.carrotsearch.randomizedtesting.rules.NoShadowingOrOverridesOnMethodsRule$1.evaluate(NoShadowingOrOverridesOnMethodsRule.java:40)
	at randomizedtesting.runner@2.8.3/com.carrotsearch.randomizedtesting.rules.StatementAdapter.evaluate(StatementAdapter.java:36)
	at randomizedtesting.runner@2.8.3/com.carrotsearch.randomizedtesting.rules.StatementAdapter.evaluate(StatementAdapter.java:36)
	at org.apache.lucene.test_framework@11.0.0-SNAPSHOT/org.apache.lucene.tests.util.TestRuleAssertionsRequired$1.evaluate(TestRuleAssertionsRequired.java:52)
	at org.apache.lucene.test_framework@11.0.0-SNAPSHOT/org.apache.lucene.tests.util.AbstractBeforeAfterRule$1.evaluate(AbstractBeforeAfterRule.java:43)
	at org.apache.lucene.test_framework@11.0.0-SNAPSHOT/org.apache.lucene.tests.util.TestRuleMarkFailure$1.evaluate(TestRuleMarkFailure.java:44)
	at org.apache.lucene.test_framework@11.0.0-SNAPSHOT/org.apache.lucene.tests.util.TestRuleIgnoreAfterMaxFailures$1.evaluate(TestRuleIgnoreAfterMaxFailures.java:60)
	at org.apache.lucene.test_framework@11.0.0-SNAPSHOT/org.apache.lucene.tests.util.TestRuleIgnoreTestSuites$1.evaluate(TestRuleIgnoreTestSuites.java:47)
	at junit@4.13.2/org.junit.rules.RunRules.evaluate(RunRules.java:20)
	at randomizedtesting.runner@2.8.3/com.carrotsearch.randomizedtesting.rules.StatementAdapter.evaluate(StatementAdapter.java:36)
	at randomizedtesting.runner@2.8.3/com.carrotsearch.randomizedtesting.ThreadLeakControl$StatementRunner.run(ThreadLeakControl.java:390)
	at randomizedtesting.runner@2.8.3/com.carrotsearch.randomizedtesting.ThreadLeakControl.lambda$forkTimeoutingTask$0(ThreadLeakControl.java:850)
	at java.base/java.lang.Thread.run(Thread.java:1474)


FAILED:  org.apache.lucene.backward_codecs.lucene60.TestLucene60FieldInfosFormat.testMergeStability

Error Message:
java.lang.AssertionError: expected:<{fnm=82, fdt=10421, fdx=88, fdm=158}> but was:<{cfs=10811, cfe=150}>

Stack Trace:
java.lang.AssertionError: expected:<{fnm=82, fdt=10421, fdx=88, fdm=158}> but was:<{cfs=10811, cfe=150}>
	at __randomizedtesting.SeedInfo.seed([3800F50A26442230:4C4CB3252BAE2086]:0)
	at junit@4.13.2/org.junit.Assert.fail(Assert.java:89)
	at junit@4.13.2/org.junit.Assert.failNotEquals(Assert.java:835)
	at junit@4.13.2/org.junit.Assert.assertEquals(Assert.java:120)
	at junit@4.13.2/org.junit.Assert.assertEquals(Assert.java:146)
	at org.apache.lucene.test_framework@11.0.0-SNAPSHOT/org.apache.lucene.tests.index.BaseIndexFileFormatTestCase.testMergeStability(BaseIndexFileFormatTestCase.java:306)
	at java.base/jdk.internal.reflect.DirectMethodHandleAccessor.invoke(DirectMethodHandleAccessor.java:104)
	at java.base/java.lang.reflect.Method.invoke(Method.java:565)
	at randomizedtesting.runner@2.8.3/com.carrotsearch.randomizedtesting.RandomizedRunner.invoke(RandomizedRunner.java:1763)
	at randomizedtesting.runner@2.8.3/com.carrotsearch.randomizedtesting.RandomizedRunner$8.evaluate(RandomizedRunner.java:946)
	at randomizedtesting.runner@2.8.3/com.carrotsearch.randomizedtesting.RandomizedRunner$9.evaluate(RandomizedRunner.java:982)
	at randomizedtesting.runner@2.8.3/com.carrotsearch.randomizedtesting.RandomizedRunner$10.evaluate(RandomizedRunner.java:996)
	at org.apache.lucene.test_framework@11.0.0-SNAPSHOT/org.apache.lucene.tests.util.TestRuleSetupTeardownChained$1.evaluate(TestRuleSetupTeardownChained.java:48)
	at org.apache.lucene.test_framework@11.0.0-SNAPSHOT/org.apache.lucene.tests.util.AbstractBeforeAfterRule$1.evaluate(AbstractBeforeAfterRule.java:43)
	at org.apache.lucene.test_framework@11.0.0-SNAPSHOT/org.apache.lucene.tests.util.TestRuleThreadAndTestName$1.evaluate(TestRuleThreadAndTestName.java:45)
	at org.apache.lucene.test_framework@11.0.0-SNAPSHOT/org.apache.lucene.tests.util.TestRuleIgnoreAfterMaxFailures$1.evaluate(TestRuleIgnoreAfterMaxFailures.java:60)
	at org.apache.lucene.test_framework@11.0.0-SNAPSHOT/org.apache.lucene.tests.util.TestRuleMarkFailure$1.evaluate(TestRuleMarkFailure.java:44)
	at junit@4.13.2/org.junit.rules.RunRules.evaluate(RunRules.java:20)
	at randomizedtesting.runner@2.8.3/com.carrotsearch.randomizedtesting.rules.StatementAdapter.evaluate(StatementAdapter.java:36)
	at randomizedtesting.runner@2.8.3/com.carrotsearch.randomizedtesting.ThreadLeakControl$StatementRunner.run(ThreadLeakControl.java:390)
	at randomizedtesting.runner@2.8.3/com.carrotsearch.randomizedtesting.ThreadLeakControl.forkTimeoutingTask(ThreadLeakControl.java:843)
	at randomizedtesting.runner@2.8.3/com.carrotsearch.randomizedtesting.ThreadLeakControl$3.evaluate(ThreadLeakControl.java:490)
	at randomizedtesting.runner@2.8.3/com.carrotsearch.randomizedtesting.RandomizedRunner.runSingleTest(RandomizedRunner.java:955)
	at randomizedtesting.runner@2.8.3/com.carrotsearch.randomizedtesting.RandomizedRunner$5.evaluate(RandomizedRunner.java:840)
	at randomizedtesting.runner@2.8.3/com.carrotsearch.randomizedtesting.RandomizedRunner$6.evaluate(RandomizedRunner.java:891)
	at randomizedtesting.runner@2.8.3/com.carrotsearch.randomizedtesting.RandomizedRunner$7.evaluate(RandomizedRunner.java:902)
	at org.apache.lucene.test_framework@11.0.0-SNAPSHOT/org.apache.lucene.tests.util.AbstractBeforeAfterRule$1.evaluate(AbstractBeforeAfterRule.java:43)
	at randomizedtesting.runner@2.8.3/com.carrotsearch.randomizedtesting.rules.StatementAdapter.evaluate(StatementAdapter.java:36)
	at org.apache.lucene.test_framework@11.0.0-SNAPSHOT/org.apache.lucene.tests.util.TestRuleStoreClassName$1.evaluate(TestRuleStoreClassName.java:38)
	at randomizedtesting.runner@2.8.3/com.carrotsearch.randomizedtesting.rules.NoShadowingOrOverridesOnMethodsRule$1.evaluate(NoShadowingOrOverridesOnMethodsRule.java:40)
	at randomizedtesting.runner@2.8.3/com.carrotsearch.randomizedtesting.rules.NoShadowingOrOverridesOnMethodsRule$1.evaluate(NoShadowingOrOverridesOnMethodsRule.java:40)
	at randomizedtesting.runner@2.8.3/com.carrotsearch.randomizedtesting.rules.StatementAdapter.evaluate(StatementAdapter.java:36)
	at randomizedtesting.runner@2.8.3/com.carrotsearch.randomizedtesting.rules.StatementAdapter.evaluate(StatementAdapter.java:36)
	at org.apache.lucene.test_framework@11.0.0-SNAPSHOT/org.apache.lucene.tests.util.TestRuleAssertionsRequired$1.evaluate(TestRuleAssertionsRequired.java:52)
	at org.apache.lucene.test_framework@11.0.0-SNAPSHOT/org.apache.lucene.tests.util.AbstractBeforeAfterRule$1.evaluate(AbstractBeforeAfterRule.java:43)
	at org.apache.lucene.test_framework@11.0.0-SNAPSHOT/org.apache.lucene.tests.util.TestRuleMarkFailure$1.evaluate(TestRuleMarkFailure.java:44)
	at org.apache.lucene.test_framework@11.0.0-SNAPSHOT/org.apache.lucene.tests.util.TestRuleIgnoreAfterMaxFailures$1.evaluate(TestRuleIgnoreAfterMaxFailures.java:60)
	at org.apache.lucene.test_framework@11.0.0-SNAPSHOT/org.apache.lucene.tests.util.TestRuleIgnoreTestSuites$1.evaluate(TestRuleIgnoreTestSuites.java:47)
	at junit@4.13.2/org.junit.rules.RunRules.evaluate(RunRules.java:20)
	at randomizedtesting.runner@2.8.3/com.carrotsearch.randomizedtesting.rules.StatementAdapter.evaluate(StatementAdapter.java:36)
	at randomizedtesting.runner@2.8.3/com.carrotsearch.randomizedtesting.ThreadLeakControl$StatementRunner.run(ThreadLeakControl.java:390)
	at randomizedtesting.runner@2.8.3/com.carrotsearch.randomizedtesting.ThreadLeakControl.lambda$forkTimeoutingTask$0(ThreadLeakControl.java:850)
	at java.base/java.lang.Thread.run(Thread.java:1474)


FAILED:  org.apache.lucene.backward_codecs.lucene70.TestLucene70SegmentInfoFormat.testMergeStability

Error Message:
java.lang.AssertionError: expected:<{fnm=82, fdt=10421, fdx=88, fdm=158}> but was:<{cfs=10811, cfe=150}>

Stack Trace:
java.lang.AssertionError: expected:<{fnm=82, fdt=10421, fdx=88, fdm=158}> but was:<{cfs=10811, cfe=150}>
	at __randomizedtesting.SeedInfo.seed([3800F50A26442230:4C4CB3252BAE2086]:0)
	at junit@4.13.2/org.junit.Assert.fail(Assert.java:89)
	at junit@4.13.2/org.junit.Assert.failNotEquals(Assert.java:835)
	at junit@4.13.2/org.junit.Assert.assertEquals(Assert.java:120)
	at junit@4.13.2/org.junit.Assert.assertEquals(Assert.java:146)
	at org.apache.lucene.test_framework@11.0.0-SNAPSHOT/org.apache.lucene.tests.index.BaseIndexFileFormatTestCase.testMergeStability(BaseIndexFileFormatTestCase.java:306)
	at java.base/jdk.internal.reflect.DirectMethodHandleAccessor.invoke(DirectMethodHandleAccessor.java:104)
	at java.base/java.lang.reflect.Method.invoke(Method.java:565)
	at randomizedtesting.runner@2.8.3/com.carrotsearch.randomizedtesting.RandomizedRunner.invoke(RandomizedRunner.java:1763)
	at randomizedtesting.runner@2.8.3/com.carrotsearch.randomizedtesting.RandomizedRunner$8.evaluate(RandomizedRunner.java:946)
	at randomizedtesting.runner@2.8.3/com.carrotsearch.randomizedtesting.RandomizedRunner$9.evaluate(RandomizedRunner.java:982)
	at randomizedtesting.runner@2.8.3/com.carrotsearch.randomizedtesting.RandomizedRunner$10.evaluate(RandomizedRunner.java:996)
	at org.apache.lucene.test_framework@11.0.0-SNAPSHOT/org.apache.lucene.tests.util.TestRuleSetupTeardownChained$1.evaluate(TestRuleSetupTeardownChained.java:48)
	at org.apache.lucene.test_framework@11.0.0-SNAPSHOT/org.apache.lucene.tests.util.AbstractBeforeAfterRule$1.evaluate(AbstractBeforeAfterRule.java:43)
	at org.apache.lucene.test_framework@11.0.0-SNAPSHOT/org.apache.lucene.tests.util.TestRuleThreadAndTestName$1.evaluate(TestRuleThreadAndTestName.java:45)
	at org.apache.lucene.test_framework@11.0.0-SNAPSHOT/org.apache.lucene.tests.util.TestRuleIgnoreAfterMaxFailures$1.evaluate(TestRuleIgnoreAfterMaxFailures.java:60)
	at org.apache.lucene.test_framework@11.0.0-SNAPSHOT/org.apache.lucene.tests.util.TestRuleMarkFailure$1.evaluate(TestRuleMarkFailure.java:44)
	at junit@4.13.2/org.junit.rules.RunRules.evaluate(RunRules.java:20)
	at randomizedtesting.runner@2.8.3/com.carrotsearch.randomizedtesting.rules.StatementAdapter.evaluate(StatementAdapter.java:36)
	at randomizedtesting.runner@2.8.3/com.carrotsearch.randomizedtesting.ThreadLeakControl$StatementRunner.run(ThreadLeakControl.java:390)
	at randomizedtesting.runner@2.8.3/com.carrotsearch.randomizedtesting.ThreadLeakControl.forkTimeoutingTask(ThreadLeakControl.java:843)
	at randomizedtesting.runner@2.8.3/com.carrotsearch.randomizedtesting.ThreadLeakControl$3.evaluate(ThreadLeakControl.java:490)
	at randomizedtesting.runner@2.8.3/com.carrotsearch.randomizedtesting.RandomizedRunner.runSingleTest(RandomizedRunner.java:955)
	at randomizedtesting.runner@2.8.3/com.carrotsearch.randomizedtesting.RandomizedRunner$5.evaluate(RandomizedRunner.java:840)
	at randomizedtesting.runner@2.8.3/com.carrotsearch.randomizedtesting.RandomizedRunner$6.evaluate(RandomizedRunner.java:891)
	at randomizedtesting.runner@2.8.3/com.carrotsearch.randomizedtesting.RandomizedRunner$7.evaluate(RandomizedRunner.java:902)
	at org.apache.lucene.test_framework@11.0.0-SNAPSHOT/org.apache.lucene.tests.util.AbstractBeforeAfterRule$1.evaluate(AbstractBeforeAfterRule.java:43)
	at randomizedtesting.runner@2.8.3/com.carrotsearch.randomizedtesting.rules.StatementAdapter.evaluate(StatementAdapter.java:36)
	at org.apache.lucene.test_framework@11.0.0-SNAPSHOT/org.apache.lucene.tests.util.TestRuleStoreClassName$1.evaluate(TestRuleStoreClassName.java:38)
	at randomizedtesting.runner@2.8.3/com.carrotsearch.randomizedtesting.rules.NoShadowingOrOverridesOnMethodsRule$1.evaluate(NoShadowingOrOverridesOnMethodsRule.java:40)
	at randomizedtesting.runner@2.8.3/com.carrotsearch.randomizedtesting.rules.NoShadowingOrOverridesOnMethodsRule$1.evaluate(NoShadowingOrOverridesOnMethodsRule.java:40)
	at randomizedtesting.runner@2.8.3/com.carrotsearch.randomizedtesting.rules.StatementAdapter.evaluate(StatementAdapter.java:36)
	at randomizedtesting.runner@2.8.3/com.carrotsearch.randomizedtesting.rules.StatementAdapter.evaluate(StatementAdapter.java:36)
	at org.apache.lucene.test_framework@11.0.0-SNAPSHOT/org.apache.lucene.tests.util.TestRuleAssertionsRequired$1.evaluate(TestRuleAssertionsRequired.java:52)
	at org.apache.lucene.test_framework@11.0.0-SNAPSHOT/org.apache.lucene.tests.util.AbstractBeforeAfterRule$1.evaluate(AbstractBeforeAfterRule.java:43)
	at org.apache.lucene.test_framework@11.0.0-SNAPSHOT/org.apache.lucene.tests.util.TestRuleMarkFailure$1.evaluate(TestRuleMarkFailure.java:44)
	at org.apache.lucene.test_framework@11.0.0-SNAPSHOT/org.apache.lucene.tests.util.TestRuleIgnoreAfterMaxFailures$1.evaluate(TestRuleIgnoreAfterMaxFailures.java:60)
	at org.apache.lucene.test_framework@11.0.0-SNAPSHOT/org.apache.lucene.tests.util.TestRuleIgnoreTestSuites$1.evaluate(TestRuleIgnoreTestSuites.java:47)
	at junit@4.13.2/org.junit.rules.RunRules.evaluate(RunRules.java:20)
	at randomizedtesting.runner@2.8.3/com.carrotsearch.randomizedtesting.rules.StatementAdapter.evaluate(StatementAdapter.java:36)
	at randomizedtesting.runner@2.8.3/com.carrotsearch.randomizedtesting.ThreadLeakControl$StatementRunner.run(ThreadLeakControl.java:390)
	at randomizedtesting.runner@2.8.3/com.carrotsearch.randomizedtesting.ThreadLeakControl.lambda$forkTimeoutingTask$0(ThreadLeakControl.java:850)
	at java.base/java.lang.Thread.run(Thread.java:1474)


FAILED:  org.apache.lucene.backward_codecs.lucene86.TestLucene86SegmentInfoFormat.testMergeStability

Error Message:
java.lang.AssertionError: expected:<{fnm=82, fdt=10419, fdx=80, fdm=159}> but was:<{cfs=10802, cfe=150}>

Stack Trace:
java.lang.AssertionError: expected:<{fnm=82, fdt=10419, fdx=80, fdm=159}> but was:<{cfs=10802, cfe=150}>
	at __randomizedtesting.SeedInfo.seed([3800F50A26442230:4C4CB3252BAE2086]:0)
	at junit@4.13.2/org.junit.Assert.fail(Assert.java:89)
	at junit@4.13.2/org.junit.Assert.failNotEquals(Assert.java:835)
	at junit@4.13.2/org.junit.Assert.assertEquals(Assert.java:120)
	at junit@4.13.2/org.junit.Assert.assertEquals(Assert.java:146)
	at org.apache.lucene.test_framework@11.0.0-SNAPSHOT/org.apache.lucene.tests.index.BaseIndexFileFormatTestCase.testMergeStability(BaseIndexFileFormatTestCase.java:306)
	at java.base/jdk.internal.reflect.DirectMethodHandleAccessor.invoke(DirectMethodHandleAccessor.java:104)
	at java.base/java.lang.reflect.Method.invoke(Method.java:565)
	at randomizedtesting.runner@2.8.3/com.carrotsearch.randomizedtesting.RandomizedRunner.invoke(RandomizedRunner.java:1763)
	at randomizedtesting.runner@2.8.3/com.carrotsearch.randomizedtesting.RandomizedRunner$8.evaluate(RandomizedRunner.java:946)
	at randomizedtesting.runner@2.8.3/com.carrotsearch.randomizedtesting.RandomizedRunner$9.evaluate(RandomizedRunner.java:982)
	at randomizedtesting.runner@2.8.3/com.carrotsearch.randomizedtesting.RandomizedRunner$10.evaluate(RandomizedRunner.java:996)
	at org.apache.lucene.test_framework@11.0.0-SNAPSHOT/org.apache.lucene.tests.util.TestRuleSetupTeardownChained$1.evaluate(TestRuleSetupTeardownChained.java:48)
	at org.apache.lucene.test_framework@11.0.0-SNAPSHOT/org.apache.lucene.tests.util.AbstractBeforeAfterRule$1.evaluate(AbstractBeforeAfterRule.java:43)
	at org.apache.lucene.test_framework@11.0.0-SNAPSHOT/org.apache.lucene.tests.util.TestRuleThreadAndTestName$1.evaluate(TestRuleThreadAndTestName.java:45)
	at org.apache.lucene.test_framework@11.0.0-SNAPSHOT/org.apache.lucene.tests.util.TestRuleIgnoreAfterMaxFailures$1.evaluate(TestRuleIgnoreAfterMaxFailures.java:60)
	at org.apache.lucene.test_framework@11.0.0-SNAPSHOT/org.apache.lucene.tests.util.TestRuleMarkFailure$1.evaluate(TestRuleMarkFailure.java:44)
	at junit@4.13.2/org.junit.rules.RunRules.evaluate(RunRules.java:20)
	at randomizedtesting.runner@2.8.3/com.carrotsearch.randomizedtesting.rules.StatementAdapter.evaluate(StatementAdapter.java:36)
	at randomizedtesting.runner@2.8.3/com.carrotsearch.randomizedtesting.ThreadLeakControl$StatementRunner.run(ThreadLeakControl.java:390)
	at randomizedtesting.runner@2.8.3/com.carrotsearch.randomizedtesting.ThreadLeakControl.forkTimeoutingTask(ThreadLeakControl.java:843)
	at randomizedtesting.runner@2.8.3/com.carrotsearch.randomizedtesting.ThreadLeakControl$3.evaluate(ThreadLeakControl.java:490)
	at randomizedtesting.runner@2.8.3/com.carrotsearch.randomizedtesting.RandomizedRunner.runSingleTest(RandomizedRunner.java:955)
	at randomizedtesting.runner@2.8.3/com.carrotsearch.randomizedtesting.RandomizedRunner$5.evaluate(RandomizedRunner.java:840)
	at randomizedtesting.runner@2.8.3/com.carrotsearch.randomizedtesting.RandomizedRunner$6.evaluate(RandomizedRunner.java:891)
	at randomizedtesting.runner@2.8.3/com.carrotsearch.randomizedtesting.RandomizedRunner$7.evaluate(RandomizedRunner.java:902)
	at org.apache.lucene.test_framework@11.0.0-SNAPSHOT/org.apache.lucene.tests.util.AbstractBeforeAfterRule$1.evaluate(AbstractBeforeAfterRule.java:43)
	at randomizedtesting.runner@2.8.3/com.carrotsearch.randomizedtesting.rules.StatementAdapter.evaluate(StatementAdapter.java:36)
	at org.apache.lucene.test_framework@11.0.0-SNAPSHOT/org.apache.lucene.tests.util.TestRuleStoreClassName$1.evaluate(TestRuleStoreClassName.java:38)
	at randomizedtesting.runner@2.8.3/com.carrotsearch.randomizedtesting.rules.NoShadowingOrOverridesOnMethodsRule$1.evaluate(NoShadowingOrOverridesOnMethodsRule.java:40)
	at randomizedtesting.runner@2.8.3/com.carrotsearch.randomizedtesting.rules.NoShadowingOrOverridesOnMethodsRule$1.evaluate(NoShadowingOrOverridesOnMethodsRule.java:40)
	at randomizedtesting.runner@2.8.3/com.carrotsearch.randomizedtesting.rules.StatementAdapter.evaluate(StatementAdapter.java:36)
	at randomizedtesting.runner@2.8.3/com.carrotsearch.randomizedtesting.rules.StatementAdapter.evaluate(StatementAdapter.java:36)
	at org.apache.lucene.test_framework@11.0.0-SNAPSHOT/org.apache.lucene.tests.util.TestRuleAssertionsRequired$1.evaluate(TestRuleAssertionsRequired.java:52)
	at org.apache.lucene.test_framework@11.0.0-SNAPSHOT/org.apache.lucene.tests.util.AbstractBeforeAfterRule$1.evaluate(AbstractBeforeAfterRule.java:43)
	at org.apache.lucene.test_framework@11.0.0-SNAPSHOT/org.apache.lucene.tests.util.TestRuleMarkFailure$1.evaluate(TestRuleMarkFailure.java:44)
	at org.apache.lucene.test_framework@11.0.0-SNAPSHOT/org.apache.lucene.tests.util.TestRuleIgnoreAfterMaxFailures$1.evaluate(TestRuleIgnoreAfterMaxFailures.java:60)
	at org.apache.lucene.test_framework@11.0.0-SNAPSHOT/org.apache.lucene.tests.util.TestRuleIgnoreTestSuites$1.evaluate(TestRuleIgnoreTestSuites.java:47)
	at junit@4.13.2/org.junit.rules.RunRules.evaluate(RunRules.java:20)
	at randomizedtesting.runner@2.8.3/com.carrotsearch.randomizedtesting.rules.StatementAdapter.evaluate(StatementAdapter.java:36)
	at randomizedtesting.runner@2.8.3/com.carrotsearch.randomizedtesting.ThreadLeakControl$StatementRunner.run(ThreadLeakControl.java:390)
	at randomizedtesting.runner@2.8.3/com.carrotsearch.randomizedtesting.ThreadLeakControl.lambda$forkTimeoutingTask$0(ThreadLeakControl.java:850)
	at java.base/java.lang.Thread.run(Thread.java:1474)


FAILED:  org.apache.lucene.backward_codecs.lucene87.TestLucene87StoredFieldsFormat.testMergeStability

Error Message:
java.lang.AssertionError: expected:<{fnm=77, fdt=73137, fdx=81, fdm=159}> but was:<{cfs=73516, cfe=150}>

Stack Trace:
java.lang.AssertionError: expected:<{fnm=77, fdt=73137, fdx=81, fdm=159}> but was:<{cfs=73516, cfe=150}>
	at __randomizedtesting.SeedInfo.seed([3800F50A26442230:4C4CB3252BAE2086]:0)
	at junit@4.13.2/org.junit.Assert.fail(Assert.java:89)
	at junit@4.13.2/org.junit.Assert.failNotEquals(Assert.java:835)
	at junit@4.13.2/org.junit.Assert.assertEquals(Assert.java:120)
	at junit@4.13.2/org.junit.Assert.assertEquals(Assert.java:146)
	at org.apache.lucene.test_framework@11.0.0-SNAPSHOT/org.apache.lucene.tests.index.BaseIndexFileFormatTestCase.testMergeStability(BaseIndexFileFormatTestCase.java:306)
	at java.base/jdk.internal.reflect.DirectMethodHandleAccessor.invoke(DirectMethodHandleAccessor.java:104)
	at java.base/java.lang.reflect.Method.invoke(Method.java:565)
	at randomizedtesting.runner@2.8.3/com.carrotsearch.randomizedtesting.RandomizedRunner.invoke(RandomizedRunner.java:1763)
	at randomizedtesting.runner@2.8.3/com.carrotsearch.randomizedtesting.RandomizedRunner$8.evaluate(RandomizedRunner.java:946)
	at randomizedtesting.runner@2.8.3/com.carrotsearch.randomizedtesting.RandomizedRunner$9.evaluate(RandomizedRunner.java:982)
	at randomizedtesting.runner@2.8.3/com.carrotsearch.randomizedtesting.RandomizedRunner$10.evaluate(RandomizedRunner.java:996)
	at org.apache.lucene.test_framework@11.0.0-SNAPSHOT/org.apache.lucene.tests.util.TestRuleSetupTeardownChained$1.evaluate(TestRuleSetupTeardownChained.java:48)
	at org.apache.lucene.test_framework@11.0.0-SNAPSHOT/org.apache.lucene.tests.util.AbstractBeforeAfterRule$1.evaluate(AbstractBeforeAfterRule.java:43)
	at org.apache.lucene.test_framework@11.0.0-SNAPSHOT/org.apache.lucene.tests.util.TestRuleThreadAndTestName$1.evaluate(TestRuleThreadAndTestName.java:45)
	at org.apache.lucene.test_framework@11.0.0-SNAPSHOT/org.apache.lucene.tests.util.TestRuleIgnoreAfterMaxFailures$1.evaluate(TestRuleIgnoreAfterMaxFailures.java:60)
	at org.apache.lucene.test_framework@11.0.0-SNAPSHOT/org.apache.lucene.tests.util.TestRuleMarkFailure$1.evaluate(TestRuleMarkFailure.java:44)
	at junit@4.13.2/org.junit.rules.RunRules.evaluate(RunRules.java:20)
	at randomizedtesting.runner@2.8.3/com.carrotsearch.randomizedtesting.rules.StatementAdapter.evaluate(StatementAdapter.java:36)
	at randomizedtesting.runner@2.8.3/com.carrotsearch.randomizedtesting.ThreadLeakControl$StatementRunner.run(ThreadLeakControl.java:390)
	at randomizedtesting.runner@2.8.3/com.carrotsearch.randomizedtesting.ThreadLeakControl.forkTimeoutingTask(ThreadLeakControl.java:843)
	at randomizedtesting.runner@2.8.3/com.carrotsearch.randomizedtesting.ThreadLeakControl$3.evaluate(ThreadLeakControl.java:490)
	at randomizedtesting.runner@2.8.3/com.carrotsearch.randomizedtesting.RandomizedRunner.runSingleTest(RandomizedRunner.java:955)
	at randomizedtesting.runner@2.8.3/com.carrotsearch.randomizedtesting.RandomizedRunner$5.evaluate(RandomizedRunner.java:840)
	at randomizedtesting.runner@2.8.3/com.carrotsearch.randomizedtesting.RandomizedRunner$6.evaluate(RandomizedRunner.java:891)
	at randomizedtesting.runner@2.8.3/com.carrotsearch.randomizedtesting.RandomizedRunner$7.evaluate(RandomizedRunner.java:902)
	at org.apache.lucene.test_framework@11.0.0-SNAPSHOT/org.apache.lucene.tests.util.AbstractBeforeAfterRule$1.evaluate(AbstractBeforeAfterRule.java:43)
	at randomizedtesting.runner@2.8.3/com.carrotsearch.randomizedtesting.rules.StatementAdapter.evaluate(StatementAdapter.java:36)
	at org.apache.lucene.test_framework@11.0.0-SNAPSHOT/org.apache.lucene.tests.util.TestRuleStoreClassName$1.evaluate(TestRuleStoreClassName.java:38)
	at randomizedtesting.runner@2.8.3/com.carrotsearch.randomizedtesting.rules.NoShadowingOrOverridesOnMethodsRule$1.evaluate(NoShadowingOrOverridesOnMethodsRule.java:40)
	at randomizedtesting.runner@2.8.3/com.carrotsearch.randomizedtesting.rules.NoShadowingOrOverridesOnMethodsRule$1.evaluate(NoShadowingOrOverridesOnMethodsRule.java:40)
	at randomizedtesting.runner@2.8.3/com.carrotsearch.randomizedtesting.rules.StatementAdapter.evaluate(StatementAdapter.java:36)
	at randomizedtesting.runner@2.8.3/com.carrotsearch.randomizedtesting.rules.StatementAdapter.evaluate(StatementAdapter.java:36)
	at org.apache.lucene.test_framework@11.0.0-SNAPSHOT/org.apache.lucene.tests.util.TestRuleAssertionsRequired$1.evaluate(TestRuleAssertionsRequired.java:52)
	at org.apache.lucene.test_framework@11.0.0-SNAPSHOT/org.apache.lucene.tests.util.AbstractBeforeAfterRule$1.evaluate(AbstractBeforeAfterRule.java:43)
	at org.apache.lucene.test_framework@11.0.0-SNAPSHOT/org.apache.lucene.tests.util.TestRuleMarkFailure$1.evaluate(TestRuleMarkFailure.java:44)
	at org.apache.lucene.test_framework@11.0.0-SNAPSHOT/org.apache.lucene.tests.util.TestRuleIgnoreAfterMaxFailures$1.evaluate(TestRuleIgnoreAfterMaxFailures.java:60)
	at org.apache.lucene.test_framework@11.0.0-SNAPSHOT/org.apache.lucene.tests.util.TestRuleIgnoreTestSuites$1.evaluate(TestRuleIgnoreTestSuites.java:47)
	at junit@4.13.2/org.junit.rules.RunRules.evaluate(RunRules.java:20)
	at randomizedtesting.runner@2.8.3/com.carrotsearch.randomizedtesting.rules.StatementAdapter.evaluate(StatementAdapter.java:36)
	at randomizedtesting.runner@2.8.3/com.carrotsearch.randomizedtesting.ThreadLeakControl$StatementRunner.run(ThreadLeakControl.java:390)
	at randomizedtesting.runner@2.8.3/com.carrotsearch.randomizedtesting.ThreadLeakControl.lambda$forkTimeoutingTask$0(ThreadLeakControl.java:850)
	at java.base/java.lang.Thread.run(Thread.java:1474)


FAILED:  org.apache.lucene.backward_codecs.lucene87.TestLucene87StoredFieldsFormatHighCompression.testMergeStability

Error Message:
java.lang.AssertionError: expected:<{fnm=77, fdt=47936, fdx=64, fdm=159}> but was:<{cfs=48298, cfe=150}>

Stack Trace:
java.lang.AssertionError: expected:<{fnm=77, fdt=47936, fdx=64, fdm=159}> but was:<{cfs=48298, cfe=150}>
	at __randomizedtesting.SeedInfo.seed([3800F50A26442230:4C4CB3252BAE2086]:0)
	at junit@4.13.2/org.junit.Assert.fail(Assert.java:89)
	at junit@4.13.2/org.junit.Assert.failNotEquals(Assert.java:835)
	at junit@4.13.2/org.junit.Assert.assertEquals(Assert.java:120)
	at junit@4.13.2/org.junit.Assert.assertEquals(Assert.java:146)
	at org.apache.lucene.test_framework@11.0.0-SNAPSHOT/org.apache.lucene.tests.index.BaseIndexFileFormatTestCase.testMergeStability(BaseIndexFileFormatTestCase.java:306)
	at java.base/jdk.internal.reflect.DirectMethodHandleAccessor.invoke(DirectMethodHandleAccessor.java:104)
	at java.base/java.lang.reflect.Method.invoke(Method.java:565)
	at randomizedtesting.runner@2.8.3/com.carrotsearch.randomizedtesting.RandomizedRunner.invoke(RandomizedRunner.java:1763)
	at randomizedtesting.runner@2.8.3/com.carrotsearch.randomizedtesting.RandomizedRunner$8.evaluate(RandomizedRunner.java:946)
	at randomizedtesting.runner@2.8.3/com.carrotsearch.randomizedtesting.RandomizedRunner$9.evaluate(RandomizedRunner.java:982)
	at randomizedtesting.runner@2.8.3/com.carrotsearch.randomizedtesting.RandomizedRunner$10.evaluate(RandomizedRunner.java:996)
	at org.apache.lucene.test_framework@11.0.0-SNAPSHOT/org.apache.lucene.tests.util.TestRuleSetupTeardownChained$1.evaluate(TestRuleSetupTeardownChained.java:48)
	at org.apache.lucene.test_framework@11.0.0-SNAPSHOT/org.apache.lucene.tests.util.AbstractBeforeAfterRule$1.evaluate(AbstractBeforeAfterRule.java:43)
	at org.apache.lucene.test_framework@11.0.0-SNAPSHOT/org.apache.lucene.tests.util.TestRuleThreadAndTestName$1.evaluate(TestRuleThreadAndTestName.java:45)
	at org.apache.lucene.test_framework@11.0.0-SNAPSHOT/org.apache.lucene.tests.util.TestRuleIgnoreAfterMaxFailures$1.evaluate(TestRuleIgnoreAfterMaxFailures.java:60)
	at org.apache.lucene.test_framework@11.0.0-SNAPSHOT/org.apache.lucene.tests.util.TestRuleMarkFailure$1.evaluate(TestRuleMarkFailure.java:44)
	at junit@4.13.2/org.junit.rules.RunRules.evaluate(RunRules.java:20)
	at randomizedtesting.runner@2.8.3/com.carrotsearch.randomizedtesting.rules.StatementAdapter.evaluate(StatementAdapter.java:36)
	at randomizedtesting.runner@2.8.3/com.carrotsearch.randomizedtesting.ThreadLeakControl$StatementRunner.run(ThreadLeakControl.java:390)
	at randomizedtesting.runner@2.8.3/com.carrotsearch.randomizedtesting.ThreadLeakControl.forkTimeoutingTask(ThreadLeakControl.java:843)
	at randomizedtesting.runner@2.8.3/com.carrotsearch.randomizedtesting.ThreadLeakControl$3.evaluate(ThreadLeakControl.java:490)
	at randomizedtesting.runner@2.8.3/com.carrotsearch.randomizedtesting.RandomizedRunner.runSingleTest(RandomizedRunner.java:955)
	at randomizedtesting.runner@2.8.3/com.carrotsearch.randomizedtesting.RandomizedRunner$5.evaluate(RandomizedRunner.java:840)
	at randomizedtesting.runner@2.8.3/com.carrotsearch.randomizedtesting.RandomizedRunner$6.evaluate(RandomizedRunner.java:891)
	at randomizedtesting.runner@2.8.3/com.carrotsearch.randomizedtesting.RandomizedRunner$7.evaluate(RandomizedRunner.java:902)
	at org.apache.lucene.test_framework@11.0.0-SNAPSHOT/org.apache.lucene.tests.util.AbstractBeforeAfterRule$1.evaluate(AbstractBeforeAfterRule.java:43)
	at randomizedtesting.runner@2.8.3/com.carrotsearch.randomizedtesting.rules.StatementAdapter.evaluate(StatementAdapter.java:36)
	at org.apache.lucene.test_framework@11.0.0-SNAPSHOT/org.apache.lucene.tests.util.TestRuleStoreClassName$1.evaluate(TestRuleStoreClassName.java:38)
	at randomizedtesting.runner@2.8.3/com.carrotsearch.randomizedtesting.rules.NoShadowingOrOverridesOnMethodsRule$1.evaluate(NoShadowingOrOverridesOnMethodsRule.java:40)
	at randomizedtesting.runner@2.8.3/com.carrotsearch.randomizedtesting.rules.NoShadowingOrOverridesOnMethodsRule$1.evaluate(NoShadowingOrOverridesOnMethodsRule.java:40)
	at randomizedtesting.runner@2.8.3/com.carrotsearch.randomizedtesting.rules.StatementAdapter.evaluate(StatementAdapter.java:36)
	at randomizedtesting.runner@2.8.3/com.carrotsearch.randomizedtesting.rules.StatementAdapter.evaluate(StatementAdapter.java:36)
	at org.apache.lucene.test_framework@11.0.0-SNAPSHOT/org.apache.lucene.tests.util.TestRuleAssertionsRequired$1.evaluate(TestRuleAssertionsRequired.java:52)
	at org.apache.lucene.test_framework@11.0.0-SNAPSHOT/org.apache.lucene.tests.util.AbstractBeforeAfterRule$1.evaluate(AbstractBeforeAfterRule.java:43)
	at org.apache.lucene.test_framework@11.0.0-SNAPSHOT/org.apache.lucene.tests.util.TestRuleMarkFailure$1.evaluate(TestRuleMarkFailure.java:44)
	at org.apache.lucene.test_framework@11.0.0-SNAPSHOT/org.apache.lucene.tests.util.TestRuleIgnoreAfterMaxFailures$1.evaluate(TestRuleIgnoreAfterMaxFailures.java:60)
	at org.apache.lucene.test_framework@11.0.0-SNAPSHOT/org.apache.lucene.tests.util.TestRuleIgnoreTestSuites$1.evaluate(TestRuleIgnoreTestSuites.java:47)
	at junit@4.13.2/org.junit.rules.RunRules.evaluate(RunRules.java:20)
	at randomizedtesting.runner@2.8.3/com.carrotsearch.randomizedtesting.rules.StatementAdapter.evaluate(StatementAdapter.java:36)
	at randomizedtesting.runner@2.8.3/com.carrotsearch.randomizedtesting.ThreadLeakControl$StatementRunner.run(ThreadLeakControl.java:390)
	at randomizedtesting.runner@2.8.3/com.carrotsearch.randomizedtesting.ThreadLeakControl.lambda$forkTimeoutingTask$0(ThreadLeakControl.java:850)
	at java.base/java.lang.Thread.run(Thread.java:1474)


FAILED:  org.apache.lucene.backward_codecs.lucene87.TestLucene87StoredFieldsFormatMergeInstance.testMergeStability

Error Message:
java.lang.AssertionError: expected:<{fnm=77, fdt=73137, fdx=81, fdm=159}> but was:<{cfs=73516, cfe=150}>

Stack Trace:
java.lang.AssertionError: expected:<{fnm=77, fdt=73137, fdx=81, fdm=159}> but was:<{cfs=73516, cfe=150}>
	at __randomizedtesting.SeedInfo.seed([3800F50A26442230:4C4CB3252BAE2086]:0)
	at junit@4.13.2/org.junit.Assert.fail(Assert.java:89)
	at junit@4.13.2/org.junit.Assert.failNotEquals(Assert.java:835)
	at junit@4.13.2/org.junit.Assert.assertEquals(Assert.java:120)
	at junit@4.13.2/org.junit.Assert.assertEquals(Assert.java:146)
	at org.apache.lucene.test_framework@11.0.0-SNAPSHOT/org.apache.lucene.tests.index.BaseIndexFileFormatTestCase.testMergeStability(BaseIndexFileFormatTestCase.java:306)
	at java.base/jdk.internal.reflect.DirectMethodHandleAccessor.invoke(DirectMethodHandleAccessor.java:104)
	at java.base/java.lang.reflect.Method.invoke(Method.java:565)
	at randomizedtesting.runner@2.8.3/com.carrotsearch.randomizedtesting.RandomizedRunner.invoke(RandomizedRunner.java:1763)
	at randomizedtesting.runner@2.8.3/com.carrotsearch.randomizedtesting.RandomizedRunner$8.evaluate(RandomizedRunner.java:946)
	at randomizedtesting.runner@2.8.3/com.carrotsearch.randomizedtesting.RandomizedRunner$9.evaluate(RandomizedRunner.java:982)
	at randomizedtesting.runner@2.8.3/com.carrotsearch.randomizedtesting.RandomizedRunner$10.evaluate(RandomizedRunner.java:996)
	at org.apache.lucene.test_framework@11.0.0-SNAPSHOT/org.apache.lucene.tests.util.TestRuleSetupTeardownChained$1.evaluate(TestRuleSetupTeardownChained.java:48)
	at org.apache.lucene.test_framework@11.0.0-SNAPSHOT/org.apache.lucene.tests.util.AbstractBeforeAfterRule$1.evaluate(AbstractBeforeAfterRule.java:43)
	at org.apache.lucene.test_framework@11.0.0-SNAPSHOT/org.apache.lucene.tests.util.TestRuleThreadAndTestName$1.evaluate(TestRuleThreadAndTestName.java:45)
	at org.apache.lucene.test_framework@11.0.0-SNAPSHOT/org.apache.lucene.tests.util.TestRuleIgnoreAfterMaxFailures$1.evaluate(TestRuleIgnoreAfterMaxFailures.java:60)
	at org.apache.lucene.test_framework@11.0.0-SNAPSHOT/org.apache.lucene.tests.util.TestRuleMarkFailure$1.evaluate(TestRuleMarkFailure.java:44)
	at junit@4.13.2/org.junit.rules.RunRules.evaluate(RunRules.java:20)
	at randomizedtesting.runner@2.8.3/com.carrotsearch.randomizedtesting.rules.StatementAdapter.evaluate(StatementAdapter.java:36)
	at randomizedtesting.runner@2.8.3/com.carrotsearch.randomizedtesting.ThreadLeakControl$StatementRunner.run(ThreadLeakControl.java:390)
	at randomizedtesting.runner@2.8.3/com.carrotsearch.randomizedtesting.ThreadLeakControl.forkTimeoutingTask(ThreadLeakControl.java:843)
	at randomizedtesting.runner@2.8.3/com.carrotsearch.randomizedtesting.ThreadLeakControl$3.evaluate(ThreadLeakControl.java:490)
	at randomizedtesting.runner@2.8.3/com.carrotsearch.randomizedtesting.RandomizedRunner.runSingleTest(RandomizedRunner.java:955)
	at randomizedtesting.runner@2.8.3/com.carrotsearch.randomizedtesting.RandomizedRunner$5.evaluate(RandomizedRunner.java:840)
	at randomizedtesting.runner@2.8.3/com.carrotsearch.randomizedtesting.RandomizedRunner$6.evaluate(RandomizedRunner.java:891)
	at randomizedtesting.runner@2.8.3/com.carrotsearch.randomizedtesting.RandomizedRunner$7.evaluate(RandomizedRunner.java:902)
	at org.apache.lucene.test_framework@11.0.0-SNAPSHOT/org.apache.lucene.tests.util.AbstractBeforeAfterRule$1.evaluate(AbstractBeforeAfterRule.java:43)
	at randomizedtesting.runner@2.8.3/com.carrotsearch.randomizedtesting.rules.StatementAdapter.evaluate(StatementAdapter.java:36)
	at org.apache.lucene.test_framework@11.0.0-SNAPSHOT/org.apache.lucene.tests.util.TestRuleStoreClassName$1.evaluate(TestRuleStoreClassName.java:38)
	at randomizedtesting.runner@2.8.3/com.carrotsearch.randomizedtesting.rules.NoShadowingOrOverridesOnMethodsRule$1.evaluate(NoShadowingOrOverridesOnMethodsRule.java:40)
	at randomizedtesting.runner@2.8.3/com.carrotsearch.randomizedtesting.rules.NoShadowingOrOverridesOnMethodsRule$1.evaluate(NoShadowingOrOverridesOnMethodsRule.java:40)
	at randomizedtesting.runner@2.8.3/com.carrotsearch.randomizedtesting.rules.StatementAdapter.evaluate(StatementAdapter.java:36)
	at randomizedtesting.runner@2.8.3/com.carrotsearch.randomizedtesting.rules.StatementAdapter.evaluate(StatementAdapter.java:36)
	at org.apache.lucene.test_framework@11.0.0-SNAPSHOT/org.apache.lucene.tests.util.TestRuleAssertionsRequired$1.evaluate(TestRuleAssertionsRequired.java:52)
	at org.apache.lucene.test_framework@11.0.0-SNAPSHOT/org.apache.lucene.tests.util.AbstractBeforeAfterRule$1.evaluate(AbstractBeforeAfterRule.java:43)
	at org.apache.lucene.test_framework@11.0.0-SNAPSHOT/org.apache.lucene.tests.util.TestRuleMarkFailure$1.evaluate(TestRuleMarkFailure.java:44)
	at org.apache.lucene.test_framework@11.0.0-SNAPSHOT/org.apache.lucene.tests.util.TestRuleIgnoreAfterMaxFailures$1.evaluate(TestRuleIgnoreAfterMaxFailures.java:60)
	at org.apache.lucene.test_framework@11.0.0-SNAPSHOT/org.apache.lucene.tests.util.TestRuleIgnoreTestSuites$1.evaluate(TestRuleIgnoreTestSuites.java:47)
	at junit@4.13.2/org.junit.rules.RunRules.evaluate(RunRules.java:20)
	at randomizedtesting.runner@2.8.3/com.carrotsearch.randomizedtesting.rules.StatementAdapter.evaluate(StatementAdapter.java:36)
	at randomizedtesting.runner@2.8.3/com.carrotsearch.randomizedtesting.ThreadLeakControl$StatementRunner.run(ThreadLeakControl.java:390)
	at randomizedtesting.runner@2.8.3/com.carrotsearch.randomizedtesting.ThreadLeakControl.lambda$forkTimeoutingTask$0(ThreadLeakControl.java:850)
	at java.base/java.lang.Thread.run(Thread.java:1474)




Build Log:
[...truncated 1665 lines...]
ERROR: 10 10 tests have failed:

  - org.apache.lucene.backward_codecs.lucene50.TestLucene50StoredFieldsFormatHighCompression.testMergeStability (:lucene:backward-codecs)
    Test output: /home/jenkins/jenkins-agent/workspace/Lucene/Lucene-NightlyTests-main/checkout/lucene/backward-codecs/build/test-results/test/outputs/OUTPUT-org.apache.lucene.backward_codecs.lucene50.TestLucene50StoredFieldsFormatHighCompression.txt
    Reproduce with: gradlew :lucene:backward-codecs:test --tests "org.apache.lucene.backward_codecs.lucene50.TestLucene50StoredFieldsFormatHighCompression.testMergeStability" -Ptests.asserts=false -Ptests.file.encoding=ISO-8859-1 -Ptests.gui=true -Ptests.haltonfailure=false -Ptests.jvmargs= -Ptests.jvms=4 -Ptests.linedocsfile=/home/jenkins/jenkins-agent/workspace/Lucene/Lucene-NightlyTests-main/test-data/enwiki.random.lines.txt -Ptests.multiplier=2 -Ptests.nightly=true -Ptests.seed=3800F50A26442230 -Ptests.vectorsize=256

  - org.apache.lucene.backward_codecs.lucene87.TestLucene87StoredFieldsFormatMergeInstance.testMergeStability (:lucene:backward-codecs)
    Test output: /home/jenkins/jenkins-agent/workspace/Lucene/Lucene-NightlyTests-main/checkout/lucene/backward-codecs/build/test-results/test/outputs/OUTPUT-org.apache.lucene.backward_codecs.lucene87.TestLucene87StoredFieldsFormatMergeInstance.txt
    Reproduce with: gradlew :lucene:backward-codecs:test --tests "org.apache.lucene.backward_codecs.lucene87.TestLucene87StoredFieldsFormatMergeInstance.testMergeStability" -Ptests.asserts=false -Ptests.file.encoding=ISO-8859-1 -Ptests.gui=true -Ptests.haltonfailure=false -Ptests.jvmargs= -Ptests.jvms=4 -Ptests.linedocsfile=/home/jenkins/jenkins-agent/workspace/Lucene/Lucene-NightlyTests-main/test-data/enwiki.random.lines.txt -Ptests.multiplier=2 -Ptests.nightly=true -Ptests.seed=3800F50A26442230 -Ptests.vectorsize=256

  - org.apache.lucene.backward_codecs.lucene50.TestLucene50StoredFieldsFormatMergeInstance.testMergeStability (:lucene:backward-codecs)
    Test output: /home/jenkins/jenkins-agent/workspace/Lucene/Lucene-NightlyTests-main/checkout/lucene/backward-codecs/build/test-results/test/outputs/OUTPUT-org.apache.lucene.backward_codecs.lucene50.TestLucene50StoredFieldsFormatMergeInstance.txt
    Reproduce with: gradlew :lucene:backward-codecs:test --tests "org.apache.lucene.backward_codecs.lucene50.TestLucene50StoredFieldsFormatMergeInstance.testMergeStability" -Ptests.asserts=false -Ptests.file.encoding=ISO-8859-1 -Ptests.gui=true -Ptests.haltonfailure=false -Ptests.jvmargs= -Ptests.jvms=4 -Ptests.linedocsfile=/home/jenkins/jenkins-agent/workspace/Lucene/Lucene-NightlyTests-main/test-data/enwiki.random.lines.txt -Ptests.multiplier=2 -Ptests.nightly=true -Ptests.seed=3800F50A26442230 -Ptests.vectorsize=256

  - org.apache.lucene.backward_codecs.lucene70.TestLucene70SegmentInfoFormat.testMergeStability (:lucene:backward-codecs)
    Test output: /home/jenkins/jenkins-agent/workspace/Lucene/Lucene-NightlyTests-main/checkout/lucene/backward-codecs/build/test-results/test/outputs/OUTPUT-org.apache.lucene.backward_codecs.lucene70.TestLucene70SegmentInfoFormat.txt
    Reproduce with: gradlew :lucene:backward-codecs:test --tests "org.apache.lucene.backward_codecs.lucene70.TestLucene70SegmentInfoFormat.testMergeStability" -Ptests.asserts=false -Ptests.file.encoding=ISO-8859-1 -Ptests.gui=true -Ptests.haltonfailure=false -Ptests.jvmargs= -Ptests.jvms=4 -Ptests.linedocsfile=/home/jenkins/jenkins-agent/workspace/Lucene/Lucene-NightlyTests-main/test-data/enwiki.random.lines.txt -Ptests.multiplier=2 -Ptests.nightly=true -Ptests.seed=3800F50A26442230 -Ptests.vectorsize=256

  - org.apache.lucene.backward_codecs.lucene50.TestLucene50StoredFieldsFormat.testMergeStability (:lucene:backward-codecs)
    Test output: /home/jenkins/jenkins-agent/workspace/Lucene/Lucene-NightlyTests-main/checkout/lucene/backward-codecs/build/test-results/test/outputs/OUTPUT-org.apache.lucene.backward_codecs.lucene50.TestLucene50StoredFieldsFormat.txt
    Reproduce with: gradlew :lucene:backward-codecs:test --tests "org.apache.lucene.backward_codecs.lucene50.TestLucene50StoredFieldsFormat.testMergeStability" -Ptests.asserts=false -Ptests.file.encoding=ISO-8859-1 -Ptests.gui=true -Ptests.haltonfailure=false -Ptests.jvmargs= -Ptests.jvms=4 -Ptests.linedocsfile=/home/jenkins/jenkins-agent/workspace/Lucene/Lucene-NightlyTests-main/test-data/enwiki.random.lines.txt -Ptests.multiplier=2 -Ptests.nightly=true -Ptests.seed=3800F50A26442230 -Ptests.vectorsize=256

  - org.apache.lucene.backward_codecs.lucene60.TestLucene60FieldInfosFormat.testMergeStability (:lucene:backward-codecs)
    Test output: /home/jenkins/jenkins-agent/workspace/Lucene/Lucene-NightlyTests-main/checkout/lucene/backward-codecs/build/test-results/test/outputs/OUTPUT-org.apache.lucene.backward_codecs.lucene60.TestLucene60FieldInfosFormat.txt
    Reproduce with: gradlew :lucene:backward-codecs:test --tests "org.apache.lucene.backward_codecs.lucene60.TestLucene60FieldInfosFormat.testMergeStability" -Ptests.asserts=false -Ptests.file.encoding=ISO-8859-1 -Ptests.gui=true -Ptests.haltonfailure=false -Ptests.jvmargs= -Ptests.jvms=4 -Ptests.linedocsfile=/home/jenkins/jenkins-agent/workspace/Lucene/Lucene-NightlyTests-main/test-data/enwiki.random.lines.txt -Ptests.multiplier=2 -Ptests.nightly=true -Ptests.seed=3800F50A26442230 -Ptests.vectorsize=256

  - org.apache.lucene.backward_codecs.lucene86.TestLucene86SegmentInfoFormat.testMergeStability (:lucene:backward-codecs)
    Test output: /home/jenkins/jenkins-agent/workspace/Lucene/Lucene-NightlyTests-main/checkout/lucene/backward-codecs/build/test-results/test/outputs/OUTPUT-org.apache.lucene.backward_codecs.lucene86.TestLucene86SegmentInfoFormat.txt
    Reproduce with: gradlew :lucene:backward-codecs:test --tests "org.apache.lucene.backward_codecs.lucene86.TestLucene86SegmentInfoFormat.testMergeStability" -Ptests.asserts=false -Ptests.file.encoding=ISO-8859-1 -Ptests.gui=true -Ptests.haltonfailure=false -Ptests.jvmargs= -Ptests.jvms=4 -Ptests.linedocsfile=/home/jenkins/jenkins-agent/workspace/Lucene/Lucene-NightlyTests-main/test-data/enwiki.random.lines.txt -Ptests.multiplier=2 -Ptests.nightly=true -Ptests.seed=3800F50A26442230 -Ptests.vectorsize=256

  - org.apache.lucene.backward_codecs.lucene50.TestLucene50TermVectorsFormat.testMergeStability (:lucene:backward-codecs)
    Test output: /home/jenkins/jenkins-agent/workspace/Lucene/Lucene-NightlyTests-main/checkout/lucene/backward-codecs/build/test-results/test/outputs/OUTPUT-org.apache.lucene.backward_codecs.lucene50.TestLucene50TermVectorsFormat.txt
    Reproduce with: gradlew :lucene:backward-codecs:test --tests "org.apache.lucene.backward_codecs.lucene50.TestLucene50TermVectorsFormat.testMergeStability" -Ptests.asserts=false -Ptests.file.encoding=ISO-8859-1 -Ptests.gui=true -Ptests.haltonfailure=false -Ptests.jvmargs= -Ptests.jvms=4 -Ptests.linedocsfile=/home/jenkins/jenkins-agent/workspace/Lucene/Lucene-NightlyTests-main/test-data/enwiki.random.lines.txt -Ptests.multiplier=2 -Ptests.nightly=true -Ptests.seed=3800F50A26442230 -Ptests.vectorsize=256

  - org.apache.lucene.backward_codecs.lucene87.TestLucene87StoredFieldsFormatHighCompression.testMergeStability (:lucene:backward-codecs)
    Test output: /home/jenkins/jenkins-agent/workspace/Lucene/Lucene-NightlyTests-main/checkout/lucene/backward-codecs/build/test-results/test/outputs/OUTPUT-org.apache.lucene.backward_codecs.lucene87.TestLucene87StoredFieldsFormatHighCompression.txt
    Reproduce with: gradlew :lucene:backward-codecs:test --tests "org.apache.lucene.backward_codecs.lucene87.TestLucene87StoredFieldsFormatHighCompression.testMergeStability" -Ptests.asserts=false -Ptests.file.encoding=ISO-8859-1 -Ptests.gui=true -Ptests.haltonfailure=false -Ptests.jvmargs= -Ptests.jvms=4 -Ptests.linedocsfile=/home/jenkins/jenkins-agent/workspace/Lucene/Lucene-NightlyTests-main/test-data/enwiki.random.lines.txt -Ptests.multiplier=2 -Ptests.nightly=true -Ptests.seed=3800F50A26442230 -Ptests.vectorsize=256

  - org.apache.lucene.backward_codecs.lucene87.TestLucene87StoredFieldsFormat.testMergeStability (:lucene:backward-codecs)
    Test output: /home/jenkins/jenkins-agent/workspace/Lucene/Lucene-NightlyTests-main/checkout/lucene/backward-codecs/build/test-results/test/outputs/OUTPUT-org.apache.lucene.backward_codecs.lucene87.TestLucene87StoredFieldsFormat.txt
    Reproduce with: gradlew :lucene:backward-codecs:test --tests "org.apache.lucene.backward_codecs.lucene87.TestLucene87StoredFieldsFormat.testMergeStability" -Ptests.asserts=false -Ptests.file.encoding=ISO-8859-1 -Ptests.gui=true -Ptests.haltonfailure=false -Ptests.jvmargs= -Ptests.jvms=4 -Ptests.linedocsfile=/home/jenkins/jenkins-agent/workspace/Lucene/Lucene-NightlyTests-main/test-data/enwiki.random.lines.txt -Ptests.multiplier=2 -Ptests.nightly=true -Ptests.seed=3800F50A26442230 -Ptests.vectorsize=256

The slowest tests during this run:
  443.18s TestStressNRTReplication.test (:lucene:replicator)
  389.36s Test2BPostings.test (:lucene:core)
  308.07s TestSimpleTextPostingsFormat.testDocsAndFreqsAndPositionsAndOffsetsAndPayloads (:lucene:codecs)
  218.43s TestSortedDvMultiRangeQuery.testDuelWithStandardDisjunction (:lucene:sandbox)
  198.21s TestSimpleTextPostingsFormat.testLineFileDocs (:lucene:codecs)
  183.72s TestBestCompressionLucene80DocValuesFormat.testNumericFieldJumpTables (:lucene:backward-codecs)
  182.55s TestBestSpeedLucene80DocValuesFormat.testNumericFieldJumpTables (:lucene:backward-codecs)
  172.11s TestLucene90DocValuesFormat.testNumericFieldJumpTables (:lucene:core)
  169.80s TestLucene90DocValuesFormatMergeInstance.testNumericFieldJumpTables (:lucene:core)
  159.54s TestIndexWriterOnDiskFull.testAddIndexOnDiskFull (:lucene:core)
The slowest suites during this run:
  1018.48s TestSimpleTextPostingsFormat (:lucene:codecs)
  449.03s TestLucene90DocValuesFormatMergeInstance (:lucene:core)
  443.60s TestStressNRTReplication (:lucene:replicator)
  389.37s Test2BPostings (:lucene:core)
  370.87s TestLucene90DocValuesFormat (:lucene:core)
  350.49s TestBestCompressionLucene80DocValuesFormat (:lucene:backward-codecs)
  337.65s TestBestSpeedLucene80DocValuesFormat (:lucene:backward-codecs)
  243.80s TestIndexWriterExceptions (:lucene:core)
  218.50s TestSortedDvMultiRangeQuery (:lucene:sandbox)
  184.32s TestFSTPostingsFormat (:lucene:codecs)

[Incubating] Problems report is available at: file:///home/jenkins/jenkins-agent/workspace/Lucene/Lucene-NightlyTests-main/checkout/build/reports/problems/problems-report.html

BUILD SUCCESSFUL in 1h 25m 29s
294 actionable tasks: 148 executed, 146 up-to-date
Consider enabling configuration cache to speed up this build: https://docs.gradle.org/9.2.1/userguide/configuration_cache_enabling.html
Build step 'Invoke Gradle script' changed build result to SUCCESS
Archiving artifacts
‘**/build*/**/tests-cwd/*.hprof’ doesn’t match anything: ‘**’ exists but not ‘**/build*/**/tests-cwd/*.hprof’
No artifacts found that match the file pattern "**/build*/**/tests-cwd/*.hprof,**/*_pid*.log". Configuration error?
Recording test results
[Checks API] No suitable checks publisher found.
Build step 'Publish JUnit test result report' changed build result to UNSTABLE
Email was triggered for: Unstable (Test Failures)
Sending email for trigger: Unstable (Test Failures)