You are viewing a plain text version of this content. The canonical link for it is here.
Posted to builds@cassandra.apache.org by Apache Jenkins Server <je...@builds.apache.org> on 2022/04/07 23:15:46 UTC

Build complete: Cassandra-trunk #1069 [UNSTABLE] 01c4404fff8c3dde071d4b9d0327acbb299be688

-------------------------------------------------------------------------------
Build Cassandra-trunk #1069 Still Unstable
URL: https://ci-cassandra.apache.org/job/Cassandra-trunk/1069/
-------------------------------------------------------------------------------
Changes:
[Josh McKenzie] Add guardrail to disallow creation of new COMPACT STORAGE tables


-------------------------------------------------------------------------------
Failed Tests:
26 tests failed.
FAILED:  dtest-upgrade.upgrade_tests.cql_tests.TestCQLNodes2RF1_Upgrade_indev_4_0_x_To_indev_trunk.test_static_cf
FAILED:  dtest-upgrade.upgrade_tests.cql_tests.TestCQLNodes2RF1_Upgrade_current_4_0_x_To_indev_trunk.test_static_cf
FAILED:  dtest-upgrade.upgrade_tests.cql_tests.TestCQLNodes2RF1_Upgrade_current_4_0_x_To_indev_trunk.test_noncomposite_static_cf
FAILED:  dtest-upgrade.upgrade_tests.cql_tests.TestCQLNodes2RF1_Upgrade_indev_3_0_x_To_indev_trunk.test_static_cf
FAILED:  dtest-upgrade.upgrade_tests.cql_tests.TestCQLNodes2RF1_Upgrade_current_3_0_x_To_indev_trunk.test_noncomposite_static_cf
FAILED:  dtest.json_test.TestToJsonSelect.test_counters
FAILED:  dtest.gossip_test.TestGossip.test_2dc_parallel_startup_one_seed
FAILED:  org.apache.cassandra.distributed.test.CasCriticalSectionTest.criticalSectionTest
FAILED:  org.apache.cassandra.distributed.test.PaxosRepairTest.paxosRepairVersionGate
FAILED:  org.apache.cassandra.distributed.test.repair.ForceRepairTest.forceWithDifference
FAILED:  org.apache.cassandra.db.commitlog.CommitLogSegmentManagerCDCTest.testCDCIndexFileWriteOnSync-cdc
FAILED:  org.apache.cassandra.db.commitlog.CommitLogSegmentManagerCDCTest.testCDCIndexFileWriteOnSync-cdc
FAILED:  org.apache.cassandra.cql3.validation.entities.SecondaryIndexTest.droppingIndexInvalidatesPreparedStatements
FAILED:  org.apache.cassandra.cql3.KeywordTest.test[keyword TUPLE isReserved false]
FAILED:  org.apache.cassandra.net.ProxyHandlerConnectionsTest.testExpireSome
FAILED:  org.apache.cassandra.distributed.test.CASTest.testSuccessfulWriteBeforeRangeMovement
FAILED:  dtest-upgrade.upgrade_tests.cql_tests.cls.test_noncomposite_static_cf
FAILED:  dtest-novnode.write_failures_test.TestMultiDCWriteFailures.test_oversized_mutation
FAILED:  dtest-offheap.write_failures_test.TestMultiDCWriteFailures.test_oversized_mutation
FAILED:  dtest-upgrade.upgrade_tests.upgrade_through_versions_test.TestProtoV3Upgrade_AllVersions_EndsAt_3_11_X.test_rolling_upgrade_with_internode_ssl
FAILED:  dtest-upgrade.upgrade_tests.upgrade_through_versions_test.TestUpgrade_current_3_0_x_To_indev_trunk.test_rolling_upgrade
FAILED:  dtest-upgrade.upgrade_tests.upgrade_through_versions_test.TestUpgrade_current_3_0_x_To_indev_trunk.test_rolling_upgrade_with_internode_ssl
FAILED:  dtest-upgrade.upgrade_tests.upgrade_through_versions_test.TestProtoV3Upgrade_AllVersions_RandomPartitioner_EndsAt_3_11_X_HEAD.test_rolling_upgrade
FAILED:  dtest-upgrade.upgrade_tests.upgrade_through_versions_test.TestProtoV3Upgrade_AllVersions_RandomPartitioner_EndsAt_3_11_X_HEAD.test_rolling_upgrade_with_internode_ssl
FAILED:  dtest-upgrade.upgrade_tests.upgrade_through_versions_test.TestProtoV3Upgrade_AllVersions_EndsAt_3_11_X.test_rolling_upgrade
FAILED:  dtest.write_failures_test.TestMultiDCWriteFailures.test_oversized_mutation

-------------------------------------------------------------------------------
For complete test report and logs see https://nightlies.apache.org/cassandra/Cassandra-trunk/1069/