You are viewing a plain text version of this content. The canonical link for it is here.
Posted to builds@cassandra.apache.org by Apache Jenkins Server <je...@builds.apache.org> on 2024/09/18 00:32:00 UTC
Build complete: Cassandra-4.0 #721 [UNSTABLE] 525245bdbd3175c5bfc1a716fa66868c89939e38
-------------------------------------------------------------------------------
Build Cassandra-4.0 #721 Still Unstable
URL: https://ci-cassandra.apache.org/job/Cassandra-4.0/721/
-------------------------------------------------------------------------------
Changes:
[Stefan Miklosovic] Fix millisecond and microsecond precision for commit log replay
[Brandon Williams] Fix BTree.FastBuilder.reset() and test
[Stefan Miklosovic] Fix millisecond and microsecond precision for commit log replay
[Brandon Williams] Fix BTree.FastBuilder.reset() and test
[Josh McKenzie] Add snapshot remote repo to build resolution and
-------------------------------------------------------------------------------
Failed Tests:
8 tests failed.
FAILED: dtest-novnode.transient_replication_ring_test.TestTransientReplicationRing.test_bootstrap_and_cleanup
FAILED: dtest-novnode.auth_test.TestNetworkAuth.test_single_dc_access
FAILED: dtest-novnode.transient_replication_ring_test.TestTransientReplicationRing.test_move_backwards_and_cleanup
FAILED: dtest-novnode.user_types_test.TestUserTypes.test_nested_type_dropping
FAILED: dtest-novnode.repair_tests.incremental_repair_test.TestIncRepair.test_repaired_tracking_with_partition_deletes
FAILED: dtest-offheap.materialized_views_test.TestMaterializedViewsConsistency.test_multi_partition_consistent_reads_after_write
FAILED: org.apache.cassandra.net.ProxyHandlerConnectionsTest.testExpireSome
FAILED: org.apache.cassandra.tools.TopPartitionsTest.testServiceTopPartitionsSingleTable
-------------------------------------------------------------------------------
For complete test report and logs see https://nightlies.apache.org/cassandra/Cassandra-4.0/721/