You are viewing a plain text version of this content. The canonical link for it is here.
Posted to builds@solr.apache.org by Apache Jenkins Server <je...@builds.apache.org> on 2025/12/11 22:54:17 UTC

[JENKINS] Solr » Solr-Test-10.x - Build # 549 - Still Failing!

Build: https://ci-builds.apache.org/job/Solr/job/Solr-Test-10.x/549/

No tests ran.

Build Log:
[...truncated 163 lines...]
BUILD FAILED in 1m 22s
54 actionable tasks: 54 executed

Publishing build scan...
https://develocity.apache.org/s/qmfn2sn2ls6r2

Build step 'Invoke Gradle script' changed build result to FAILURE
Build step 'Invoke Gradle script' marked build as failure
Archiving artifacts
Recording test results
ERROR: Step ‘Publish JUnit test result report’ failed: No test report files were found. Configuration error?
Email was triggered for: Failure - Any
Sending email for trigger: Failure - Any

[JENKINS] Solr » Solr-Test-10.x - Build # 560 - Still Failing!

Posted by Apache Jenkins Server <je...@builds.apache.org>.
Build: https://ci-builds.apache.org/job/Solr/job/Solr-Test-10.x/560/

No tests ran.

Build Log:
[...truncated 163 lines...]
BUILD FAILED in 1m 32s
54 actionable tasks: 54 executed

Publishing build scan...
https://develocity.apache.org/s/jisgly7puc53q

Build step 'Invoke Gradle script' changed build result to FAILURE
Build step 'Invoke Gradle script' marked build as failure
Archiving artifacts
Recording test results
ERROR: Step ‘Publish JUnit test result report’ failed: No test report files were found. Configuration error?
Email was triggered for: Failure - Any
Sending email for trigger: Failure - Any

[JENKINS] Solr » Solr-Test-10.x - Build # 559 - Still Failing!

Posted by Apache Jenkins Server <je...@builds.apache.org>.
Build: https://ci-builds.apache.org/job/Solr/job/Solr-Test-10.x/559/

No tests ran.

Build Log:
[...truncated 163 lines...]
BUILD FAILED in 1m 50s
54 actionable tasks: 54 executed

Publishing build scan...
https://develocity.apache.org/s/gvmovzm7wmrnk

Build step 'Invoke Gradle script' changed build result to FAILURE
Build step 'Invoke Gradle script' marked build as failure
Archiving artifacts
Recording test results
ERROR: Step ‘Publish JUnit test result report’ failed: No test report files were found. Configuration error?
Email was triggered for: Failure - Any
Sending email for trigger: Failure - Any

[JENKINS] Solr » Solr-Test-10.x - Build # 558 - Still Failing!

Posted by Apache Jenkins Server <je...@builds.apache.org>.
Build: https://ci-builds.apache.org/job/Solr/job/Solr-Test-10.x/558/

No tests ran.

Build Log:
[...truncated 163 lines...]
BUILD FAILED in 1m 31s
54 actionable tasks: 54 executed

Publishing build scan...
https://develocity.apache.org/s/zbjql5jlvp7l2

Build step 'Invoke Gradle script' changed build result to FAILURE
Build step 'Invoke Gradle script' marked build as failure
Archiving artifacts
Recording test results
ERROR: Step ‘Publish JUnit test result report’ failed: No test report files were found. Configuration error?
Email was triggered for: Failure - Any
Sending email for trigger: Failure - Any

[JENKINS] Solr » Solr-Test-10.x - Build # 557 - Still Failing!

Posted by Apache Jenkins Server <je...@builds.apache.org>.
Build: https://ci-builds.apache.org/job/Solr/job/Solr-Test-10.x/557/

No tests ran.

Build Log:
[...truncated 163 lines...]
BUILD FAILED in 1m 54s
54 actionable tasks: 54 executed

Publishing build scan...
https://develocity.apache.org/s/ie5hmnhzog7bu

Build step 'Invoke Gradle script' changed build result to FAILURE
Build step 'Invoke Gradle script' marked build as failure
Archiving artifacts
Recording test results
ERROR: Step ‘Publish JUnit test result report’ failed: No test report files were found. Configuration error?
Email was triggered for: Failure - Any
Sending email for trigger: Failure - Any

[JENKINS] Solr » Solr-Test-10.x - Build # 556 - Still Failing!

Posted by Apache Jenkins Server <je...@builds.apache.org>.
Build: https://ci-builds.apache.org/job/Solr/job/Solr-Test-10.x/556/

No tests ran.

Build Log:
[...truncated 164 lines...]
BUILD FAILED in 1m 21s
54 actionable tasks: 54 executed

Publishing build scan...
https://develocity.apache.org/s/qbbpqscxqf56g

Build step 'Invoke Gradle script' changed build result to FAILURE
Build step 'Invoke Gradle script' marked build as failure
Archiving artifacts
Recording test results
ERROR: Step ‘Publish JUnit test result report’ failed: No test report files were found. Configuration error?
Email was triggered for: Failure - Any
Sending email for trigger: Failure - Any

[JENKINS] Solr » Solr-Test-10.x - Build # 555 - Still Failing!

Posted by Apache Jenkins Server <je...@builds.apache.org>.
Build: https://ci-builds.apache.org/job/Solr/job/Solr-Test-10.x/555/

No tests ran.

Build Log:
[...truncated 163 lines...]
BUILD FAILED in 2m 38s
54 actionable tasks: 54 executed

Publishing build scan...
https://develocity.apache.org/s/uncsuof2vuyl2

Build step 'Invoke Gradle script' changed build result to FAILURE
Build step 'Invoke Gradle script' marked build as failure
Archiving artifacts
Recording test results
ERROR: Step ‘Publish JUnit test result report’ failed: No test report files were found. Configuration error?
Email was triggered for: Failure - Any
Sending email for trigger: Failure - Any

[JENKINS] Solr » Solr-Test-10.x - Build # 554 - Still Failing!

Posted by Apache Jenkins Server <je...@builds.apache.org>.
Build: https://ci-builds.apache.org/job/Solr/job/Solr-Test-10.x/554/

No tests ran.

Build Log:
[...truncated 163 lines...]
BUILD FAILED in 1m 30s
54 actionable tasks: 54 executed

Publishing build scan...
https://develocity.apache.org/s/pjsw4n5c3ifjk

Build step 'Invoke Gradle script' changed build result to FAILURE
Build step 'Invoke Gradle script' marked build as failure
Archiving artifacts
Recording test results
ERROR: Step ‘Publish JUnit test result report’ failed: No test report files were found. Configuration error?
Email was triggered for: Failure - Any
Sending email for trigger: Failure - Any

[JENKINS] Solr » Solr-Test-10.x - Build # 553 - Still Failing!

Posted by Apache Jenkins Server <je...@builds.apache.org>.
Build: https://ci-builds.apache.org/job/Solr/job/Solr-Test-10.x/553/

No tests ran.

Build Log:
[...truncated 164 lines...]
BUILD FAILED in 1m 20s
54 actionable tasks: 54 executed

Publishing build scan...
https://develocity.apache.org/s/pwkj5pmn37n7c

Build step 'Invoke Gradle script' changed build result to FAILURE
Build step 'Invoke Gradle script' marked build as failure
Archiving artifacts
Recording test results
ERROR: Step ‘Publish JUnit test result report’ failed: No test report files were found. Configuration error?
Email was triggered for: Failure - Any
Sending email for trigger: Failure - Any

[JENKINS] Solr » Solr-Test-10.x - Build # 552 - Still Failing!

Posted by Apache Jenkins Server <je...@builds.apache.org>.
Build: https://ci-builds.apache.org/job/Solr/job/Solr-Test-10.x/552/

No tests ran.

Build Log:
[...truncated 163 lines...]
BUILD FAILED in 1m 21s
54 actionable tasks: 54 executed

Publishing build scan...
https://develocity.apache.org/s/usid4hx6qfido

Build step 'Invoke Gradle script' changed build result to FAILURE
Build step 'Invoke Gradle script' marked build as failure
Archiving artifacts
Recording test results
ERROR: Step ‘Publish JUnit test result report’ failed: No test report files were found. Configuration error?
Email was triggered for: Failure - Any
Sending email for trigger: Failure - Any

[JENKINS] Solr » Solr-Test-10.x - Build # 551 - Still Failing!

Posted by Apache Jenkins Server <je...@builds.apache.org>.
Build: https://ci-builds.apache.org/job/Solr/job/Solr-Test-10.x/551/

No tests ran.

Build Log:
[...truncated 163 lines...]
BUILD FAILED in 1m 28s
54 actionable tasks: 54 executed

Publishing build scan...
https://develocity.apache.org/s/iwf54u5epkjam

Build step 'Invoke Gradle script' changed build result to FAILURE
Build step 'Invoke Gradle script' marked build as failure
Archiving artifacts
Recording test results
ERROR: Step ‘Publish JUnit test result report’ failed: No test report files were found. Configuration error?
Email was triggered for: Failure - Any
Sending email for trigger: Failure - Any

[JENKINS] Solr » Solr-Test-10.x - Build # 550 - Still Failing!

Posted by Apache Jenkins Server <je...@builds.apache.org>.
Build: https://ci-builds.apache.org/job/Solr/job/Solr-Test-10.x/550/

No tests ran.

Build Log:
[...truncated 163 lines...]
BUILD FAILED in 1m 35s
54 actionable tasks: 54 executed

Publishing build scan...
https://develocity.apache.org/s/pmfe7vipuaan2

Build step 'Invoke Gradle script' changed build result to FAILURE
Build step 'Invoke Gradle script' marked build as failure
Archiving artifacts
Recording test results
ERROR: Step ‘Publish JUnit test result report’ failed: No test report files were found. Configuration error?
Email was triggered for: Failure - Any
Sending email for trigger: Failure - Any