You are viewing a plain text version of this content. The canonical link for it is here.
Posted to dev@royale.apache.org by ap...@gmail.com on 2018/11/07 11:08:24 UTC

Build failed in Jenkins: royale-asjs_jsonly #1849

See <http://apacheroyaleci.westus2.cloudapp.azure.com:8080/job/royale-asjs_jsonly/1849/display/redirect?page=changes>

Changes:

[carlosrovira] some imports organization and clean up

[carlosrovira] deselect examples with List and ComboBox (to make it work)

[greg.dove] Regression fix: restore support for mxml setting of selectedIndex before

------------------------------------------
[...truncated 431.54 KB...]
     [java] 
     [java] 4903 bytes written to C:\Program Files (x86)\Jenkins\workspace\royale-compiler\compiler\target\custom.swc in 1.174 seconds
     [java] Picked up JAVA_TOOL_OPTIONS: -Dfile.encoding=UTF-8 -Xmx512m

download:

prepare:

junit-jar-check:

junit-jar:

commons-compress-jar-check:

commons-compress-jar:

commons-lang3-jar-check:

commons-lang3-jar:

main:

compile.tests:
     [echo] compiler is C:/Program Files (x86)/Jenkins/workspace/royale-compiler/compiler royale is C:/Program Files (x86)/Jenkins/workspace/royale-compiler/compiler
    [mkdir] Created dir: C:\Program Files (x86)\Jenkins\workspace\royale-compiler\compiler\target\test-classes
     [copy] Copying 51 files to C:\Program Files (x86)\Jenkins\workspace\royale-compiler\compiler\target\test-classes
    [javac] Compiling 103 source files to C:\Program Files (x86)\Jenkins\workspace\royale-compiler\compiler\target\test-classes
    [javac] C:\Program Files (x86)\Jenkins\workspace\royale-compiler\compiler\src\test\java\as\ASFeatureTestsBase.java:26: warning: [deprecation] FlashplayerSecurityHandler in utils has been deprecated
    [javac] import utils.FlashplayerSecurityHandler;
    [javac]             ^
    [javac] C:\Program Files (x86)\Jenkins\workspace\royale-compiler\compiler\src\test\java\mxml\tags\MXMLFeatureTestsBase.java:29: warning: [deprecation] FlashplayerSecurityHandler in utils has been deprecated
    [javac] import utils.FlashplayerSecurityHandler;
    [javac]             ^
    [javac] C:\Program Files (x86)\Jenkins\workspace\royale-compiler\compiler\src\test\java\mxml\tags\MXMLFeatureTestsBase.java:175: warning: [deprecation] FlashplayerSecurityHandler in utils has been deprecated
    [javac] 				new FlashplayerSecurityHandler().trustFile(tempMXMLFile.getParentFile());
    [javac] 				    ^
    [javac] C:\Program Files (x86)\Jenkins\workspace\royale-compiler\compiler\src\test\java\utils\FlashplayerSecurityHandler.java:34: warning: [dep-ann] deprecated item is not annotated with @Deprecated
    [javac] public class FlashplayerSecurityHandler {
    [javac]        ^
    [javac] 4 warnings

tests:
    [mkdir] Created dir: C:\Program Files (x86)\Jenkins\workspace\royale-compiler\compiler\target\junit-reports
    [mkdir] Created dir: C:\Program Files (x86)\Jenkins\workspace\royale-compiler\compiler\target\junit-temp
    [junit] Running as.ASDateTests
    [junit] looking for C:\Program Files (x86)\Jenkins\workspace\royale-compiler\env.properties
    [junit] environment property - FLEX_HOME = null
    [junit] environment property - PLAYERGLOBAL_HOME = null
    [junit] environment property - PLAYERGLOBAL_VERSION = 11.1
    [junit] environment property - TLF_HOME = null
    [junit] environment property - AIR_HOME = null
    [junit] environment property - FLASHPLAYER_DEBUGGER = null
    [junit] environment property - ASJS_HOME = <http://apacheroyaleci.westus2.cloudapp.azure.com:8080/job/royale-asjs_jsonly/ws/>
    [junit] environment property - GOOG_HOME = null
    [junit] ASDateTests_dayUTC
    [junit] Generating test:
    [junit] Compiling test:
    [junit] -external-library-path=C:\Program Files (x86)\Jenkins\workspace\royale-compiler\compiler-externc\target\js.swc C:\Program Files (x86)\Jenkins\workspace\royale-compiler\compiler\target\junit-temp\ASDateTests2264549661426128401.as 
    [junit] 
    [junit] C:\Program Files (x86)\Jenkins\workspace\royale-compiler\compiler\target\junit-temp\ASDateTests2264549661426128401.as(12): col: 1 Error: Property dayUTC is read-only.
    [junit] 
    [junit] date.dayUTC += 1;
    [junit] ^
    [junit] 
    [junit] After compile:
    [junit] Property dayUTC is read-only.
    [junit] 
    [junit] ASDateTests_monthUTC
    [junit] Generating test:
    [junit] Compiling test:
    [junit] -external-library-path=C:\Program Files (x86)\Jenkins\workspace\royale-compiler\compiler-externc\target\js.swc C:\Program Files (x86)\Jenkins\workspace\royale-compiler\compiler\target\junit-temp\ASDateTests3295944020154705903.as 
    [junit] 
    [junit] 607 bytes written to C:\Program Files (x86)\Jenkins\workspace\royale-compiler\compiler\target\junit-temp\ASDateTests3295944020154705903.swf in 0.238 seconds
    [junit] After compile:
    [junit] Unexpected compilation problems:
    [junit] 
    [junit] ASDateTests_hours
    [junit] tzoffset is 0
    [junit] GMT is GMT-0800
    [junit] Generating test:
    [junit] Compiling test:
    [junit] -external-library-path=C:\Program Files (x86)\Jenkins\workspace\royale-compiler\compiler-externc\target\js.swc C:\Program Files (x86)\Jenkins\workspace\royale-compiler\compiler\target\junit-temp\ASDateTests8157689669163240686.as 
    [junit] 
    [junit] 597 bytes written to C:\Program Files (x86)\Jenkins\workspace\royale-compiler\compiler\target\junit-temp\ASDateTests8157689669163240686.swf in 0.190 seconds
    [junit] After compile:
    [junit] Unexpected compilation problems:
    [junit] 
    [junit] ASDateTests_millisecondsUTC
    [junit] Generating test:
    [junit] Compiling test:
    [junit] -external-library-path=C:\Program Files (x86)\Jenkins\workspace\royale-compiler\compiler-externc\target\js.swc C:\Program Files (x86)\Jenkins\workspace\royale-compiler\compiler\target\junit-temp\ASDateTests7968935813701296617.as 
    [junit] 
    [junit] 615 bytes written to C:\Program Files (x86)\Jenkins\workspace\royale-compiler\compiler\target\junit-temp\ASDateTests7968935813701296617.swf in 0.196 seconds
    [junit] After compile:
    [junit] Unexpected compilation problems:
    [junit] 
    [junit] ASDateTests_hoursUTC
    [junit] Generating test:
    [junit] Compiling test:
    [junit] -external-library-path=C:\Program Files (x86)\Jenkins\workspace\royale-compiler\compiler-externc\target\js.swc C:\Program Files (x86)\Jenkins\workspace\royale-compiler\compiler\target\junit-temp\ASDateTests4541460440030054747.as 
    [junit] 
    [junit] 607 bytes written to C:\Program Files (x86)\Jenkins\workspace\royale-compiler\compiler\target\junit-temp\ASDateTests4541460440030054747.swf in 0.110 seconds
    [junit] After compile:
    [junit] Unexpected compilation problems:
    [junit] 
    [junit] ASDateTests_minutes
    [junit] Generating test:
    [junit] Compiling test:
    [junit] -external-library-path=C:\Program Files (x86)\Jenkins\workspace\royale-compiler\compiler-externc\target\js.swc C:\Program Files (x86)\Jenkins\workspace\royale-compiler\compiler\target\junit-temp\ASDateTests5835288971625165017.as 
    [junit] 
    [junit] 606 bytes written to C:\Program Files (x86)\Jenkins\workspace\royale-compiler\compiler\target\junit-temp\ASDateTests5835288971625165017.swf in 0.142 seconds
    [junit] After compile:
    [junit] Unexpected compilation problems:
    [junit] 
    [junit] ASDateTests_month
    [junit] tzoffset is 0
    [junit] GMT is GMT-0800
    [junit] Generating test:
    [junit] Compiling test:
    [junit] -external-library-path=C:\Program Files (x86)\Jenkins\workspace\royale-compiler\compiler-externc\target\js.swc C:\Program Files (x86)\Jenkins\workspace\royale-compiler\compiler\target\junit-temp\ASDateTests4326084635950916301.as 
    [junit] 
    [junit] 596 bytes written to C:\Program Files (x86)\Jenkins\workspace\royale-compiler\compiler\target\junit-temp\ASDateTests4326084635950916301.swf in 0.105 seconds
    [junit] After compile:
    [junit] Unexpected compilation problems:
    [junit] 
    [junit] ASDateTests_seconds
    [junit] Generating test:
    [junit] Compiling test:
    [junit] -external-library-path=C:\Program Files (x86)\Jenkins\workspace\royale-compiler\compiler-externc\target\js.swc C:\Program Files (x86)\Jenkins\workspace\royale-compiler\compiler\target\junit-temp\ASDateTests1597151104722362535.as 
    [junit] 
    [junit] 605 bytes written to C:\Program Files (x86)\Jenkins\workspace\royale-compiler\compiler\target\junit-temp\ASDateTests1597151104722362535.swf in 0.095 seconds
    [junit] After compile:
    [junit] Unexpected compilation problems:
    [junit] 
    [junit] ASDateTests_timezoneOffset_set
    [junit] Generating test:
    [junit] Compiling test:
    [junit] -external-library-path=C:\Program Files (x86)\Jenkins\workspace\royale-compiler\compiler-externc\target\js.swc C:\Program Files (x86)\Jenkins\workspace\royale-compiler\compiler\target\junit-temp\ASDateTests685912970995659821.as 
    [junit] 
    [junit] C:\Program Files (x86)\Jenkins\workspace\royale-compiler\compiler\target\junit-temp\ASDateTests685912970995659821.as(12): col: 1 Error: Property timezoneOffset is read-only.
    [junit] 
    [junit] date.timezoneOffset += 480;
    [junit] ^
    [junit] 
    [junit] After compile:
    [junit] Property timezoneOffset is read-only.
    [junit] 
    [junit] ASDateTests_secondsUTC
    [junit] Generating test:
    [junit] Compiling test:
    [junit] -external-library-path=C:\Program Files (x86)\Jenkins\workspace\royale-compiler\compiler-externc\target\js.swc C:\Program Files (x86)\Jenkins\workspace\royale-compiler\compiler\target\junit-temp\ASDateTests5737855863330329218.as 
    [junit] 
    [junit] 609 bytes written to C:\Program Files (x86)\Jenkins\workspace\royale-compiler\compiler\target\junit-temp\ASDateTests5737855863330329218.swf in 0.095 seconds
    [junit] After compile:
    [junit] Unexpected compilation problems:
    [junit] 
    [junit] ASDateTests_milliseconds
    [junit] Generating test:
    [junit] Compiling test:
    [junit] -external-library-path=C:\Program Files (x86)\Jenkins\workspace\royale-compiler\compiler-externc\target\js.swc C:\Program Files (x86)\Jenkins\workspace\royale-compiler\compiler\target\junit-temp\ASDateTests6131303127388660520.as 
    [junit] 
    [junit] 610 bytes written to C:\Program Files (x86)\Jenkins\workspace\royale-compiler\compiler\target\junit-temp\ASDateTests6131303127388660520.swf in 0.109 seconds
    [junit] After compile:
    [junit] Unexpected compilation problems:
    [junit] 
    [junit] ASDateTests_dateUTC
    [junit] Generating test:
    [junit] Compiling test:
    [junit] -external-library-path=C:\Program Files (x86)\Jenkins\workspace\royale-compiler\compiler-externc\target\js.swc C:\Program Files (x86)\Jenkins\workspace\royale-compiler\compiler\target\junit-temp\ASDateTests7412279678403622981.as 
    [junit] 
    [junit] 603 bytes written to C:\Program Files (x86)\Jenkins\workspace\royale-compiler\compiler\target\junit-temp\ASDateTests7412279678403622981.swf in 0.125 seconds
    [junit] After compile:
    [junit] Unexpected compilation problems:
    [junit] 
    [junit] ASDateTests_fullYear
    [junit] tzoffset is 0
    [junit] GMT is GMT-0800
    [junit] Generating test:
    [junit] Compiling test:
    [junit] -external-library-path=C:\Program Files (x86)\Jenkins\workspace\royale-compiler\compiler-externc\target\js.swc C:\Program Files (x86)\Jenkins\workspace\royale-compiler\compiler\target\junit-temp\ASDateTests5849351913395272785.as 
    [junit] 
    [junit] 609 bytes written to C:\Program Files (x86)\Jenkins\workspace\royale-compiler\compiler\target\junit-temp\ASDateTests5849351913395272785.swf in 0.089 seconds
    [junit] After compile:
    [junit] Unexpected compilation problems:
    [junit] 
    [junit] ASDateTests_fullYearUTC
    [junit] Generating test:
    [junit] Compiling test:
    [junit] -external-library-path=C:\Program Files (x86)\Jenkins\workspace\royale-compiler\compiler-externc\target\js.swc C:\Program Files (x86)\Jenkins\workspace\royale-compiler\compiler\target\junit-temp\ASDateTests4016386808511152049.as 
    [junit] 
    [junit] 612 bytes written to C:\Program Files (x86)\Jenkins\workspace\royale-compiler\compiler\target\junit-temp\ASDateTests4016386808511152049.swf in 0.097 seconds
    [junit] After compile:
    [junit] Unexpected compilation problems:
    [junit] 
    [junit] ASDateTests_minutesUTC
    [junit] Generating test:
    [junit] Compiling test:
    [junit] -external-library-path=C:\Program Files (x86)\Jenkins\workspace\royale-compiler\compiler-externc\target\js.swc C:\Program Files (x86)\Jenkins\workspace\royale-compiler\compiler\target\junit-temp\ASDateTests932609777818425615.as 
    [junit] 
    [junit] 609 bytes written to C:\Program Files (x86)\Jenkins\workspace\royale-compiler\compiler\target\junit-temp\ASDateTests932609777818425615.swf in 0.160 seconds
    [junit] After compile:
    [junit] Unexpected compilation problems:
    [junit] 
    [junit] ASDateTests_date
    [junit] tzoffset is 0
    [junit] GMT is GMT-0800
    [junit] Generating test:
    [junit] Compiling test:
    [junit] -external-library-path=C:\Program Files (x86)\Jenkins\workspace\royale-compiler\compiler-externc\target\js.swc C:\Program Files (x86)\Jenkins\workspace\royale-compiler\compiler\target\junit-temp\ASDateTests875227246154178202.as 
    [junit] 
    [junit] 590 bytes written to C:\Program Files (x86)\Jenkins\workspace\royale-compiler\compiler\target\junit-temp\ASDateTests875227246154178202.swf in 0.103 seconds
    [junit] After compile:
    [junit] Unexpected compilation problems:
    [junit] 
    [junit] ASDateTests_time
    [junit] Generating test:
    [junit] Compiling test:
    [junit] -external-library-path=C:\Program Files (x86)\Jenkins\workspace\royale-compiler\compiler-externc\target\js.swc C:\Program Files (x86)\Jenkins\workspace\royale-compiler\compiler\target\junit-temp\ASDateTests8293430302819388691.as 
    [junit] 
    [junit] 611 bytes written to C:\Program Files (x86)\Jenkins\workspace\royale-compiler\compiler\target\junit-temp\ASDateTests8293430302819388691.swf in 0.084 seconds
    [junit] After compile:
    [junit] Unexpected compilation problems:
    [junit] 
    [junit] ASDateTests_day
    [junit] Generating test:
    [junit] Compiling test:
    [junit] -external-library-path=C:\Program Files (x86)\Jenkins\workspace\royale-compiler\compiler-externc\target\js.swc C:\Program Files (x86)\Jenkins\workspace\royale-compiler\compiler\target\junit-temp\ASDateTests4668886216637941551.as 
    [junit] 
    [junit] After compile:
    [junit] Property day is read-only.
    [junit] 
    [junit] Tests run: 19, Failures: 3, Errors: 0, Skipped: 1, Time elapsed: 3.864 sec
    [junit] C:\Program Files (x86)\Jenkins\workspace\royale-compiler\compiler\target\junit-temp\ASDateTests4668886216637941551.as(12): col: 1 Error: Property day is read-only.
    [junit] 
    [junit] date.day += 1;
    [junit] ^
    [junit] 
    [junit] Picked up JAVA_TOOL_OPTIONS: -Dfile.encoding=UTF-8 -Xmx512m

BUILD FAILED
<http://apacheroyaleci.westus2.cloudapp.azure.com:8080/job/royale-asjs_jsonly/ws/build.xml>:2030: The following error occurred while executing this line:
C:\Program Files (x86)\Jenkins\workspace\royale-compiler\build.xml:80: The following error occurred while executing this line:
C:\Program Files (x86)\Jenkins\workspace\royale-compiler\compiler\build.xml:711: The following error occurred while executing this line:
C:\Program Files (x86)\Jenkins\workspace\royale-compiler\compiler\src\test\build.xml:307: Tests failed

Total time: 25 minutes 29 seconds
Picked up JAVA_TOOL_OPTIONS: -Dfile.encoding=UTF-8 -Xmx512m
Build step 'Invoke Ant' marked build as failure
Archiving artifacts

Jenkins build is back to normal : royale-asjs_jsonly #1854

Posted by ap...@gmail.com.
See <http://apacheroyaleci.westus2.cloudapp.azure.com:8080/job/royale-asjs_jsonly/1854/display/redirect?page=changes>


Build failed in Jenkins: royale-asjs_jsonly #1853

Posted by ap...@gmail.com.
See <http://apacheroyaleci.westus2.cloudapp.azure.com:8080/job/royale-asjs_jsonly/1853/display/redirect?page=changes>

Changes:

[serkan.tas] MenuBar related classes and TreeEvent class emulated.

[serkan.tas] unnecessary classes removed

[serkan.tas] .

[serkan.tas] .

[serkan.tas] used from external library

[serkan.tas] emulation work

[noreply] Delete IUITextField.as

[noreply] Delete CSSStyleDeclaration.as

[serkan.tas] PopUpEvent and FromItem emulated

[serkan.tas] changes reverted

[serkan.tas] changes reverted

[carlosrovira] fix Form events

------------------------------------------
[...truncated 431.58 KB...]
     [java] 
     [java] Picked up JAVA_TOOL_OPTIONS: -Dfile.encoding=UTF-8 -Xmx512m
     [java] 4903 bytes written to C:\Program Files (x86)\Jenkins\workspace\royale-compiler\compiler\target\custom.swc in 1.552 seconds

download:

prepare:

junit-jar-check:

junit-jar:

commons-compress-jar-check:

commons-compress-jar:

commons-lang3-jar-check:

commons-lang3-jar:

main:

compile.tests:
     [echo] compiler is C:/Program Files (x86)/Jenkins/workspace/royale-compiler/compiler royale is C:/Program Files (x86)/Jenkins/workspace/royale-compiler/compiler
    [mkdir] Created dir: C:\Program Files (x86)\Jenkins\workspace\royale-compiler\compiler\target\test-classes
     [copy] Copying 51 files to C:\Program Files (x86)\Jenkins\workspace\royale-compiler\compiler\target\test-classes
    [javac] Compiling 103 source files to C:\Program Files (x86)\Jenkins\workspace\royale-compiler\compiler\target\test-classes
    [javac] C:\Program Files (x86)\Jenkins\workspace\royale-compiler\compiler\src\test\java\as\ASFeatureTestsBase.java:26: warning: [deprecation] FlashplayerSecurityHandler in utils has been deprecated
    [javac] import utils.FlashplayerSecurityHandler;
    [javac]             ^
    [javac] C:\Program Files (x86)\Jenkins\workspace\royale-compiler\compiler\src\test\java\mxml\tags\MXMLFeatureTestsBase.java:29: warning: [deprecation] FlashplayerSecurityHandler in utils has been deprecated
    [javac] import utils.FlashplayerSecurityHandler;
    [javac]             ^
    [javac] C:\Program Files (x86)\Jenkins\workspace\royale-compiler\compiler\src\test\java\mxml\tags\MXMLFeatureTestsBase.java:175: warning: [deprecation] FlashplayerSecurityHandler in utils has been deprecated
    [javac] 				new FlashplayerSecurityHandler().trustFile(tempMXMLFile.getParentFile());
    [javac] 				    ^
    [javac] C:\Program Files (x86)\Jenkins\workspace\royale-compiler\compiler\src\test\java\utils\FlashplayerSecurityHandler.java:34: warning: [dep-ann] deprecated item is not annotated with @Deprecated
    [javac] public class FlashplayerSecurityHandler {
    [javac]        ^
    [javac] 4 warnings

tests:
    [mkdir] Created dir: C:\Program Files (x86)\Jenkins\workspace\royale-compiler\compiler\target\junit-reports
    [mkdir] Created dir: C:\Program Files (x86)\Jenkins\workspace\royale-compiler\compiler\target\junit-temp
    [junit] Running as.ASDateTests
    [junit] looking for C:\Program Files (x86)\Jenkins\workspace\royale-compiler\env.properties
    [junit] environment property - FLEX_HOME = null
    [junit] environment property - PLAYERGLOBAL_HOME = null
    [junit] environment property - PLAYERGLOBAL_VERSION = 11.1
    [junit] environment property - TLF_HOME = null
    [junit] environment property - AIR_HOME = null
    [junit] environment property - FLASHPLAYER_DEBUGGER = null
    [junit] environment property - ASJS_HOME = <http://apacheroyaleci.westus2.cloudapp.azure.com:8080/job/royale-asjs_jsonly/ws/>
    [junit] environment property - GOOG_HOME = null
    [junit] ASDateTests_hours
    [junit] tzoffset is 0
    [junit] GMT is GMT-0800
    [junit] Generating test:
    [junit] Compiling test:
    [junit] -external-library-path=C:\Program Files (x86)\Jenkins\workspace\royale-compiler\compiler-externc\target\js.swc C:\Program Files (x86)\Jenkins\workspace\royale-compiler\compiler\target\junit-temp\ASDateTests4023970635763760543.as 
    [junit] 
    [junit] 596 bytes written to C:\Program Files (x86)\Jenkins\workspace\royale-compiler\compiler\target\junit-temp\ASDateTests4023970635763760543.swf in 1.218 seconds
    [junit] After compile:
    [junit] Unexpected compilation problems:
    [junit] 
    [junit] ASDateTests_minutesUTC
    [junit] Generating test:
    [junit] Compiling test:
    [junit] -external-library-path=C:\Program Files (x86)\Jenkins\workspace\royale-compiler\compiler-externc\target\js.swc C:\Program Files (x86)\Jenkins\workspace\royale-compiler\compiler\target\junit-temp\ASDateTests2416852054177676901.as 
    [junit] 
    [junit] 608 bytes written to C:\Program Files (x86)\Jenkins\workspace\royale-compiler\compiler\target\junit-temp\ASDateTests2416852054177676901.swf in 0.333 seconds
    [junit] After compile:
    [junit] Unexpected compilation problems:
    [junit] 
    [junit] ASDateTests_dateUTC
    [junit] Generating test:
    [junit] Compiling test:
    [junit] -external-library-path=C:\Program Files (x86)\Jenkins\workspace\royale-compiler\compiler-externc\target\js.swc C:\Program Files (x86)\Jenkins\workspace\royale-compiler\compiler\target\junit-temp\ASDateTests3673309420067909777.as 
    [junit] 
    [junit] 606 bytes written to C:\Program Files (x86)\Jenkins\workspace\royale-compiler\compiler\target\junit-temp\ASDateTests3673309420067909777.swf in 0.153 seconds
    [junit] After compile:
    [junit] Unexpected compilation problems:
    [junit] 
    [junit] ASDateTests_millisecondsUTC
    [junit] Generating test:
    [junit] Compiling test:
    [junit] -external-library-path=C:\Program Files (x86)\Jenkins\workspace\royale-compiler\compiler-externc\target\js.swc C:\Program Files (x86)\Jenkins\workspace\royale-compiler\compiler\target\junit-temp\ASDateTests6645428870428570376.as 
    [junit] 
    [junit] 613 bytes written to C:\Program Files (x86)\Jenkins\workspace\royale-compiler\compiler\target\junit-temp\ASDateTests6645428870428570376.swf in 0.134 seconds
    [junit] After compile:
    [junit] Unexpected compilation problems:
    [junit] 
    [junit] ASDateTests_minutes
    [junit] Generating test:
    [junit] Compiling test:
    [junit] -external-library-path=C:\Program Files (x86)\Jenkins\workspace\royale-compiler\compiler-externc\target\js.swc C:\Program Files (x86)\Jenkins\workspace\royale-compiler\compiler\target\junit-temp\ASDateTests4804461283085654325.as 
    [junit] 
    [junit] 606 bytes written to C:\Program Files (x86)\Jenkins\workspace\royale-compiler\compiler\target\junit-temp\ASDateTests4804461283085654325.swf in 0.165 seconds
    [junit] After compile:
    [junit] Unexpected compilation problems:
    [junit] 
    [junit] ASDateTests_month
    [junit] tzoffset is 0
    [junit] GMT is GMT-0800
    [junit] Generating test:
    [junit] Compiling test:
    [junit] -external-library-path=C:\Program Files (x86)\Jenkins\workspace\royale-compiler\compiler-externc\target\js.swc C:\Program Files (x86)\Jenkins\workspace\royale-compiler\compiler\target\junit-temp\ASDateTests3289658261524135472.as 
    [junit] 
    [junit] 596 bytes written to C:\Program Files (x86)\Jenkins\workspace\royale-compiler\compiler\target\junit-temp\ASDateTests3289658261524135472.swf in 0.140 seconds
    [junit] After compile:
    [junit] Unexpected compilation problems:
    [junit] 
    [junit] ASDateTests_secondsUTC
    [junit] Generating test:
    [junit] Compiling test:
    [junit] -external-library-path=C:\Program Files (x86)\Jenkins\workspace\royale-compiler\compiler-externc\target\js.swc C:\Program Files (x86)\Jenkins\workspace\royale-compiler\compiler\target\junit-temp\ASDateTests1655925963797792208.as 
    [junit] 
    [junit] 610 bytes written to C:\Program Files (x86)\Jenkins\workspace\royale-compiler\compiler\target\junit-temp\ASDateTests1655925963797792208.swf in 0.143 seconds
    [junit] After compile:
    [junit] Unexpected compilation problems:
    [junit] 
    [junit] ASDateTests_timezoneOffset_set
    [junit] Generating test:
    [junit] Compiling test:
    [junit] -external-library-path=C:\Program Files (x86)\Jenkins\workspace\royale-compiler\compiler-externc\target\js.swc C:\Program Files (x86)\Jenkins\workspace\royale-compiler\compiler\target\junit-temp\ASDateTests8273806118179722664.as 
    [junit] 
    [junit] After compile:
    [junit] Property timezoneOffset is read-only.
    [junit] 
    [junit] ASDateTests_seconds
    [junit] C:\Program Files (x86)\Jenkins\workspace\royale-compiler\compiler\target\junit-temp\ASDateTests8273806118179722664.as(12): col: 1 Error: Property timezoneOffset is read-only.
    [junit] 
    [junit] date.timezoneOffset += 480;
    [junit] ^
    [junit] 
    [junit] Generating test:
    [junit] Compiling test:
    [junit] -external-library-path=C:\Program Files (x86)\Jenkins\workspace\royale-compiler\compiler-externc\target\js.swc C:\Program Files (x86)\Jenkins\workspace\royale-compiler\compiler\target\junit-temp\ASDateTests3265182776680898384.as 
    [junit] 
    [junit] 606 bytes written to C:\Program Files (x86)\Jenkins\workspace\royale-compiler\compiler\target\junit-temp\ASDateTests3265182776680898384.swf in 0.138 seconds
    [junit] After compile:
    [junit] Unexpected compilation problems:
    [junit] 
    [junit] ASDateTests_hoursUTC
    [junit] Generating test:
    [junit] Compiling test:
    [junit] -external-library-path=C:\Program Files (x86)\Jenkins\workspace\royale-compiler\compiler-externc\target\js.swc C:\Program Files (x86)\Jenkins\workspace\royale-compiler\compiler\target\junit-temp\ASDateTests2413450987373684422.as 
    [junit] 
    [junit] 607 bytes written to C:\Program Files (x86)\Jenkins\workspace\royale-compiler\compiler\target\junit-temp\ASDateTests2413450987373684422.swf in 0.115 seconds
    [junit] After compile:
    [junit] Unexpected compilation problems:
    [junit] 
    [junit] ASDateTests_monthUTC
    [junit] Generating test:
    [junit] Compiling test:
    [junit] -external-library-path=C:\Program Files (x86)\Jenkins\workspace\royale-compiler\compiler-externc\target\js.swc C:\Program Files (x86)\Jenkins\workspace\royale-compiler\compiler\target\junit-temp\ASDateTests7340421650100687456.as 
    [junit] 
    [junit] 607 bytes written to C:\Program Files (x86)\Jenkins\workspace\royale-compiler\compiler\target\junit-temp\ASDateTests7340421650100687456.swf in 0.197 seconds
    [junit] After compile:
    [junit] Unexpected compilation problems:
    [junit] 
    [junit] ASDateTests_fullYear
    [junit] tzoffset is 0
    [junit] GMT is GMT-0800
    [junit] Generating test:
    [junit] Compiling test:
    [junit] -external-library-path=C:\Program Files (x86)\Jenkins\workspace\royale-compiler\compiler-externc\target\js.swc C:\Program Files (x86)\Jenkins\workspace\royale-compiler\compiler\target\junit-temp\ASDateTests2023041019362288351.as 
    [junit] 
    [junit] 607 bytes written to C:\Program Files (x86)\Jenkins\workspace\royale-compiler\compiler\target\junit-temp\ASDateTests2023041019362288351.swf in 0.375 seconds
    [junit] After compile:
    [junit] Unexpected compilation problems:
    [junit] 
    [junit] ASDateTests_fullYearUTC
    [junit] Generating test:
    [junit] Compiling test:
    [junit] -external-library-path=C:\Program Files (x86)\Jenkins\workspace\royale-compiler\compiler-externc\target\js.swc C:\Program Files (x86)\Jenkins\workspace\royale-compiler\compiler\target\junit-temp\ASDateTests3782247663573790662.as 
    [junit] 
    [junit] 612 bytes written to C:\Program Files (x86)\Jenkins\workspace\royale-compiler\compiler\target\junit-temp\ASDateTests3782247663573790662.swf in 0.110 seconds
    [junit] After compile:
    [junit] Unexpected compilation problems:
    [junit] 
    [junit] ASDateTests_milliseconds
    [junit] Generating test:
    [junit] Compiling test:
    [junit] -external-library-path=C:\Program Files (x86)\Jenkins\workspace\royale-compiler\compiler-externc\target\js.swc C:\Program Files (x86)\Jenkins\workspace\royale-compiler\compiler\target\junit-temp\ASDateTests7325935378643191119.as 
    [junit] 
    [junit] 610 bytes written to C:\Program Files (x86)\Jenkins\workspace\royale-compiler\compiler\target\junit-temp\ASDateTests7325935378643191119.swf in 0.189 seconds
    [junit] After compile:
    [junit] Unexpected compilation problems:
    [junit] 
    [junit] ASDateTests_dayUTC
    [junit] Generating test:
    [junit] Compiling test:
    [junit] -external-library-path=C:\Program Files (x86)\Jenkins\workspace\royale-compiler\compiler-externc\target\js.swc C:\Program Files (x86)\Jenkins\workspace\royale-compiler\compiler\target\junit-temp\ASDateTests9017920905273470672.as 
    [junit] 
    [junit] C:\Program Files (x86)\Jenkins\workspace\royale-compiler\compiler\target\junit-temp\ASDateTests9017920905273470672.as(12): col: 1 Error: Property dayUTC is read-only.
    [junit] 
    [junit] date.dayUTC += 1;
    [junit] ^
    [junit] 
    [junit] After compile:
    [junit] Property dayUTC is read-only.
    [junit] 
    [junit] ASDateTests_time
    [junit] Generating test:
    [junit] Compiling test:
    [junit] -external-library-path=C:\Program Files (x86)\Jenkins\workspace\royale-compiler\compiler-externc\target\js.swc C:\Program Files (x86)\Jenkins\workspace\royale-compiler\compiler\target\junit-temp\ASDateTests3112372455655859022.as 
    [junit] 
    [junit] 611 bytes written to C:\Program Files (x86)\Jenkins\workspace\royale-compiler\compiler\target\junit-temp\ASDateTests3112372455655859022.swf in 0.119 seconds
    [junit] After compile:
    [junit] Unexpected compilation problems:
    [junit] 
    [junit] ASDateTests_date
    [junit] tzoffset is 0
    [junit] GMT is GMT-0800
    [junit] Generating test:
    [junit] Compiling test:
    [junit] -external-library-path=C:\Program Files (x86)\Jenkins\workspace\royale-compiler\compiler-externc\target\js.swc C:\Program Files (x86)\Jenkins\workspace\royale-compiler\compiler\target\junit-temp\ASDateTests2144005465349348453.as 
    [junit] 
    [junit] 591 bytes written to C:\Program Files (x86)\Jenkins\workspace\royale-compiler\compiler\target\junit-temp\ASDateTests2144005465349348453.swf in 0.166 seconds
    [junit] After compile:
    [junit] Unexpected compilation problems:
    [junit] 
    [junit] ASDateTests_day
    [junit] Generating test:
    [junit] Compiling test:
    [junit] -external-library-path=C:\Program Files (x86)\Jenkins\workspace\royale-compiler\compiler-externc\target\js.swc C:\Program Files (x86)\Jenkins\workspace\royale-compiler\compiler\target\junit-temp\ASDateTests243490681329474496.as 
    [junit] 
    [junit] C:\Program Files (x86)\Jenkins\workspace\royale-compiler\compiler\target\junit-temp\ASDateTests243490681329474496.as(12): col: 1 Error: Property day is read-only.
    [junit] 
    [junit] date.day += 1;
    [junit] ^
    [junit] 
    [junit] After compile:
    [junit] Property day is read-only.
    [junit] 
    [junit] Tests run: 19, Failures: 3, Errors: 0, Skipped: 1, Time elapsed: 5.413 sec
    [junit] Picked up JAVA_TOOL_OPTIONS: -Dfile.encoding=UTF-8 -Xmx512m

BUILD FAILED
<http://apacheroyaleci.westus2.cloudapp.azure.com:8080/job/royale-asjs_jsonly/ws/build.xml>:2030: The following error occurred while executing this line:
C:\Program Files (x86)\Jenkins\workspace\royale-compiler\build.xml:80: The following error occurred while executing this line:
C:\Program Files (x86)\Jenkins\workspace\royale-compiler\compiler\build.xml:711: The following error occurred while executing this line:
C:\Program Files (x86)\Jenkins\workspace\royale-compiler\compiler\src\test\build.xml:307: Tests failed

Total time: 25 minutes 45 seconds
Picked up JAVA_TOOL_OPTIONS: -Dfile.encoding=UTF-8 -Xmx512m
Build step 'Invoke Ant' marked build as failure
Archiving artifacts

Build failed in Jenkins: royale-asjs_jsonly #1852

Posted by ap...@gmail.com.
See <http://apacheroyaleci.westus2.cloudapp.azure.com:8080/job/royale-asjs_jsonly/1852/display/redirect?page=changes>

Changes:

[carlosrovira] fix wrong compile

------------------------------------------
[...truncated 431.56 KB...]
     [java] 
     [java] 4903 bytes written to C:\Program Files (x86)\Jenkins\workspace\royale-compiler\compiler\target\custom.swc in 1.217 seconds
     [java] Picked up JAVA_TOOL_OPTIONS: -Dfile.encoding=UTF-8 -Xmx512m

download:

prepare:

junit-jar-check:

junit-jar:

commons-compress-jar-check:

commons-compress-jar:

commons-lang3-jar-check:

commons-lang3-jar:

main:

compile.tests:
     [echo] compiler is C:/Program Files (x86)/Jenkins/workspace/royale-compiler/compiler royale is C:/Program Files (x86)/Jenkins/workspace/royale-compiler/compiler
    [mkdir] Created dir: C:\Program Files (x86)\Jenkins\workspace\royale-compiler\compiler\target\test-classes
     [copy] Copying 51 files to C:\Program Files (x86)\Jenkins\workspace\royale-compiler\compiler\target\test-classes
    [javac] Compiling 103 source files to C:\Program Files (x86)\Jenkins\workspace\royale-compiler\compiler\target\test-classes
    [javac] C:\Program Files (x86)\Jenkins\workspace\royale-compiler\compiler\src\test\java\as\ASFeatureTestsBase.java:26: warning: [deprecation] FlashplayerSecurityHandler in utils has been deprecated
    [javac] import utils.FlashplayerSecurityHandler;
    [javac]             ^
    [javac] C:\Program Files (x86)\Jenkins\workspace\royale-compiler\compiler\src\test\java\mxml\tags\MXMLFeatureTestsBase.java:29: warning: [deprecation] FlashplayerSecurityHandler in utils has been deprecated
    [javac] import utils.FlashplayerSecurityHandler;
    [javac]             ^
    [javac] C:\Program Files (x86)\Jenkins\workspace\royale-compiler\compiler\src\test\java\mxml\tags\MXMLFeatureTestsBase.java:175: warning: [deprecation] FlashplayerSecurityHandler in utils has been deprecated
    [javac] 				new FlashplayerSecurityHandler().trustFile(tempMXMLFile.getParentFile());
    [javac] 				    ^
    [javac] C:\Program Files (x86)\Jenkins\workspace\royale-compiler\compiler\src\test\java\utils\FlashplayerSecurityHandler.java:34: warning: [dep-ann] deprecated item is not annotated with @Deprecated
    [javac] public class FlashplayerSecurityHandler {
    [javac]        ^
    [javac] 4 warnings

tests:
    [mkdir] Created dir: C:\Program Files (x86)\Jenkins\workspace\royale-compiler\compiler\target\junit-reports
    [mkdir] Created dir: C:\Program Files (x86)\Jenkins\workspace\royale-compiler\compiler\target\junit-temp
    [junit] Running as.ASDateTests
    [junit] looking for C:\Program Files (x86)\Jenkins\workspace\royale-compiler\env.properties
    [junit] environment property - FLEX_HOME = null
    [junit] environment property - PLAYERGLOBAL_HOME = null
    [junit] environment property - PLAYERGLOBAL_VERSION = 11.1
    [junit] environment property - TLF_HOME = null
    [junit] environment property - AIR_HOME = null
    [junit] environment property - FLASHPLAYER_DEBUGGER = null
    [junit] environment property - ASJS_HOME = <http://apacheroyaleci.westus2.cloudapp.azure.com:8080/job/royale-asjs_jsonly/ws/>
    [junit] environment property - GOOG_HOME = null
    [junit] ASDateTests_date
    [junit] tzoffset is 0
    [junit] GMT is GMT-0800
    [junit] Generating test:
    [junit] Compiling test:
    [junit] -external-library-path=C:\Program Files (x86)\Jenkins\workspace\royale-compiler\compiler-externc\target\js.swc C:\Program Files (x86)\Jenkins\workspace\royale-compiler\compiler\target\junit-temp\ASDateTests7734310114644543040.as 
    [junit] 
    [junit] 590 bytes written to C:\Program Files (x86)\Jenkins\workspace\royale-compiler\compiler\target\junit-temp\ASDateTests7734310114644543040.swf in 1.104 seconds
    [junit] After compile:
    [junit] Unexpected compilation problems:
    [junit] 
    [junit] ASDateTests_time
    [junit] Generating test:
    [junit] Compiling test:
    [junit] -external-library-path=C:\Program Files (x86)\Jenkins\workspace\royale-compiler\compiler-externc\target\js.swc C:\Program Files (x86)\Jenkins\workspace\royale-compiler\compiler\target\junit-temp\ASDateTests6005548054476077035.as 
    [junit] 
    [junit] 611 bytes written to C:\Program Files (x86)\Jenkins\workspace\royale-compiler\compiler\target\junit-temp\ASDateTests6005548054476077035.swf in 0.223 seconds
    [junit] After compile:
    [junit] Unexpected compilation problems:
    [junit] 
    [junit] ASDateTests_day
    [junit] Generating test:
    [junit] Compiling test:
    [junit] -external-library-path=C:\Program Files (x86)\Jenkins\workspace\royale-compiler\compiler-externc\target\js.swc C:\Program Files (x86)\Jenkins\workspace\royale-compiler\compiler\target\junit-temp\ASDateTests2113786427985561940.as 
    [junit] 
    [junit] After compile:
    [junit] Property day is read-only.
    [junit] 
    [junit] ASDateTests_minutesUTC
    [junit] C:\Program Files (x86)\Jenkins\workspace\royale-compiler\compiler\target\junit-temp\ASDateTests2113786427985561940.as(12): col: 1 Error: Property day is read-only.
    [junit] 
    [junit] date.day += 1;
    [junit] ^
    [junit] 
    [junit] Generating test:
    [junit] Compiling test:
    [junit] -external-library-path=C:\Program Files (x86)\Jenkins\workspace\royale-compiler\compiler-externc\target\js.swc C:\Program Files (x86)\Jenkins\workspace\royale-compiler\compiler\target\junit-temp\ASDateTests7689108233669427097.as 
    [junit] 
    [junit] 608 bytes written to C:\Program Files (x86)\Jenkins\workspace\royale-compiler\compiler\target\junit-temp\ASDateTests7689108233669427097.swf in 0.137 seconds
    [junit] After compile:
    [junit] Unexpected compilation problems:
    [junit] 
    [junit] ASDateTests_fullYearUTC
    [junit] Generating test:
    [junit] Compiling test:
    [junit] -external-library-path=C:\Program Files (x86)\Jenkins\workspace\royale-compiler\compiler-externc\target\js.swc C:\Program Files (x86)\Jenkins\workspace\royale-compiler\compiler\target\junit-temp\ASDateTests2373470098720850825.as 
    [junit] 
    [junit] 613 bytes written to C:\Program Files (x86)\Jenkins\workspace\royale-compiler\compiler\target\junit-temp\ASDateTests2373470098720850825.swf in 0.146 seconds
    [junit] After compile:
    [junit] Unexpected compilation problems:
    [junit] 
    [junit] ASDateTests_secondsUTC
    [junit] Generating test:
    [junit] Compiling test:
    [junit] -external-library-path=C:\Program Files (x86)\Jenkins\workspace\royale-compiler\compiler-externc\target\js.swc C:\Program Files (x86)\Jenkins\workspace\royale-compiler\compiler\target\junit-temp\ASDateTests4337715210132500843.as 
    [junit] 
    [junit] 608 bytes written to C:\Program Files (x86)\Jenkins\workspace\royale-compiler\compiler\target\junit-temp\ASDateTests4337715210132500843.swf in 0.135 seconds
    [junit] After compile:
    [junit] Unexpected compilation problems:
    [junit] 
    [junit] ASDateTests_timezoneOffset_set
    [junit] Generating test:
    [junit] Compiling test:
    [junit] -external-library-path=C:\Program Files (x86)\Jenkins\workspace\royale-compiler\compiler-externc\target\js.swc C:\Program Files (x86)\Jenkins\workspace\royale-compiler\compiler\target\junit-temp\ASDateTests6130100555275446736.as 
    [junit] 
    [junit] C:\Program Files (x86)\Jenkins\workspace\royale-compiler\compiler\target\junit-temp\ASDateTests6130100555275446736.as(12): col: 1 Error: Property timezoneOffset is read-only.
    [junit] 
    [junit] date.timezoneOffset += 480;
    [junit] ^
    [junit] 
    [junit] After compile:
    [junit] Property timezoneOffset is read-only.
    [junit] 
    [junit] ASDateTests_hours
    [junit] tzoffset is 0
    [junit] GMT is GMT-0800
    [junit] Generating test:
    [junit] Compiling test:
    [junit] -external-library-path=C:\Program Files (x86)\Jenkins\workspace\royale-compiler\compiler-externc\target\js.swc C:\Program Files (x86)\Jenkins\workspace\royale-compiler\compiler\target\junit-temp\ASDateTests6490818960018631937.as 
    [junit] 
    [junit] 596 bytes written to C:\Program Files (x86)\Jenkins\workspace\royale-compiler\compiler\target\junit-temp\ASDateTests6490818960018631937.swf in 0.107 seconds
    [junit] After compile:
    [junit] Unexpected compilation problems:
    [junit] 
    [junit] ASDateTests_milliseconds
    [junit] Generating test:
    [junit] Compiling test:
    [junit] -external-library-path=C:\Program Files (x86)\Jenkins\workspace\royale-compiler\compiler-externc\target\js.swc C:\Program Files (x86)\Jenkins\workspace\royale-compiler\compiler\target\junit-temp\ASDateTests1875028671054653615.as 
    [junit] 
    [junit] 610 bytes written to C:\Program Files (x86)\Jenkins\workspace\royale-compiler\compiler\target\junit-temp\ASDateTests1875028671054653615.swf in 0.118 seconds
    [junit] After compile:
    [junit] Unexpected compilation problems:
    [junit] 
    [junit] ASDateTests_hoursUTC
    [junit] Generating test:
    [junit] Compiling test:
    [junit] -external-library-path=C:\Program Files (x86)\Jenkins\workspace\royale-compiler\compiler-externc\target\js.swc C:\Program Files (x86)\Jenkins\workspace\royale-compiler\compiler\target\junit-temp\ASDateTests1816371400408720239.as 
    [junit] 
    [junit] 607 bytes written to C:\Program Files (x86)\Jenkins\workspace\royale-compiler\compiler\target\junit-temp\ASDateTests1816371400408720239.swf in 0.101 seconds
    [junit] After compile:
    [junit] Unexpected compilation problems:
    [junit] 
    [junit] ASDateTests_month
    [junit] tzoffset is 0
    [junit] GMT is GMT-0800
    [junit] Generating test:
    [junit] Compiling test:
    [junit] -external-library-path=C:\Program Files (x86)\Jenkins\workspace\royale-compiler\compiler-externc\target\js.swc C:\Program Files (x86)\Jenkins\workspace\royale-compiler\compiler\target\junit-temp\ASDateTests1338228450743792377.as 
    [junit] 
    [junit] 596 bytes written to C:\Program Files (x86)\Jenkins\workspace\royale-compiler\compiler\target\junit-temp\ASDateTests1338228450743792377.swf in 0.171 seconds
    [junit] After compile:
    [junit] Unexpected compilation problems:
    [junit] 
    [junit] ASDateTests_monthUTC
    [junit] Generating test:
    [junit] Compiling test:
    [junit] -external-library-path=C:\Program Files (x86)\Jenkins\workspace\royale-compiler\compiler-externc\target\js.swc C:\Program Files (x86)\Jenkins\workspace\royale-compiler\compiler\target\junit-temp\ASDateTests3488986972645014571.as 
    [junit] 
    [junit] 607 bytes written to C:\Program Files (x86)\Jenkins\workspace\royale-compiler\compiler\target\junit-temp\ASDateTests3488986972645014571.swf in 0.089 seconds
    [junit] After compile:
    [junit] Unexpected compilation problems:
    [junit] 
    [junit] ASDateTests_fullYear
    [junit] tzoffset is 0
    [junit] GMT is GMT-0800
    [junit] Generating test:
    [junit] Compiling test:
    [junit] -external-library-path=C:\Program Files (x86)\Jenkins\workspace\royale-compiler\compiler-externc\target\js.swc C:\Program Files (x86)\Jenkins\workspace\royale-compiler\compiler\target\junit-temp\ASDateTests721778691608769989.as 
    [junit] 
    [junit] 607 bytes written to C:\Program Files (x86)\Jenkins\workspace\royale-compiler\compiler\target\junit-temp\ASDateTests721778691608769989.swf in 0.090 seconds
    [junit] After compile:
    [junit] Unexpected compilation problems:
    [junit] 
    [junit] ASDateTests_dateUTC
    [junit] Generating test:
    [junit] Compiling test:
    [junit] -external-library-path=C:\Program Files (x86)\Jenkins\workspace\royale-compiler\compiler-externc\target\js.swc C:\Program Files (x86)\Jenkins\workspace\royale-compiler\compiler\target\junit-temp\ASDateTests6608345037530294160.as 
    [junit] 
    [junit] 604 bytes written to C:\Program Files (x86)\Jenkins\workspace\royale-compiler\compiler\target\junit-temp\ASDateTests6608345037530294160.swf in 0.088 seconds
    [junit] After compile:
    [junit] Unexpected compilation problems:
    [junit] 
    [junit] ASDateTests_seconds
    [junit] Generating test:
    [junit] Compiling test:
    [junit] -external-library-path=C:\Program Files (x86)\Jenkins\workspace\royale-compiler\compiler-externc\target\js.swc C:\Program Files (x86)\Jenkins\workspace\royale-compiler\compiler\target\junit-temp\ASDateTests209444717065425603.as 
    [junit] 
    [junit] 603 bytes written to C:\Program Files (x86)\Jenkins\workspace\royale-compiler\compiler\target\junit-temp\ASDateTests209444717065425603.swf in 0.140 seconds
    [junit] After compile:
    [junit] Unexpected compilation problems:
    [junit] 
    [junit] ASDateTests_millisecondsUTC
    [junit] Generating test:
    [junit] Compiling test:
    [junit] -external-library-path=C:\Program Files (x86)\Jenkins\workspace\royale-compiler\compiler-externc\target\js.swc C:\Program Files (x86)\Jenkins\workspace\royale-compiler\compiler\target\junit-temp\ASDateTests2017278884895837398.as 
    [junit] 
    [junit] 614 bytes written to C:\Program Files (x86)\Jenkins\workspace\royale-compiler\compiler\target\junit-temp\ASDateTests2017278884895837398.swf in 0.124 seconds
    [junit] After compile:
    [junit] Unexpected compilation problems:
    [junit] 
    [junit] ASDateTests_dayUTC
    [junit] Generating test:
    [junit] Compiling test:
    [junit] -external-library-path=C:\Program Files (x86)\Jenkins\workspace\royale-compiler\compiler-externc\target\js.swc C:\Program Files (x86)\Jenkins\workspace\royale-compiler\compiler\target\junit-temp\ASDateTests2324825797526765745.as 
    [junit] 
    [junit] After compile:
    [junit] Property dayUTC is read-only.
    [junit] 
    [junit] ASDateTests_minutes
    [junit] Generating test:
    [junit] Compiling test:
    [junit] -external-library-path=C:\Program Files (x86)\Jenkins\workspace\royale-compiler\compiler-externc\target\js.swc C:\Program Files (x86)\Jenkins\workspace\royale-compiler\compiler\target\junit-temp\ASDateTests5250217900864781219.as 
    [junit] 
    [junit] C:\Program Files (x86)\Jenkins\workspace\royale-compiler\compiler\target\junit-temp\ASDateTests2324825797526765745.as(12): col: 1 Error: Property dayUTC is read-only.
    [junit] 
    [junit] date.dayUTC += 1;
    [junit] ^
    [junit] 
    [junit] 605 bytes written to C:\Program Files (x86)\Jenkins\workspace\royale-compiler\compiler\target\junit-temp\ASDateTests5250217900864781219.swf in 0.122 seconds
    [junit] After compile:
    [junit] Unexpected compilation problems:
    [junit] 
    [junit] Tests run: 19, Failures: 3, Errors: 0, Skipped: 1, Time elapsed: 4.245 sec
    [junit] Picked up JAVA_TOOL_OPTIONS: -Dfile.encoding=UTF-8 -Xmx512m

BUILD FAILED
<http://apacheroyaleci.westus2.cloudapp.azure.com:8080/job/royale-asjs_jsonly/ws/build.xml>:2030: The following error occurred while executing this line:
C:\Program Files (x86)\Jenkins\workspace\royale-compiler\build.xml:80: The following error occurred while executing this line:
C:\Program Files (x86)\Jenkins\workspace\royale-compiler\compiler\build.xml:711: The following error occurred while executing this line:
C:\Program Files (x86)\Jenkins\workspace\royale-compiler\compiler\src\test\build.xml:307: Tests failed

Total time: 25 minutes 20 seconds
Picked up JAVA_TOOL_OPTIONS: -Dfile.encoding=UTF-8 -Xmx512m
Build step 'Invoke Ant' marked build as failure
Archiving artifacts

Build failed in Jenkins: royale-asjs_jsonly #1851

Posted by ap...@gmail.com.
See <http://apacheroyaleci.westus2.cloudapp.azure.com:8080/job/royale-asjs_jsonly/1851/display/redirect?page=changes>

Changes:

[carlosrovira] -fixes Event missing type -add COMPILE::JS to flash import

------------------------------------------
[...truncated 431.50 KB...]
     [java] 
     [java] 4903 bytes written to C:\Program Files (x86)\Jenkins\workspace\royale-compiler\compiler\target\custom.swc in 1.512 seconds
     [java] Picked up JAVA_TOOL_OPTIONS: -Dfile.encoding=UTF-8 -Xmx512m

download:

prepare:

junit-jar-check:

junit-jar:

commons-compress-jar-check:

commons-compress-jar:

commons-lang3-jar-check:

commons-lang3-jar:

main:

compile.tests:
     [echo] compiler is C:/Program Files (x86)/Jenkins/workspace/royale-compiler/compiler royale is C:/Program Files (x86)/Jenkins/workspace/royale-compiler/compiler
    [mkdir] Created dir: C:\Program Files (x86)\Jenkins\workspace\royale-compiler\compiler\target\test-classes
     [copy] Copying 51 files to C:\Program Files (x86)\Jenkins\workspace\royale-compiler\compiler\target\test-classes
    [javac] Compiling 103 source files to C:\Program Files (x86)\Jenkins\workspace\royale-compiler\compiler\target\test-classes
    [javac] C:\Program Files (x86)\Jenkins\workspace\royale-compiler\compiler\src\test\java\as\ASFeatureTestsBase.java:26: warning: [deprecation] FlashplayerSecurityHandler in utils has been deprecated
    [javac] import utils.FlashplayerSecurityHandler;
    [javac]             ^
    [javac] C:\Program Files (x86)\Jenkins\workspace\royale-compiler\compiler\src\test\java\mxml\tags\MXMLFeatureTestsBase.java:29: warning: [deprecation] FlashplayerSecurityHandler in utils has been deprecated
    [javac] import utils.FlashplayerSecurityHandler;
    [javac]             ^
    [javac] C:\Program Files (x86)\Jenkins\workspace\royale-compiler\compiler\src\test\java\mxml\tags\MXMLFeatureTestsBase.java:175: warning: [deprecation] FlashplayerSecurityHandler in utils has been deprecated
    [javac] 				new FlashplayerSecurityHandler().trustFile(tempMXMLFile.getParentFile());
    [javac] 				    ^
    [javac] C:\Program Files (x86)\Jenkins\workspace\royale-compiler\compiler\src\test\java\utils\FlashplayerSecurityHandler.java:34: warning: [dep-ann] deprecated item is not annotated with @Deprecated
    [javac] public class FlashplayerSecurityHandler {
    [javac]        ^
    [javac] 4 warnings

tests:
    [mkdir] Created dir: C:\Program Files (x86)\Jenkins\workspace\royale-compiler\compiler\target\junit-reports
    [mkdir] Created dir: C:\Program Files (x86)\Jenkins\workspace\royale-compiler\compiler\target\junit-temp
    [junit] Running as.ASDateTests
    [junit] looking for C:\Program Files (x86)\Jenkins\workspace\royale-compiler\env.properties
    [junit] environment property - FLEX_HOME = null
    [junit] environment property - PLAYERGLOBAL_HOME = null
    [junit] environment property - PLAYERGLOBAL_VERSION = 11.1
    [junit] environment property - TLF_HOME = null
    [junit] environment property - AIR_HOME = null
    [junit] environment property - FLASHPLAYER_DEBUGGER = null
    [junit] environment property - ASJS_HOME = <http://apacheroyaleci.westus2.cloudapp.azure.com:8080/job/royale-asjs_jsonly/ws/>
    [junit] environment property - GOOG_HOME = null
    [junit] ASDateTests_hours
    [junit] tzoffset is 0
    [junit] GMT is GMT-0800
    [junit] Generating test:
    [junit] Compiling test:
    [junit] -external-library-path=C:\Program Files (x86)\Jenkins\workspace\royale-compiler\compiler-externc\target\js.swc C:\Program Files (x86)\Jenkins\workspace\royale-compiler\compiler\target\junit-temp\ASDateTests2241687865911198067.as 
    [junit] 
    [junit] 597 bytes written to C:\Program Files (x86)\Jenkins\workspace\royale-compiler\compiler\target\junit-temp\ASDateTests2241687865911198067.swf in 1.154 seconds
    [junit] After compile:
    [junit] Unexpected compilation problems:
    [junit] 
    [junit] ASDateTests_millisecondsUTC
    [junit] Generating test:
    [junit] Compiling test:
    [junit] -external-library-path=C:\Program Files (x86)\Jenkins\workspace\royale-compiler\compiler-externc\target\js.swc C:\Program Files (x86)\Jenkins\workspace\royale-compiler\compiler\target\junit-temp\ASDateTests4641163959564215225.as 
    [junit] 
    [junit] 615 bytes written to C:\Program Files (x86)\Jenkins\workspace\royale-compiler\compiler\target\junit-temp\ASDateTests4641163959564215225.swf in 0.322 seconds
    [junit] After compile:
    [junit] Unexpected compilation problems:
    [junit] 
    [junit] ASDateTests_timezoneOffset_set
    [junit] Generating test:
    [junit] Compiling test:
    [junit] -external-library-path=C:\Program Files (x86)\Jenkins\workspace\royale-compiler\compiler-externc\target\js.swc C:\Program Files (x86)\Jenkins\workspace\royale-compiler\compiler\target\junit-temp\ASDateTests3861262511003622786.as 
    [junit] 
    [junit] After compile:
    [junit] Property timezoneOffset is read-only.
    [junit] 
    [junit] ASDateTests_fullYear
    [junit] tzoffset is 0
    [junit] GMT is GMT-0800
    [junit] Generating test:
    [junit] Compiling test:
    [junit] -external-library-path=C:\Program Files (x86)\Jenkins\workspace\royale-compiler\compiler-externc\target\js.swc C:\Program Files (x86)\Jenkins\workspace\royale-compiler\compiler\target\junit-temp\ASDateTests5705668388872289400.as 
    [junit] 
    [junit] C:\Program Files (x86)\Jenkins\workspace\royale-compiler\compiler\target\junit-temp\ASDateTests3861262511003622786.as(12): col: 1 Error: Property timezoneOffset is read-only.
    [junit] 
    [junit] date.timezoneOffset += 480;
    [junit] ^
    [junit] 
    [junit] 608 bytes written to C:\Program Files (x86)\Jenkins\workspace\royale-compiler\compiler\target\junit-temp\ASDateTests5705668388872289400.swf in 0.238 seconds
    [junit] After compile:
    [junit] Unexpected compilation problems:
    [junit] 
    [junit] ASDateTests_month
    [junit] tzoffset is 0
    [junit] GMT is GMT-0800
    [junit] Generating test:
    [junit] Compiling test:
    [junit] -external-library-path=C:\Program Files (x86)\Jenkins\workspace\royale-compiler\compiler-externc\target\js.swc C:\Program Files (x86)\Jenkins\workspace\royale-compiler\compiler\target\junit-temp\ASDateTests6634566941390967878.as 
    [junit] 
    [junit] 597 bytes written to C:\Program Files (x86)\Jenkins\workspace\royale-compiler\compiler\target\junit-temp\ASDateTests6634566941390967878.swf in 0.153 seconds
    [junit] After compile:
    [junit] Unexpected compilation problems:
    [junit] 
    [junit] ASDateTests_milliseconds
    [junit] Generating test:
    [junit] Compiling test:
    [junit] -external-library-path=C:\Program Files (x86)\Jenkins\workspace\royale-compiler\compiler-externc\target\js.swc C:\Program Files (x86)\Jenkins\workspace\royale-compiler\compiler\target\junit-temp\ASDateTests5569890412266363146.as 
    [junit] 
    [junit] 610 bytes written to C:\Program Files (x86)\Jenkins\workspace\royale-compiler\compiler\target\junit-temp\ASDateTests5569890412266363146.swf in 0.205 seconds
    [junit] After compile:
    [junit] Unexpected compilation problems:
    [junit] 
    [junit] ASDateTests_minutesUTC
    [junit] Generating test:
    [junit] Compiling test:
    [junit] -external-library-path=C:\Program Files (x86)\Jenkins\workspace\royale-compiler\compiler-externc\target\js.swc C:\Program Files (x86)\Jenkins\workspace\royale-compiler\compiler\target\junit-temp\ASDateTests4575788353625222647.as 
    [junit] 
    [junit] 611 bytes written to C:\Program Files (x86)\Jenkins\workspace\royale-compiler\compiler\target\junit-temp\ASDateTests4575788353625222647.swf in 0.120 seconds
    [junit] After compile:
    [junit] Unexpected compilation problems:
    [junit] 
    [junit] ASDateTests_secondsUTC
    [junit] Generating test:
    [junit] Compiling test:
    [junit] -external-library-path=C:\Program Files (x86)\Jenkins\workspace\royale-compiler\compiler-externc\target\js.swc C:\Program Files (x86)\Jenkins\workspace\royale-compiler\compiler\target\junit-temp\ASDateTests6991955260423448835.as 
    [junit] 
    [junit] 609 bytes written to C:\Program Files (x86)\Jenkins\workspace\royale-compiler\compiler\target\junit-temp\ASDateTests6991955260423448835.swf in 0.135 seconds
    [junit] After compile:
    [junit] Unexpected compilation problems:
    [junit] 
    [junit] ASDateTests_hoursUTC
    [junit] Generating test:
    [junit] Compiling test:
    [junit] -external-library-path=C:\Program Files (x86)\Jenkins\workspace\royale-compiler\compiler-externc\target\js.swc C:\Program Files (x86)\Jenkins\workspace\royale-compiler\compiler\target\junit-temp\ASDateTests3360819759551859297.as 
    [junit] 
    [junit] 607 bytes written to C:\Program Files (x86)\Jenkins\workspace\royale-compiler\compiler\target\junit-temp\ASDateTests3360819759551859297.swf in 0.621 seconds
    [junit] After compile:
    [junit] Unexpected compilation problems:
    [junit] 
    [junit] ASDateTests_monthUTC
    [junit] Generating test:
    [junit] Compiling test:
    [junit] -external-library-path=C:\Program Files (x86)\Jenkins\workspace\royale-compiler\compiler-externc\target\js.swc C:\Program Files (x86)\Jenkins\workspace\royale-compiler\compiler\target\junit-temp\ASDateTests2955454616182319369.as 
    [junit] 
    [junit] 607 bytes written to C:\Program Files (x86)\Jenkins\workspace\royale-compiler\compiler\target\junit-temp\ASDateTests2955454616182319369.swf in 0.154 seconds
    [junit] After compile:
    [junit] Unexpected compilation problems:
    [junit] 
    [junit] ASDateTests_seconds
    [junit] Generating test:
    [junit] Compiling test:
    [junit] -external-library-path=C:\Program Files (x86)\Jenkins\workspace\royale-compiler\compiler-externc\target\js.swc C:\Program Files (x86)\Jenkins\workspace\royale-compiler\compiler\target\junit-temp\ASDateTests8920222040426684720.as 
    [junit] 
    [junit] 605 bytes written to C:\Program Files (x86)\Jenkins\workspace\royale-compiler\compiler\target\junit-temp\ASDateTests8920222040426684720.swf in 0.753 seconds
    [junit] After compile:
    [junit] Unexpected compilation problems:
    [junit] 
    [junit] ASDateTests_dayUTC
    [junit] Generating test:
    [junit] Compiling test:
    [junit] -external-library-path=C:\Program Files (x86)\Jenkins\workspace\royale-compiler\compiler-externc\target\js.swc C:\Program Files (x86)\Jenkins\workspace\royale-compiler\compiler\target\junit-temp\ASDateTests3515341049938857737.as 
    [junit] 
    [junit] After compile:
    [junit] Property dayUTC is read-only.
    [junit] 
    [junit] ASDateTests_fullYearUTC
    [junit] Generating test:
    [junit] Compiling test:
    [junit] -external-library-path=C:\Program Files (x86)\Jenkins\workspace\royale-compiler\compiler-externc\target\js.swc C:\Program Files (x86)\Jenkins\workspace\royale-compiler\compiler\target\junit-temp\ASDateTests5617522653254500698.as 
    [junit] C:\Program Files (x86)\Jenkins\workspace\royale-compiler\compiler\target\junit-temp\ASDateTests3515341049938857737.as(12): col: 1 Error: Property dayUTC is read-only.
    [junit] 
    [junit] date.dayUTC += 1;
    [junit] ^
    [junit] 
    [junit] 
    [junit] 613 bytes written to C:\Program Files (x86)\Jenkins\workspace\royale-compiler\compiler\target\junit-temp\ASDateTests5617522653254500698.swf in 0.151 seconds
    [junit] After compile:
    [junit] Unexpected compilation problems:
    [junit] 
    [junit] ASDateTests_dateUTC
    [junit] Generating test:
    [junit] Compiling test:
    [junit] -external-library-path=C:\Program Files (x86)\Jenkins\workspace\royale-compiler\compiler-externc\target\js.swc C:\Program Files (x86)\Jenkins\workspace\royale-compiler\compiler\target\junit-temp\ASDateTests2901299134679921591.as 
    [junit] 
    [junit] 605 bytes written to C:\Program Files (x86)\Jenkins\workspace\royale-compiler\compiler\target\junit-temp\ASDateTests2901299134679921591.swf in 0.191 seconds
    [junit] After compile:
    [junit] Unexpected compilation problems:
    [junit] 
    [junit] ASDateTests_minutes
    [junit] Generating test:
    [junit] Compiling test:
    [junit] -external-library-path=C:\Program Files (x86)\Jenkins\workspace\royale-compiler\compiler-externc\target\js.swc C:\Program Files (x86)\Jenkins\workspace\royale-compiler\compiler\target\junit-temp\ASDateTests7219163224664538567.as 
    [junit] 
    [junit] 605 bytes written to C:\Program Files (x86)\Jenkins\workspace\royale-compiler\compiler\target\junit-temp\ASDateTests7219163224664538567.swf in 0.095 seconds
    [junit] After compile:
    [junit] Unexpected compilation problems:
    [junit] 
    [junit] ASDateTests_day
    [junit] Generating test:
    [junit] Compiling test:
    [junit] -external-library-path=C:\Program Files (x86)\Jenkins\workspace\royale-compiler\compiler-externc\target\js.swc C:\Program Files (x86)\Jenkins\workspace\royale-compiler\compiler\target\junit-temp\ASDateTests5279948235553903045.as 
    [junit] 
    [junit] After compile:
    [junit] Property day is read-only.
    [junit] 
    [junit] C:\Program Files (x86)\Jenkins\workspace\royale-compiler\compiler\target\junit-temp\ASDateTests5279948235553903045.as(12): col: 1 Error: Property day is read-only.
    [junit] 
    [junit] date.day += 1;
    [junit] ^
    [junit] 
    [junit] ASDateTests_date
    [junit] tzoffset is 0
    [junit] GMT is GMT-0800
    [junit] Generating test:
    [junit] Compiling test:
    [junit] -external-library-path=C:\Program Files (x86)\Jenkins\workspace\royale-compiler\compiler-externc\target\js.swc C:\Program Files (x86)\Jenkins\workspace\royale-compiler\compiler\target\junit-temp\ASDateTests8079681960714973331.as 
    [junit] 
    [junit] 592 bytes written to C:\Program Files (x86)\Jenkins\workspace\royale-compiler\compiler\target\junit-temp\ASDateTests8079681960714973331.swf in 0.095 seconds
    [junit] After compile:
    [junit] Unexpected compilation problems:
    [junit] 
    [junit] ASDateTests_time
    [junit] Generating test:
    [junit] Compiling test:
    [junit] -external-library-path=C:\Program Files (x86)\Jenkins\workspace\royale-compiler\compiler-externc\target\js.swc C:\Program Files (x86)\Jenkins\workspace\royale-compiler\compiler\target\junit-temp\ASDateTests4525682352581050911.as 
    [junit] 
    [junit] 611 bytes written to C:\Program Files (x86)\Jenkins\workspace\royale-compiler\compiler\target\junit-temp\ASDateTests4525682352581050911.swf in 0.108 seconds
    [junit] After compile:
    [junit] Unexpected compilation problems:
    [junit] 
    [junit] Tests run: 19, Failures: 3, Errors: 0, Skipped: 1, Time elapsed: 7.073 sec
    [junit] Picked up JAVA_TOOL_OPTIONS: -Dfile.encoding=UTF-8 -Xmx512m

BUILD FAILED
<http://apacheroyaleci.westus2.cloudapp.azure.com:8080/job/royale-asjs_jsonly/ws/build.xml>:2030: The following error occurred while executing this line:
C:\Program Files (x86)\Jenkins\workspace\royale-compiler\build.xml:80: The following error occurred while executing this line:
C:\Program Files (x86)\Jenkins\workspace\royale-compiler\compiler\build.xml:711: The following error occurred while executing this line:
C:\Program Files (x86)\Jenkins\workspace\royale-compiler\compiler\src\test\build.xml:307: Tests failed

Total time: 25 minutes 48 seconds
Picked up JAVA_TOOL_OPTIONS: -Dfile.encoding=UTF-8 -Xmx512m
Build step 'Invoke Ant' marked build as failure
Archiving artifacts

Build failed in Jenkins: royale-asjs_jsonly #1850

Posted by ap...@gmail.com.
See <http://apacheroyaleci.westus2.cloudapp.azure.com:8080/job/royale-asjs_jsonly/1850/display/redirect?page=changes>

Changes:

[harbs] Fixed TextArea element type

------------------------------------------
[...truncated 431.47 KB...]
     [java] 
     [java] 4903 bytes written to C:\Program Files (x86)\Jenkins\workspace\royale-compiler\compiler\target\custom.swc in 1.183 seconds
     [java] Picked up JAVA_TOOL_OPTIONS: -Dfile.encoding=UTF-8 -Xmx512m

download:

prepare:

junit-jar-check:

junit-jar:

commons-compress-jar-check:

commons-compress-jar:

commons-lang3-jar-check:

commons-lang3-jar:

main:

compile.tests:
     [echo] compiler is C:/Program Files (x86)/Jenkins/workspace/royale-compiler/compiler royale is C:/Program Files (x86)/Jenkins/workspace/royale-compiler/compiler
    [mkdir] Created dir: C:\Program Files (x86)\Jenkins\workspace\royale-compiler\compiler\target\test-classes
     [copy] Copying 51 files to C:\Program Files (x86)\Jenkins\workspace\royale-compiler\compiler\target\test-classes
    [javac] Compiling 103 source files to C:\Program Files (x86)\Jenkins\workspace\royale-compiler\compiler\target\test-classes
    [javac] C:\Program Files (x86)\Jenkins\workspace\royale-compiler\compiler\src\test\java\as\ASFeatureTestsBase.java:26: warning: [deprecation] FlashplayerSecurityHandler in utils has been deprecated
    [javac] import utils.FlashplayerSecurityHandler;
    [javac]             ^
    [javac] C:\Program Files (x86)\Jenkins\workspace\royale-compiler\compiler\src\test\java\mxml\tags\MXMLFeatureTestsBase.java:29: warning: [deprecation] FlashplayerSecurityHandler in utils has been deprecated
    [javac] import utils.FlashplayerSecurityHandler;
    [javac]             ^
    [javac] C:\Program Files (x86)\Jenkins\workspace\royale-compiler\compiler\src\test\java\mxml\tags\MXMLFeatureTestsBase.java:175: warning: [deprecation] FlashplayerSecurityHandler in utils has been deprecated
    [javac] 				new FlashplayerSecurityHandler().trustFile(tempMXMLFile.getParentFile());
    [javac] 				    ^
    [javac] C:\Program Files (x86)\Jenkins\workspace\royale-compiler\compiler\src\test\java\utils\FlashplayerSecurityHandler.java:34: warning: [dep-ann] deprecated item is not annotated with @Deprecated
    [javac] public class FlashplayerSecurityHandler {
    [javac]        ^
    [javac] 4 warnings

tests:
    [mkdir] Created dir: C:\Program Files (x86)\Jenkins\workspace\royale-compiler\compiler\target\junit-reports
    [mkdir] Created dir: C:\Program Files (x86)\Jenkins\workspace\royale-compiler\compiler\target\junit-temp
    [junit] Running as.ASDateTests
    [junit] looking for C:\Program Files (x86)\Jenkins\workspace\royale-compiler\env.properties
    [junit] environment property - FLEX_HOME = null
    [junit] environment property - PLAYERGLOBAL_HOME = null
    [junit] environment property - PLAYERGLOBAL_VERSION = 11.1
    [junit] environment property - TLF_HOME = null
    [junit] environment property - AIR_HOME = null
    [junit] environment property - FLASHPLAYER_DEBUGGER = null
    [junit] environment property - ASJS_HOME = <http://apacheroyaleci.westus2.cloudapp.azure.com:8080/job/royale-asjs_jsonly/ws/>
    [junit] environment property - GOOG_HOME = null
    [junit] ASDateTests_secondsUTC
    [junit] Generating test:
    [junit] Compiling test:
    [junit] -external-library-path=C:\Program Files (x86)\Jenkins\workspace\royale-compiler\compiler-externc\target\js.swc C:\Program Files (x86)\Jenkins\workspace\royale-compiler\compiler\target\junit-temp\ASDateTests5728297347003424733.as 
    [junit] 
    [junit] 609 bytes written to C:\Program Files (x86)\Jenkins\workspace\royale-compiler\compiler\target\junit-temp\ASDateTests5728297347003424733.swf in 0.997 seconds
    [junit] After compile:
    [junit] Unexpected compilation problems:
    [junit] 
    [junit] ASDateTests_dayUTC
    [junit] Generating test:
    [junit] Compiling test:
    [junit] -external-library-path=C:\Program Files (x86)\Jenkins\workspace\royale-compiler\compiler-externc\target\js.swc C:\Program Files (x86)\Jenkins\workspace\royale-compiler\compiler\target\junit-temp\ASDateTests6562666876115340413.as 
    [junit] 
    [junit] C:\Program Files (x86)\Jenkins\workspace\royale-compiler\compiler\target\junit-temp\ASDateTests6562666876115340413.as(12): col: 1 Error: Property dayUTC is read-only.
    [junit] 
    [junit] date.dayUTC += 1;
    [junit] ^
    [junit] 
    [junit] After compile:
    [junit] Property dayUTC is read-only.
    [junit] 
    [junit] ASDateTests_fullYear
    [junit] tzoffset is 0
    [junit] GMT is GMT-0800
    [junit] Generating test:
    [junit] Compiling test:
    [junit] -external-library-path=C:\Program Files (x86)\Jenkins\workspace\royale-compiler\compiler-externc\target\js.swc C:\Program Files (x86)\Jenkins\workspace\royale-compiler\compiler\target\junit-temp\ASDateTests3816380255261876752.as 
    [junit] 
    [junit] 609 bytes written to C:\Program Files (x86)\Jenkins\workspace\royale-compiler\compiler\target\junit-temp\ASDateTests3816380255261876752.swf in 0.198 seconds
    [junit] After compile:
    [junit] Unexpected compilation problems:
    [junit] 
    [junit] ASDateTests_minutesUTC
    [junit] Generating test:
    [junit] Compiling test:
    [junit] -external-library-path=C:\Program Files (x86)\Jenkins\workspace\royale-compiler\compiler-externc\target\js.swc C:\Program Files (x86)\Jenkins\workspace\royale-compiler\compiler\target\junit-temp\ASDateTests8651399182488627951.as 
    [junit] 
    [junit] 608 bytes written to C:\Program Files (x86)\Jenkins\workspace\royale-compiler\compiler\target\junit-temp\ASDateTests8651399182488627951.swf in 0.135 seconds
    [junit] After compile:
    [junit] Unexpected compilation problems:
    [junit] 
    [junit] ASDateTests_month
    [junit] tzoffset is 0
    [junit] GMT is GMT-0800
    [junit] Generating test:
    [junit] Compiling test:
    [junit] -external-library-path=C:\Program Files (x86)\Jenkins\workspace\royale-compiler\compiler-externc\target\js.swc C:\Program Files (x86)\Jenkins\workspace\royale-compiler\compiler\target\junit-temp\ASDateTests1720905033307658377.as 
    [junit] 
    [junit] 596 bytes written to C:\Program Files (x86)\Jenkins\workspace\royale-compiler\compiler\target\junit-temp\ASDateTests1720905033307658377.swf in 0.162 seconds
    [junit] After compile:
    [junit] Unexpected compilation problems:
    [junit] 
    [junit] ASDateTests_dateUTC
    [junit] Generating test:
    [junit] Compiling test:
    [junit] -external-library-path=C:\Program Files (x86)\Jenkins\workspace\royale-compiler\compiler-externc\target\js.swc C:\Program Files (x86)\Jenkins\workspace\royale-compiler\compiler\target\junit-temp\ASDateTests6963249678892084427.as 
    [junit] 
    [junit] 604 bytes written to C:\Program Files (x86)\Jenkins\workspace\royale-compiler\compiler\target\junit-temp\ASDateTests6963249678892084427.swf in 0.197 seconds
    [junit] After compile:
    [junit] Unexpected compilation problems:
    [junit] 
    [junit] ASDateTests_fullYearUTC
    [junit] Generating test:
    [junit] Compiling test:
    [junit] -external-library-path=C:\Program Files (x86)\Jenkins\workspace\royale-compiler\compiler-externc\target\js.swc C:\Program Files (x86)\Jenkins\workspace\royale-compiler\compiler\target\junit-temp\ASDateTests5586074445053626134.as 
    [junit] 
    [junit] 612 bytes written to C:\Program Files (x86)\Jenkins\workspace\royale-compiler\compiler\target\junit-temp\ASDateTests5586074445053626134.swf in 0.115 seconds
    [junit] After compile:
    [junit] Unexpected compilation problems:
    [junit] 
    [junit] ASDateTests_timezoneOffset_set
    [junit] Generating test:
    [junit] Compiling test:
    [junit] -external-library-path=C:\Program Files (x86)\Jenkins\workspace\royale-compiler\compiler-externc\target\js.swc C:\Program Files (x86)\Jenkins\workspace\royale-compiler\compiler\target\junit-temp\ASDateTests2134987819941307030.as 
    [junit] 
    [junit] C:\Program Files (x86)\Jenkins\workspace\royale-compiler\compiler\target\junit-temp\ASDateTests2134987819941307030.as(12): col: 1 Error: Property timezoneOffset is read-only.
    [junit] 
    [junit] date.timezoneOffset += 480;
    [junit] ^
    [junit] 
    [junit] After compile:
    [junit] Property timezoneOffset is read-only.
    [junit] 
    [junit] ASDateTests_milliseconds
    [junit] Generating test:
    [junit] Compiling test:
    [junit] -external-library-path=C:\Program Files (x86)\Jenkins\workspace\royale-compiler\compiler-externc\target\js.swc C:\Program Files (x86)\Jenkins\workspace\royale-compiler\compiler\target\junit-temp\ASDateTests3960293255573044008.as 
    [junit] 
    [junit] 610 bytes written to C:\Program Files (x86)\Jenkins\workspace\royale-compiler\compiler\target\junit-temp\ASDateTests3960293255573044008.swf in 0.234 seconds
    [junit] After compile:
    [junit] Unexpected compilation problems:
    [junit] 
    [junit] ASDateTests_hours
    [junit] tzoffset is 0
    [junit] GMT is GMT-0800
    [junit] Generating test:
    [junit] Compiling test:
    [junit] -external-library-path=C:\Program Files (x86)\Jenkins\workspace\royale-compiler\compiler-externc\target\js.swc C:\Program Files (x86)\Jenkins\workspace\royale-compiler\compiler\target\junit-temp\ASDateTests7480467176825495138.as 
    [junit] 
    [junit] 596 bytes written to C:\Program Files (x86)\Jenkins\workspace\royale-compiler\compiler\target\junit-temp\ASDateTests7480467176825495138.swf in 0.127 seconds
    [junit] After compile:
    [junit] Unexpected compilation problems:
    [junit] 
    [junit] ASDateTests_seconds
    [junit] Generating test:
    [junit] Compiling test:
    [junit] -external-library-path=C:\Program Files (x86)\Jenkins\workspace\royale-compiler\compiler-externc\target\js.swc C:\Program Files (x86)\Jenkins\workspace\royale-compiler\compiler\target\junit-temp\ASDateTests3298113971300710807.as 
    [junit] 
    [junit] 604 bytes written to C:\Program Files (x86)\Jenkins\workspace\royale-compiler\compiler\target\junit-temp\ASDateTests3298113971300710807.swf in 0.110 seconds
    [junit] After compile:
    [junit] Unexpected compilation problems:
    [junit] 
    [junit] ASDateTests_minutes
    [junit] Generating test:
    [junit] Compiling test:
    [junit] -external-library-path=C:\Program Files (x86)\Jenkins\workspace\royale-compiler\compiler-externc\target\js.swc C:\Program Files (x86)\Jenkins\workspace\royale-compiler\compiler\target\junit-temp\ASDateTests8498348538274339258.as 
    [junit] 
    [junit] 605 bytes written to C:\Program Files (x86)\Jenkins\workspace\royale-compiler\compiler\target\junit-temp\ASDateTests8498348538274339258.swf in 0.109 seconds
    [junit] After compile:
    [junit] Unexpected compilation problems:
    [junit] 
    [junit] ASDateTests_millisecondsUTC
    [junit] Generating test:
    [junit] Compiling test:
    [junit] -external-library-path=C:\Program Files (x86)\Jenkins\workspace\royale-compiler\compiler-externc\target\js.swc C:\Program Files (x86)\Jenkins\workspace\royale-compiler\compiler\target\junit-temp\ASDateTests5454197023915072465.as 
    [junit] 
    [junit] 615 bytes written to C:\Program Files (x86)\Jenkins\workspace\royale-compiler\compiler\target\junit-temp\ASDateTests5454197023915072465.swf in 0.104 seconds
    [junit] After compile:
    [junit] Unexpected compilation problems:
    [junit] 
    [junit] ASDateTests_monthUTC
    [junit] Generating test:
    [junit] Compiling test:
    [junit] -external-library-path=C:\Program Files (x86)\Jenkins\workspace\royale-compiler\compiler-externc\target\js.swc C:\Program Files (x86)\Jenkins\workspace\royale-compiler\compiler\target\junit-temp\ASDateTests619935249336108150.as 
    [junit] 
    [junit] 607 bytes written to C:\Program Files (x86)\Jenkins\workspace\royale-compiler\compiler\target\junit-temp\ASDateTests619935249336108150.swf in 0.090 seconds
    [junit] After compile:
    [junit] Unexpected compilation problems:
    [junit] 
    [junit] ASDateTests_hoursUTC
    [junit] Generating test:
    [junit] Compiling test:
    [junit] -external-library-path=C:\Program Files (x86)\Jenkins\workspace\royale-compiler\compiler-externc\target\js.swc C:\Program Files (x86)\Jenkins\workspace\royale-compiler\compiler\target\junit-temp\ASDateTests6347209696054990726.as 
    [junit] 
    [junit] 608 bytes written to C:\Program Files (x86)\Jenkins\workspace\royale-compiler\compiler\target\junit-temp\ASDateTests6347209696054990726.swf in 0.110 seconds
    [junit] After compile:
    [junit] Unexpected compilation problems:
    [junit] 
    [junit] ASDateTests_date
    [junit] tzoffset is 0
    [junit] GMT is GMT-0800
    [junit] Generating test:
    [junit] Compiling test:
    [junit] -external-library-path=C:\Program Files (x86)\Jenkins\workspace\royale-compiler\compiler-externc\target\js.swc C:\Program Files (x86)\Jenkins\workspace\royale-compiler\compiler\target\junit-temp\ASDateTests5790041990011839502.as 
    [junit] 
    [junit] 593 bytes written to C:\Program Files (x86)\Jenkins\workspace\royale-compiler\compiler\target\junit-temp\ASDateTests5790041990011839502.swf in 0.115 seconds
    [junit] After compile:
    [junit] Unexpected compilation problems:
    [junit] 
    [junit] ASDateTests_time
    [junit] Generating test:
    [junit] Compiling test:
    [junit] -external-library-path=C:\Program Files (x86)\Jenkins\workspace\royale-compiler\compiler-externc\target\js.swc C:\Program Files (x86)\Jenkins\workspace\royale-compiler\compiler\target\junit-temp\ASDateTests3619225933863006830.as 
    [junit] 
    [junit] 611 bytes written to C:\Program Files (x86)\Jenkins\workspace\royale-compiler\compiler\target\junit-temp\ASDateTests3619225933863006830.swf in 0.091 seconds
    [junit] After compile:
    [junit] Unexpected compilation problems:
    [junit] 
    [junit] ASDateTests_day
    [junit] Generating test:
    [junit] Compiling test:
    [junit] -external-library-path=C:\Program Files (x86)\Jenkins\workspace\royale-compiler\compiler-externc\target\js.swc C:\Program Files (x86)\Jenkins\workspace\royale-compiler\compiler\target\junit-temp\ASDateTests7850963073930230617.as 
    [junit] 
    [junit] C:\Program Files (x86)\Jenkins\workspace\royale-compiler\compiler\target\junit-temp\ASDateTests7850963073930230617.as(12): col: 1 Error: Property day is read-only.
    [junit] 
    [junit] date.day += 1;
    [junit] ^
    [junit] 
    [junit] After compile:
    [junit] Property day is read-only.
    [junit] 
    [junit] Tests run: 19, Failures: 3, Errors: 0, Skipped: 1, Time elapsed: 4.018 sec
    [junit] Picked up JAVA_TOOL_OPTIONS: -Dfile.encoding=UTF-8 -Xmx512m

BUILD FAILED
<http://apacheroyaleci.westus2.cloudapp.azure.com:8080/job/royale-asjs_jsonly/ws/build.xml>:2030: The following error occurred while executing this line:
C:\Program Files (x86)\Jenkins\workspace\royale-compiler\build.xml:80: The following error occurred while executing this line:
C:\Program Files (x86)\Jenkins\workspace\royale-compiler\compiler\build.xml:711: The following error occurred while executing this line:
C:\Program Files (x86)\Jenkins\workspace\royale-compiler\compiler\src\test\build.xml:307: Tests failed

Total time: 25 minutes 24 seconds
Picked up JAVA_TOOL_OPTIONS: -Dfile.encoding=UTF-8 -Xmx512m
Build step 'Invoke Ant' marked build as failure
Archiving artifacts