You are viewing a plain text version of this content. The canonical link for it is here.
Posted to dev@hive.apache.org by Apache Hudson Server <hu...@hudson.zones.apache.org> on 2009/04/22 21:52:52 UTC

Build failed in Hudson: Hive-trunk-h0.18 #72

See http://hudson.zones.apache.org/hudson/job/Hive-trunk-h0.18/72/

------------------------------------------
[...truncated 30874 lines...]
    [junit] Loading data to table srcpart partition {ds=2008-04-08, hr=12}
    [junit] OK
    [junit] Loading data to table srcpart partition {ds=2008-04-09, hr=11}
    [junit] OK
    [junit] Loading data to table srcpart partition {ds=2008-04-09, hr=12}
    [junit] OK
    [junit] Loading data to table srcbucket
    [junit] OK
    [junit] Loading data to table srcbucket
    [junit] OK
    [junit] Loading data to table src
    [junit] OK
    [junit] diff http://hudson.zones.apache.org/hudson/job/Hive-trunk-h0.18/ws/hive/build/ql/test/logs/negative/unknown_column2.q.out  http://hudson.zones.apache.org/hudson/job/Hive-trunk-h0.18/ws/hive/ql/src/test/results/compiler/errors/unknown_column2.q.out 
    [junit] Done query: unknown_column2.q
    [junit] Begin query: unknown_column3.q
    [junit] Loading data to table srcpart partition {ds=2008-04-08, hr=11}
    [junit] OK
    [junit] Loading data to table srcpart partition {ds=2008-04-08, hr=12}
    [junit] OK
    [junit] Loading data to table srcpart partition {ds=2008-04-09, hr=11}
    [junit] OK
    [junit] Loading data to table srcpart partition {ds=2008-04-09, hr=12}
    [junit] OK
    [junit] Loading data to table srcbucket
    [junit] OK
    [junit] Loading data to table srcbucket
    [junit] OK
    [junit] Loading data to table src
    [junit] OK
    [junit] diff http://hudson.zones.apache.org/hudson/job/Hive-trunk-h0.18/ws/hive/build/ql/test/logs/negative/unknown_column3.q.out  http://hudson.zones.apache.org/hudson/job/Hive-trunk-h0.18/ws/hive/ql/src/test/results/compiler/errors/unknown_column3.q.out 
    [junit] Done query: unknown_column3.q
    [junit] Begin query: unknown_column4.q
    [junit] Loading data to table srcpart partition {ds=2008-04-08, hr=11}
    [junit] OK
    [junit] Loading data to table srcpart partition {ds=2008-04-08, hr=12}
    [junit] OK
    [junit] Loading data to table srcpart partition {ds=2008-04-09, hr=11}
    [junit] OK
    [junit] Loading data to table srcpart partition {ds=2008-04-09, hr=12}
    [junit] OK
    [junit] Loading data to table srcbucket
    [junit] OK
    [junit] Loading data to table srcbucket
    [junit] OK
    [junit] Loading data to table src
    [junit] OK
    [junit] diff http://hudson.zones.apache.org/hudson/job/Hive-trunk-h0.18/ws/hive/build/ql/test/logs/negative/unknown_column4.q.out  http://hudson.zones.apache.org/hudson/job/Hive-trunk-h0.18/ws/hive/ql/src/test/results/compiler/errors/unknown_column4.q.out 
    [junit] Done query: unknown_column4.q
    [junit] Begin query: unknown_column5.q
    [junit] Loading data to table srcpart partition {ds=2008-04-08, hr=11}
    [junit] OK
    [junit] Loading data to table srcpart partition {ds=2008-04-08, hr=12}
    [junit] OK
    [junit] Loading data to table srcpart partition {ds=2008-04-09, hr=11}
    [junit] OK
    [junit] Loading data to table srcpart partition {ds=2008-04-09, hr=12}
    [junit] OK
    [junit] Loading data to table srcbucket
    [junit] OK
    [junit] Loading data to table srcbucket
    [junit] OK
    [junit] Loading data to table src
    [junit] OK
    [junit] diff http://hudson.zones.apache.org/hudson/job/Hive-trunk-h0.18/ws/hive/build/ql/test/logs/negative/unknown_column5.q.out  http://hudson.zones.apache.org/hudson/job/Hive-trunk-h0.18/ws/hive/ql/src/test/results/compiler/errors/unknown_column5.q.out 
    [junit] Done query: unknown_column5.q
    [junit] Begin query: unknown_column6.q
    [junit] Loading data to table srcpart partition {ds=2008-04-08, hr=11}
    [junit] OK
    [junit] Loading data to table srcpart partition {ds=2008-04-08, hr=12}
    [junit] OK
    [junit] Loading data to table srcpart partition {ds=2008-04-09, hr=11}
    [junit] OK
    [junit] Loading data to table srcpart partition {ds=2008-04-09, hr=12}
    [junit] OK
    [junit] Loading data to table srcbucket
    [junit] OK
    [junit] Loading data to table srcbucket
    [junit] OK
    [junit] Loading data to table src
    [junit] OK
    [junit] diff http://hudson.zones.apache.org/hudson/job/Hive-trunk-h0.18/ws/hive/build/ql/test/logs/negative/unknown_column6.q.out  http://hudson.zones.apache.org/hudson/job/Hive-trunk-h0.18/ws/hive/ql/src/test/results/compiler/errors/unknown_column6.q.out 
    [junit] Done query: unknown_column6.q
    [junit] Begin query: unknown_function1.q
    [junit] Loading data to table srcpart partition {ds=2008-04-08, hr=11}
    [junit] OK
    [junit] Loading data to table srcpart partition {ds=2008-04-08, hr=12}
    [junit] OK
    [junit] Loading data to table srcpart partition {ds=2008-04-09, hr=11}
    [junit] OK
    [junit] Loading data to table srcpart partition {ds=2008-04-09, hr=12}
    [junit] OK
    [junit] Loading data to table srcbucket
    [junit] OK
    [junit] Loading data to table srcbucket
    [junit] OK
    [junit] Loading data to table src
    [junit] OK
    [junit] diff http://hudson.zones.apache.org/hudson/job/Hive-trunk-h0.18/ws/hive/build/ql/test/logs/negative/unknown_function1.q.out  http://hudson.zones.apache.org/hudson/job/Hive-trunk-h0.18/ws/hive/ql/src/test/results/compiler/errors/unknown_function1.q.out 
    [junit] Done query: unknown_function1.q
    [junit] Begin query: unknown_function2.q
    [junit] Loading data to table srcpart partition {ds=2008-04-08, hr=11}
    [junit] OK
    [junit] Loading data to table srcpart partition {ds=2008-04-08, hr=12}
    [junit] OK
    [junit] Loading data to table srcpart partition {ds=2008-04-09, hr=11}
    [junit] OK
    [junit] Loading data to table srcpart partition {ds=2008-04-09, hr=12}
    [junit] OK
    [junit] Loading data to table srcbucket
    [junit] OK
    [junit] Loading data to table srcbucket
    [junit] OK
    [junit] Loading data to table src
    [junit] OK
    [junit] diff http://hudson.zones.apache.org/hudson/job/Hive-trunk-h0.18/ws/hive/build/ql/test/logs/negative/unknown_function2.q.out  http://hudson.zones.apache.org/hudson/job/Hive-trunk-h0.18/ws/hive/ql/src/test/results/compiler/errors/unknown_function2.q.out 
    [junit] Done query: unknown_function2.q
    [junit] Begin query: unknown_function3.q
    [junit] Loading data to table srcpart partition {ds=2008-04-08, hr=11}
    [junit] OK
    [junit] Loading data to table srcpart partition {ds=2008-04-08, hr=12}
    [junit] OK
    [junit] Loading data to table srcpart partition {ds=2008-04-09, hr=11}
    [junit] OK
    [junit] Loading data to table srcpart partition {ds=2008-04-09, hr=12}
    [junit] OK
    [junit] Loading data to table srcbucket
    [junit] OK
    [junit] Loading data to table srcbucket
    [junit] OK
    [junit] Loading data to table src
    [junit] OK
    [junit] diff http://hudson.zones.apache.org/hudson/job/Hive-trunk-h0.18/ws/hive/build/ql/test/logs/negative/unknown_function3.q.out  http://hudson.zones.apache.org/hudson/job/Hive-trunk-h0.18/ws/hive/ql/src/test/results/compiler/errors/unknown_function3.q.out 
    [junit] Done query: unknown_function3.q
    [junit] Begin query: unknown_function4.q
    [junit] Loading data to table srcpart partition {ds=2008-04-08, hr=11}
    [junit] OK
    [junit] Loading data to table srcpart partition {ds=2008-04-08, hr=12}
    [junit] OK
    [junit] Loading data to table srcpart partition {ds=2008-04-09, hr=11}
    [junit] OK
    [junit] Loading data to table srcpart partition {ds=2008-04-09, hr=12}
    [junit] OK
    [junit] Loading data to table srcbucket
    [junit] OK
    [junit] Loading data to table srcbucket
    [junit] OK
    [junit] Loading data to table src
    [junit] OK
    [junit] diff http://hudson.zones.apache.org/hudson/job/Hive-trunk-h0.18/ws/hive/build/ql/test/logs/negative/unknown_function4.q.out  http://hudson.zones.apache.org/hudson/job/Hive-trunk-h0.18/ws/hive/ql/src/test/results/compiler/errors/unknown_function4.q.out 
    [junit] Done query: unknown_function4.q
    [junit] Begin query: unknown_function5.q
    [junit] Loading data to table srcpart partition {ds=2008-04-08, hr=11}
    [junit] OK
    [junit] Loading data to table srcpart partition {ds=2008-04-08, hr=12}
    [junit] OK
    [junit] Loading data to table srcpart partition {ds=2008-04-09, hr=11}
    [junit] OK
    [junit] Loading data to table srcpart partition {ds=2008-04-09, hr=12}
    [junit] OK
    [junit] Loading data to table srcbucket
    [junit] OK
    [junit] Loading data to table srcbucket
    [junit] OK
    [junit] Loading data to table src
    [junit] OK
    [junit] diff http://hudson.zones.apache.org/hudson/job/Hive-trunk-h0.18/ws/hive/build/ql/test/logs/negative/unknown_function5.q.out  http://hudson.zones.apache.org/hudson/job/Hive-trunk-h0.18/ws/hive/ql/src/test/results/compiler/errors/unknown_function5.q.out 
    [junit] Done query: unknown_function5.q
    [junit] Begin query: unknown_table1.q
    [junit] Loading data to table srcpart partition {ds=2008-04-08, hr=11}
    [junit] OK
    [junit] Loading data to table srcpart partition {ds=2008-04-08, hr=12}
    [junit] OK
    [junit] Loading data to table srcpart partition {ds=2008-04-09, hr=11}
    [junit] OK
    [junit] Loading data to table srcpart partition {ds=2008-04-09, hr=12}
    [junit] OK
    [junit] Loading data to table srcbucket
    [junit] OK
    [junit] Loading data to table srcbucket
    [junit] OK
    [junit] Loading data to table src
    [junit] OK
    [junit] diff http://hudson.zones.apache.org/hudson/job/Hive-trunk-h0.18/ws/hive/build/ql/test/logs/negative/unknown_table1.q.out  http://hudson.zones.apache.org/hudson/job/Hive-trunk-h0.18/ws/hive/ql/src/test/results/compiler/errors/unknown_table1.q.out 
    [junit] Done query: unknown_table1.q
    [junit] Begin query: unknown_table2.q
    [junit] Loading data to table srcpart partition {ds=2008-04-08, hr=11}
    [junit] OK
    [junit] Loading data to table srcpart partition {ds=2008-04-08, hr=12}
    [junit] OK
    [junit] Loading data to table srcpart partition {ds=2008-04-09, hr=11}
    [junit] OK
    [junit] Loading data to table srcpart partition {ds=2008-04-09, hr=12}
    [junit] OK
    [junit] Loading data to table srcbucket
    [junit] OK
    [junit] Loading data to table srcbucket
    [junit] OK
    [junit] Loading data to table src
    [junit] OK
    [junit] diff http://hudson.zones.apache.org/hudson/job/Hive-trunk-h0.18/ws/hive/build/ql/test/logs/negative/unknown_table2.q.out  http://hudson.zones.apache.org/hudson/job/Hive-trunk-h0.18/ws/hive/ql/src/test/results/compiler/errors/unknown_table2.q.out 
    [junit] Done query: unknown_table2.q
    [junit] Begin query: wrong_distinct1.q
    [junit] Loading data to table srcpart partition {ds=2008-04-08, hr=11}
    [junit] OK
    [junit] Loading data to table srcpart partition {ds=2008-04-08, hr=12}
    [junit] OK
    [junit] Loading data to table srcpart partition {ds=2008-04-09, hr=11}
    [junit] OK
    [junit] Loading data to table srcpart partition {ds=2008-04-09, hr=12}
    [junit] OK
    [junit] Loading data to table srcbucket
    [junit] OK
    [junit] Loading data to table srcbucket
    [junit] OK
    [junit] Loading data to table src
    [junit] OK
    [junit] diff http://hudson.zones.apache.org/hudson/job/Hive-trunk-h0.18/ws/hive/build/ql/test/logs/negative/wrong_distinct1.q.out  http://hudson.zones.apache.org/hudson/job/Hive-trunk-h0.18/ws/hive/ql/src/test/results/compiler/errors/wrong_distinct1.q.out 
    [junit] Done query: wrong_distinct1.q
    [junit] Begin query: wrong_distinct2.q
    [junit] Loading data to table srcpart partition {ds=2008-04-08, hr=11}
    [junit] OK
    [junit] Loading data to table srcpart partition {ds=2008-04-08, hr=12}
    [junit] OK
    [junit] Loading data to table srcpart partition {ds=2008-04-09, hr=11}
    [junit] OK
    [junit] Loading data to table srcpart partition {ds=2008-04-09, hr=12}
    [junit] OK
    [junit] Loading data to table srcbucket
    [junit] OK
    [junit] Loading data to table srcbucket
    [junit] OK
    [junit] Loading data to table src
    [junit] OK
    [junit] diff http://hudson.zones.apache.org/hudson/job/Hive-trunk-h0.18/ws/hive/build/ql/test/logs/negative/wrong_distinct2.q.out  http://hudson.zones.apache.org/hudson/job/Hive-trunk-h0.18/ws/hive/ql/src/test/results/compiler/errors/wrong_distinct2.q.out 
    [junit] Done query: wrong_distinct2.q
    [junit] Tests run: 31, Failures: 0, Errors: 0, Time elapsed: 38.551 sec
    [junit] Running org.apache.hadoop.hive.ql.plan.TestAddPartition
    [junit] Table doesnotexist does not exist
    [junit] Tests run: 1, Failures: 0, Errors: 0, Time elapsed: 4.702 sec
    [junit] Running org.apache.hadoop.hive.ql.tool.TestLineageInfo
    [junit] Tests run: 5, Failures: 0, Errors: 0, Time elapsed: 0.278 sec

BUILD FAILED
http://hudson.zones.apache.org/hudson/job/Hive-trunk-h0.18/ws/hive/build.xml :118: The following error occurred while executing this line:
http://hudson.zones.apache.org/hudson/job/Hive-trunk-h0.18/ws/hive/build.xml :73: The following error occurred while executing this line:
http://hudson.zones.apache.org/hudson/job/Hive-trunk-h0.18/ws/hive/build-common.xml :274: Tests failed!

Total time: 22 minutes 48 seconds
Recording test results


Hudson build is back to normal: Hive-trunk-h0.18 #84

Posted by Apache Hudson Server <hu...@hudson.zones.apache.org>.
See http://hudson.zones.apache.org/hudson/job/Hive-trunk-h0.18/84/changes



Build failed in Hudson: Hive-trunk-h0.18 #83

Posted by Apache Hudson Server <hu...@hudson.zones.apache.org>.
See http://hudson.zones.apache.org/hudson/job/Hive-trunk-h0.18/83/changes

Changes:

[prasadc] Add a pre execution hook to ql

[prasadc] HIVE-453 tests

------------------------------------------
[...truncated 2063 lines...]
    [mkdir] Created dir: http://hudson.zones.apache.org/hudson/job/Hive-trunk-h0.18/ws/hive/build/serde 
    [mkdir] Created dir: http://hudson.zones.apache.org/hudson/job/Hive-trunk-h0.18/ws/hive/build/serde/classes 
    [mkdir] Created dir: http://hudson.zones.apache.org/hudson/job/Hive-trunk-h0.18/ws/hive/build/serde/test 
    [mkdir] Created dir: http://hudson.zones.apache.org/hudson/job/Hive-trunk-h0.18/ws/hive/build/serde/test/src 
    [mkdir] Created dir: http://hudson.zones.apache.org/hudson/job/Hive-trunk-h0.18/ws/hive/build/serde/test/classes 

dynamic-serde:

compile:
     [echo] Compiling: hive
    [javac] Compiling 171 source files to http://hudson.zones.apache.org/hudson/job/Hive-trunk-h0.18/ws/hive/build/serde/classes 
    [javac] Note: Some input files use unchecked or unsafe operations.
    [javac] Note: Recompile with -Xlint:unchecked for details.

jar:
     [echo] Jar: serde
      [jar] Building jar: http://hudson.zones.apache.org/hudson/job/Hive-trunk-h0.18/ws/hive/build/serde/hive_serde.jar 

init:
    [mkdir] Created dir: http://hudson.zones.apache.org/hudson/job/Hive-trunk-h0.18/ws/hive/build/metastore 
    [mkdir] Created dir: http://hudson.zones.apache.org/hudson/job/Hive-trunk-h0.18/ws/hive/build/metastore/classes 
    [mkdir] Created dir: http://hudson.zones.apache.org/hudson/job/Hive-trunk-h0.18/ws/hive/build/metastore/test 
    [mkdir] Created dir: http://hudson.zones.apache.org/hudson/job/Hive-trunk-h0.18/ws/hive/build/metastore/test/src 
    [mkdir] Created dir: http://hudson.zones.apache.org/hudson/job/Hive-trunk-h0.18/ws/hive/build/metastore/test/classes 

model-compile:
    [javac] Compiling 8 source files to http://hudson.zones.apache.org/hudson/job/Hive-trunk-h0.18/ws/hive/build/metastore/classes 
     [copy] Copying 1 file to http://hudson.zones.apache.org/hudson/job/Hive-trunk-h0.18/ws/hive/build/metastore/classes 

core-compile:
     [echo] Compiling: 
    [javac] Compiling 28 source files to http://hudson.zones.apache.org/hudson/job/Hive-trunk-h0.18/ws/hive/build/metastore/classes 
    [javac] Note: Some input files use unchecked or unsafe operations.
    [javac] Note: Recompile with -Xlint:unchecked for details.

model-enhance:
     [echo] Enhancing model classes with JPOX stuff....
     [java] JPOX Enhancer (version 1.2.2) : Enhancement of classes
     [java] 
     [java] JPOX Enhancer completed with success for 8 classes. Timings : input=110 ms, enhance=130 ms, total=240 ms. Consult the log for full details

compile:

jar:
     [echo] Jar: metastore
      [jar] Building jar: http://hudson.zones.apache.org/hudson/job/Hive-trunk-h0.18/ws/hive/build/metastore/hive_metastore.jar 

init:
    [mkdir] Created dir: http://hudson.zones.apache.org/hudson/job/Hive-trunk-h0.18/ws/hive/build/ql 
    [mkdir] Created dir: http://hudson.zones.apache.org/hudson/job/Hive-trunk-h0.18/ws/hive/build/ql/classes 
    [mkdir] Created dir: http://hudson.zones.apache.org/hudson/job/Hive-trunk-h0.18/ws/hive/build/ql/test 
    [mkdir] Created dir: http://hudson.zones.apache.org/hudson/job/Hive-trunk-h0.18/ws/hive/build/ql/test/src 
    [mkdir] Created dir: http://hudson.zones.apache.org/hudson/job/Hive-trunk-h0.18/ws/hive/build/ql/test/classes 

ql-init:
    [mkdir] Created dir: http://hudson.zones.apache.org/hudson/job/Hive-trunk-h0.18/ws/hive/build/ql/gen-java/org/apache/hadoop/hive/ql/parse 

build-grammar:
     [echo] Building Grammar http://hudson.zones.apache.org/hudson/job/Hive-trunk-h0.18/ws/hive/ql/src/java/org/apache/hadoop/hive/ql/parse/Hive.g   ....
     [java] ANTLR Parser Generator  Version 3.0.1 (August 13, 2007)  1989-2007

compile:
     [echo] Compiling: hive
    [javac] Compiling 342 source files to http://hudson.zones.apache.org/hudson/job/Hive-trunk-h0.18/ws/hive/build/ql/classes 
    [javac] http://hudson.zones.apache.org/hudson/job/Hive-trunk-h0.18/ws/hive/ql/src/java/org/apache/hadoop/hive/ql/Driver.java :43: package org.apache.hadoop.hive.ql.hooks does not exist
    [javac] import org.apache.hadoop.hive.ql.hooks.PreExecute;
    [javac]                                       ^
    [javac] http://hudson.zones.apache.org/hudson/job/Hive-trunk-h0.18/ws/hive/ql/src/java/org/apache/hadoop/hive/ql/Driver.java :215: cannot find symbol
    [javac] symbol  : class PreExecute
    [javac] location: class org.apache.hadoop.hive.ql.Driver
    [javac]   private List<PreExecute> getPreExecHooks() throws Exception {
    [javac]                ^
    [javac] http://hudson.zones.apache.org/hudson/job/Hive-trunk-h0.18/ws/hive/ql/src/java/org/apache/hadoop/hive/ql/parse/BaseSemanticAnalyzer.java :35: package org.apache.hadoop.hive.ql.hooks does not exist
    [javac] import org.apache.hadoop.hive.ql.hooks.ReadEntity;
    [javac]                                       ^
    [javac] http://hudson.zones.apache.org/hudson/job/Hive-trunk-h0.18/ws/hive/ql/src/java/org/apache/hadoop/hive/ql/parse/BaseSemanticAnalyzer.java :36: package org.apache.hadoop.hive.ql.hooks does not exist
    [javac] import org.apache.hadoop.hive.ql.hooks.WriteEntity;
    [javac]                                       ^
    [javac] http://hudson.zones.apache.org/hudson/job/Hive-trunk-h0.18/ws/hive/ql/src/java/org/apache/hadoop/hive/ql/parse/BaseSemanticAnalyzer.java :248: cannot find symbol
    [javac] symbol  : class ReadEntity
    [javac] location: class org.apache.hadoop.hive.ql.parse.BaseSemanticAnalyzer
    [javac]   public Set<ReadEntity> getInputs() {
    [javac]              ^
    [javac] http://hudson.zones.apache.org/hudson/job/Hive-trunk-h0.18/ws/hive/ql/src/java/org/apache/hadoop/hive/ql/parse/BaseSemanticAnalyzer.java :252: cannot find symbol
    [javac] symbol  : class WriteEntity
    [javac] location: class org.apache.hadoop.hive.ql.parse.BaseSemanticAnalyzer
    [javac]   public Set<WriteEntity> getOutputs() {
    [javac]              ^
    [javac] http://hudson.zones.apache.org/hudson/job/Hive-trunk-h0.18/ws/hive/ql/src/java/org/apache/hadoop/hive/ql/optimizer/GenMRProcContext.java :31: package org.apache.hadoop.hive.ql.hooks does not exist
    [javac] import org.apache.hadoop.hive.ql.hooks.ReadEntity;
    [javac]                                       ^
    [javac] http://hudson.zones.apache.org/hudson/job/Hive-trunk-h0.18/ws/hive/ql/src/java/org/apache/hadoop/hive/ql/optimizer/GenMRProcContext.java :32: package org.apache.hadoop.hive.ql.hooks does not exist
    [javac] import org.apache.hadoop.hive.ql.hooks.WriteEntity;
    [javac]                                       ^
    [javac] http://hudson.zones.apache.org/hudson/job/Hive-trunk-h0.18/ws/hive/ql/src/java/org/apache/hadoop/hive/ql/optimizer/GenMRProcContext.java :146: cannot find symbol
    [javac] symbol  : class ReadEntity
    [javac] location: class org.apache.hadoop.hive.ql.optimizer.GenMRProcContext
    [javac]   private Set<ReadEntity>                     inputs;
    [javac]               ^
    [javac] http://hudson.zones.apache.org/hudson/job/Hive-trunk-h0.18/ws/hive/ql/src/java/org/apache/hadoop/hive/ql/optimizer/GenMRProcContext.java :151: cannot find symbol
    [javac] symbol  : class WriteEntity
    [javac] location: class org.apache.hadoop.hive.ql.optimizer.GenMRProcContext
    [javac]   private Set<WriteEntity>                    outputs;
    [javac]               ^
    [javac] http://hudson.zones.apache.org/hudson/job/Hive-trunk-h0.18/ws/hive/ql/src/java/org/apache/hadoop/hive/ql/optimizer/GenMRProcContext.java :172: cannot find symbol
    [javac] symbol  : class ReadEntity
    [javac] location: class org.apache.hadoop.hive.ql.optimizer.GenMRProcContext
    [javac]     Set<ReadEntity> inputs,
    [javac]         ^
    [javac] http://hudson.zones.apache.org/hudson/job/Hive-trunk-h0.18/ws/hive/ql/src/java/org/apache/hadoop/hive/ql/optimizer/GenMRProcContext.java :173: cannot find symbol
    [javac] symbol  : class WriteEntity
    [javac] location: class org.apache.hadoop.hive.ql.optimizer.GenMRProcContext
    [javac]     Set<WriteEntity> outputs) 
    [javac]         ^
    [javac] http://hudson.zones.apache.org/hudson/job/Hive-trunk-h0.18/ws/hive/ql/src/java/org/apache/hadoop/hive/ql/optimizer/GenMRProcContext.java :400: cannot find symbol
    [javac] symbol  : class ReadEntity
    [javac] location: class org.apache.hadoop.hive.ql.optimizer.GenMRProcContext
    [javac]   public Set<ReadEntity> getInputs() {
    [javac]              ^
    [javac] http://hudson.zones.apache.org/hudson/job/Hive-trunk-h0.18/ws/hive/ql/src/java/org/apache/hadoop/hive/ql/optimizer/GenMRProcContext.java :407: cannot find symbol
    [javac] symbol  : class WriteEntity
    [javac] location: class org.apache.hadoop.hive.ql.optimizer.GenMRProcContext
    [javac]   public Set<WriteEntity> getOutputs() {
    [javac]              ^
    [javac] http://hudson.zones.apache.org/hudson/job/Hive-trunk-h0.18/ws/hive/ql/src/java/org/apache/hadoop/hive/ql/optimizer/GenMapRedUtils.java :52: package org.apache.hadoop.hive.ql.hooks does not exist
    [javac] import org.apache.hadoop.hive.ql.hooks.ReadEntity;
    [javac]                                       ^
    [javac] http://hudson.zones.apache.org/hudson/job/Hive-trunk-h0.18/ws/hive/ql/src/java/org/apache/hadoop/hive/ql/optimizer/GenMapRedUtils.java :53: package org.apache.hadoop.hive.ql.hooks does not exist
    [javac] import org.apache.hadoop.hive.ql.hooks.WriteEntity;
    [javac]                                       ^
    [javac] http://hudson.zones.apache.org/hudson/job/Hive-trunk-h0.18/ws/hive/ql/src/java/org/apache/hadoop/hive/ql/parse/SemanticAnalyzer.java :126: package org.apache.hadoop.hive.ql.hooks does not exist
    [javac] import org.apache.hadoop.hive.ql.hooks.ReadEntity;
    [javac]                                       ^
    [javac] http://hudson.zones.apache.org/hudson/job/Hive-trunk-h0.18/ws/hive/ql/src/java/org/apache/hadoop/hive/ql/parse/SemanticAnalyzer.java :127: package org.apache.hadoop.hive.ql.hooks does not exist
    [javac] import org.apache.hadoop.hive.ql.hooks.WriteEntity;
    [javac]                                       ^
    [javac] http://hudson.zones.apache.org/hudson/job/Hive-trunk-h0.18/ws/hive/ql/src/java/org/apache/hadoop/hive/ql/parse/SemanticAnalyzer.java :149: cannot find symbol
    [javac] symbol  : class ReadEntity
    [javac] location: class org.apache.hadoop.hive.ql.parse.SemanticAnalyzer
    [javac]   private Set<ReadEntity> inputs;
    [javac]               ^
    [javac] http://hudson.zones.apache.org/hudson/job/Hive-trunk-h0.18/ws/hive/ql/src/java/org/apache/hadoop/hive/ql/parse/SemanticAnalyzer.java :153: cannot find symbol
    [javac] symbol  : class WriteEntity
    [javac] location: class org.apache.hadoop.hive.ql.parse.SemanticAnalyzer
    [javac]   private Set<WriteEntity> outputs;
    [javac]               ^
    [javac] http://hudson.zones.apache.org/hudson/job/Hive-trunk-h0.18/ws/hive/ql/src/java/org/apache/hadoop/hive/ql/parse/SemanticAnalyzer.java :3820: cannot find symbol
    [javac] symbol  : class ReadEntity
    [javac] location: class org.apache.hadoop.hive.ql.parse.SemanticAnalyzer
    [javac]   public Set<ReadEntity> getInputs() {
    [javac]              ^
    [javac] http://hudson.zones.apache.org/hudson/job/Hive-trunk-h0.18/ws/hive/ql/src/java/org/apache/hadoop/hive/ql/parse/SemanticAnalyzer.java :3824: cannot find symbol
    [javac] symbol  : class WriteEntity
    [javac] location: class org.apache.hadoop.hive.ql.parse.SemanticAnalyzer
    [javac]   public Set<WriteEntity> getOutputs() {
    [javac]              ^
    [javac] http://hudson.zones.apache.org/hudson/job/Hive-trunk-h0.18/ws/hive/ql/src/java/org/apache/hadoop/hive/ql/Driver.java :216: cannot find symbol
    [javac] symbol  : class PreExecute
    [javac] location: class org.apache.hadoop.hive.ql.Driver
    [javac]     ArrayList<PreExecute> pehooks = new ArrayList<PreExecute>();
    [javac]               ^
    [javac] http://hudson.zones.apache.org/hudson/job/Hive-trunk-h0.18/ws/hive/ql/src/java/org/apache/hadoop/hive/ql/Driver.java :216: cannot find symbol
    [javac] symbol  : class PreExecute
    [javac] location: class org.apache.hadoop.hive.ql.Driver
    [javac]     ArrayList<PreExecute> pehooks = new ArrayList<PreExecute>();
    [javac]                                                   ^
    [javac] http://hudson.zones.apache.org/hudson/job/Hive-trunk-h0.18/ws/hive/ql/src/java/org/apache/hadoop/hive/ql/Driver.java :226: cannot find symbol
    [javac] symbol  : class PreExecute
    [javac] location: class org.apache.hadoop.hive.ql.Driver
    [javac]         pehooks.add((PreExecute)Class.forName(peClass.trim()).newInstance());
    [javac]                      ^
    [javac] http://hudson.zones.apache.org/hudson/job/Hive-trunk-h0.18/ws/hive/ql/src/java/org/apache/hadoop/hive/ql/Driver.java :258: cannot find symbol
    [javac] symbol  : class PreExecute
    [javac] location: class org.apache.hadoop.hive.ql.Driver
    [javac]       for(PreExecute peh: getPreExecHooks()) {
    [javac]           ^
    [javac] http://hudson.zones.apache.org/hudson/job/Hive-trunk-h0.18/ws/hive/ql/src/java/org/apache/hadoop/hive/ql/parse/BaseSemanticAnalyzer.java :249: cannot find symbol
    [javac] symbol  : class ReadEntity
    [javac] location: class org.apache.hadoop.hive.ql.parse.BaseSemanticAnalyzer
    [javac]     return new LinkedHashSet<ReadEntity>();
    [javac]                              ^
    [javac] http://hudson.zones.apache.org/hudson/job/Hive-trunk-h0.18/ws/hive/ql/src/java/org/apache/hadoop/hive/ql/parse/BaseSemanticAnalyzer.java :253: cannot find symbol
    [javac] symbol  : class WriteEntity
    [javac] location: class org.apache.hadoop.hive.ql.parse.BaseSemanticAnalyzer
    [javac]     return new LinkedHashSet<WriteEntity>();
    [javac]                              ^
    [javac] http://hudson.zones.apache.org/hudson/job/Hive-trunk-h0.18/ws/hive/ql/src/java/org/apache/hadoop/hive/ql/optimizer/GenMapRedUtils.java :242: cannot find symbol
    [javac] symbol  : class ReadEntity
    [javac] location: class org.apache.hadoop.hive.ql.optimizer.GenMapRedUtils
    [javac]     Set<ReadEntity> inputs = opProcCtx.getInputs();
    [javac]         ^
    [javac] http://hudson.zones.apache.org/hudson/job/Hive-trunk-h0.18/ws/hive/ql/src/java/org/apache/hadoop/hive/ql/optimizer/GenMapRedUtils.java :263: cannot find symbol
    [javac] symbol  : class ReadEntity
    [javac] location: class org.apache.hadoop.hive.ql.optimizer.GenMapRedUtils
    [javac]           inputs.add(new ReadEntity(part));
    [javac]                          ^
    [javac] http://hudson.zones.apache.org/hudson/job/Hive-trunk-h0.18/ws/hive/ql/src/java/org/apache/hadoop/hive/ql/optimizer/GenMapRedUtils.java :265: cannot find symbol
    [javac] symbol  : class ReadEntity
    [javac] location: class org.apache.hadoop.hive.ql.optimizer.GenMapRedUtils
    [javac]           inputs.add(new ReadEntity(part.getTable()));
    [javac]                          ^
    [javac] http://hudson.zones.apache.org/hudson/job/Hive-trunk-h0.18/ws/hive/ql/src/java/org/apache/hadoop/hive/ql/parse/SemanticAnalyzer.java :174: cannot find symbol
    [javac] symbol  : class ReadEntity
    [javac] location: class org.apache.hadoop.hive.ql.parse.SemanticAnalyzer
    [javac]     inputs = new LinkedHashSet<ReadEntity>();
    [javac]                                ^
    [javac] http://hudson.zones.apache.org/hudson/job/Hive-trunk-h0.18/ws/hive/ql/src/java/org/apache/hadoop/hive/ql/parse/SemanticAnalyzer.java :175: cannot find symbol
    [javac] symbol  : class WriteEntity
    [javac] location: class org.apache.hadoop.hive.ql.parse.SemanticAnalyzer
    [javac]     outputs = new LinkedHashSet<WriteEntity>();
    [javac]                                 ^
    [javac] http://hudson.zones.apache.org/hudson/job/Hive-trunk-h0.18/ws/hive/ql/src/java/org/apache/hadoop/hive/ql/parse/SemanticAnalyzer.java :2269: cannot find symbol
    [javac] symbol  : class WriteEntity
    [javac] location: class org.apache.hadoop.hive.ql.parse.SemanticAnalyzer
    [javac]         outputs.add(new WriteEntity(dest_tab));
    [javac]                         ^
    [javac] http://hudson.zones.apache.org/hudson/job/Hive-trunk-h0.18/ws/hive/ql/src/java/org/apache/hadoop/hive/ql/parse/SemanticAnalyzer.java :2283: cannot find symbol
    [javac] symbol  : class WriteEntity
    [javac] location: class org.apache.hadoop.hive.ql.parse.SemanticAnalyzer
    [javac]         outputs.add(new WriteEntity(dest_part));
    [javac]                         ^
    [javac] http://hudson.zones.apache.org/hudson/job/Hive-trunk-h0.18/ws/hive/ql/src/java/org/apache/hadoop/hive/ql/parse/SemanticAnalyzer.java :2315: cannot find symbol
    [javac] symbol  : class WriteEntity
    [javac] location: class org.apache.hadoop.hive.ql.parse.SemanticAnalyzer
    [javac]         outputs.add(new WriteEntity(dest_path, !isDfsDir));
    [javac]                         ^
    [javac] http://hudson.zones.apache.org/hudson/job/Hive-trunk-h0.18/ws/hive/ql/src/java/org/apache/hadoop/hive/ql/parse/SemanticAnalyzer.java :3477: cannot find symbol
    [javac] symbol  : class ReadEntity
    [javac] location: class org.apache.hadoop.hive.ql.parse.SemanticAnalyzer
    [javac]         inputs.add(new ReadEntity(tab));
    [javac]                        ^
    [javac] http://hudson.zones.apache.org/hudson/job/Hive-trunk-h0.18/ws/hive/ql/src/java/org/apache/hadoop/hive/ql/parse/SemanticAnalyzer.java :3498: cannot find symbol
    [javac] symbol  : class ReadEntity
    [javac] location: class org.apache.hadoop.hive.ql.parse.SemanticAnalyzer
    [javac]                   inputs.add(new ReadEntity(part));
    [javac]                                  ^
    [javac] Note: Some input files use or override a deprecated API.
    [javac] Note: Recompile with -Xlint:deprecation for details.
    [javac] Note: Some input files use unchecked or unsafe operations.
    [javac] Note: Recompile with -Xlint:unchecked for details.
    [javac] 38 errors

BUILD FAILED
http://hudson.zones.apache.org/hudson/job/Hive-trunk-h0.18/ws/hive/build.xml :114: The following error occurred while executing this line:
http://hudson.zones.apache.org/hudson/job/Hive-trunk-h0.18/ws/hive/build.xml :73: The following error occurred while executing this line:
http://hudson.zones.apache.org/hudson/job/Hive-trunk-h0.18/ws/hive/ql/build.xml :111: Compile failed; see the compiler error output for details.

Total time: 11 seconds
Recording test results


Build failed in Hudson: Hive-trunk-h0.18 #82

Posted by Apache Hudson Server <hu...@hudson.zones.apache.org>.
See http://hudson.zones.apache.org/hudson/job/Hive-trunk-h0.18/82/changes

Changes:

[prasadc] HIVE-453 tests

[prasadc] HIVE-453 Use FileSystem derived from user supplied path when present instead of default

------------------------------------------
[...truncated 7141 lines...]
    [junit] Loading data to table src1
    [junit] OK
    [junit] Loading data to table src_sequencefile
    [junit] OK
    [junit] Loading data to table src_thrift
    [junit] OK
    [junit] Loading data to table src_json
    [junit] OK
    [junit] diff http://hudson.zones.apache.org/hudson/job/Hive-trunk-h0.18/ws/hive/build/ql/test/logs/negative/unknown_column6.q.out  http://hudson.zones.apache.org/hudson/job/Hive-trunk-h0.18/ws/hive/ql/src/test/results/compiler/errors/unknown_column6.q.out 
    [junit] Done query: unknown_column6.q
    [junit] Begin query: unknown_function1.q
    [junit] Loading data to table srcpart partition {ds=2008-04-08, hr=11}
    [junit] OK
    [junit] Loading data to table srcpart partition {ds=2008-04-08, hr=12}
    [junit] OK
    [junit] Loading data to table srcpart partition {ds=2008-04-09, hr=11}
    [junit] OK
    [junit] Loading data to table srcpart partition {ds=2008-04-09, hr=12}
    [junit] OK
    [junit] Loading data to table srcbucket
    [junit] OK
    [junit] Loading data to table srcbucket
    [junit] OK
    [junit] Loading data to table src
    [junit] OK
    [junit] Loading data to table src1
    [junit] OK
    [junit] Loading data to table src_sequencefile
    [junit] OK
    [junit] Loading data to table src_thrift
    [junit] OK
    [junit] Loading data to table src_json
    [junit] OK
    [junit] diff http://hudson.zones.apache.org/hudson/job/Hive-trunk-h0.18/ws/hive/build/ql/test/logs/negative/unknown_function1.q.out  http://hudson.zones.apache.org/hudson/job/Hive-trunk-h0.18/ws/hive/ql/src/test/results/compiler/errors/unknown_function1.q.out 
    [junit] Done query: unknown_function1.q
    [junit] Begin query: unknown_function2.q
    [junit] Loading data to table srcpart partition {ds=2008-04-08, hr=11}
    [junit] OK
    [junit] Loading data to table srcpart partition {ds=2008-04-08, hr=12}
    [junit] OK
    [junit] Loading data to table srcpart partition {ds=2008-04-09, hr=11}
    [junit] OK
    [junit] Loading data to table srcpart partition {ds=2008-04-09, hr=12}
    [junit] OK
    [junit] Loading data to table srcbucket
    [junit] OK
    [junit] Loading data to table srcbucket
    [junit] OK
    [junit] Loading data to table src
    [junit] OK
    [junit] Loading data to table src1
    [junit] OK
    [junit] Loading data to table src_sequencefile
    [junit] OK
    [junit] Loading data to table src_thrift
    [junit] OK
    [junit] Loading data to table src_json
    [junit] OK
    [junit] diff http://hudson.zones.apache.org/hudson/job/Hive-trunk-h0.18/ws/hive/build/ql/test/logs/negative/unknown_function2.q.out  http://hudson.zones.apache.org/hudson/job/Hive-trunk-h0.18/ws/hive/ql/src/test/results/compiler/errors/unknown_function2.q.out 
    [junit] Done query: unknown_function2.q
    [junit] Begin query: unknown_function3.q
    [junit] Loading data to table srcpart partition {ds=2008-04-08, hr=11}
    [junit] OK
    [junit] Loading data to table srcpart partition {ds=2008-04-08, hr=12}
    [junit] OK
    [junit] Loading data to table srcpart partition {ds=2008-04-09, hr=11}
    [junit] OK
    [junit] Loading data to table srcpart partition {ds=2008-04-09, hr=12}
    [junit] OK
    [junit] Loading data to table srcbucket
    [junit] OK
    [junit] Loading data to table srcbucket
    [junit] OK
    [junit] Loading data to table src
    [junit] OK
    [junit] Loading data to table src1
    [junit] OK
    [junit] Loading data to table src_sequencefile
    [junit] OK
    [junit] Loading data to table src_thrift
    [junit] OK
    [junit] Loading data to table src_json
    [junit] OK
    [junit] diff http://hudson.zones.apache.org/hudson/job/Hive-trunk-h0.18/ws/hive/build/ql/test/logs/negative/unknown_function3.q.out  http://hudson.zones.apache.org/hudson/job/Hive-trunk-h0.18/ws/hive/ql/src/test/results/compiler/errors/unknown_function3.q.out 
    [junit] Done query: unknown_function3.q
    [junit] Begin query: unknown_function4.q
    [junit] Loading data to table srcpart partition {ds=2008-04-08, hr=11}
    [junit] OK
    [junit] Loading data to table srcpart partition {ds=2008-04-08, hr=12}
    [junit] OK
    [junit] Loading data to table srcpart partition {ds=2008-04-09, hr=11}
    [junit] OK
    [junit] Loading data to table srcpart partition {ds=2008-04-09, hr=12}
    [junit] OK
    [junit] Loading data to table srcbucket
    [junit] OK
    [junit] Loading data to table srcbucket
    [junit] OK
    [junit] Loading data to table src
    [junit] OK
    [junit] Loading data to table src1
    [junit] OK
    [junit] Loading data to table src_sequencefile
    [junit] OK
    [junit] Loading data to table src_thrift
    [junit] OK
    [junit] Loading data to table src_json
    [junit] OK
    [junit] diff http://hudson.zones.apache.org/hudson/job/Hive-trunk-h0.18/ws/hive/build/ql/test/logs/negative/unknown_function4.q.out  http://hudson.zones.apache.org/hudson/job/Hive-trunk-h0.18/ws/hive/ql/src/test/results/compiler/errors/unknown_function4.q.out 
    [junit] Done query: unknown_function4.q
    [junit] Begin query: unknown_function5.q
    [junit] Loading data to table srcpart partition {ds=2008-04-08, hr=11}
    [junit] OK
    [junit] Loading data to table srcpart partition {ds=2008-04-08, hr=12}
    [junit] OK
    [junit] Loading data to table srcpart partition {ds=2008-04-09, hr=11}
    [junit] OK
    [junit] Loading data to table srcpart partition {ds=2008-04-09, hr=12}
    [junit] OK
    [junit] Loading data to table srcbucket
    [junit] OK
    [junit] Loading data to table srcbucket
    [junit] OK
    [junit] Loading data to table src
    [junit] OK
    [junit] Loading data to table src1
    [junit] OK
    [junit] Loading data to table src_sequencefile
    [junit] OK
    [junit] Loading data to table src_thrift
    [junit] OK
    [junit] Loading data to table src_json
    [junit] OK
    [junit] diff http://hudson.zones.apache.org/hudson/job/Hive-trunk-h0.18/ws/hive/build/ql/test/logs/negative/unknown_function5.q.out  http://hudson.zones.apache.org/hudson/job/Hive-trunk-h0.18/ws/hive/ql/src/test/results/compiler/errors/unknown_function5.q.out 
    [junit] Done query: unknown_function5.q
    [junit] Begin query: unknown_table1.q
    [junit] Loading data to table srcpart partition {ds=2008-04-08, hr=11}
    [junit] OK
    [junit] Loading data to table srcpart partition {ds=2008-04-08, hr=12}
    [junit] OK
    [junit] Loading data to table srcpart partition {ds=2008-04-09, hr=11}
    [junit] OK
    [junit] Loading data to table srcpart partition {ds=2008-04-09, hr=12}
    [junit] OK
    [junit] Loading data to table srcbucket
    [junit] OK
    [junit] Loading data to table srcbucket
    [junit] OK
    [junit] Loading data to table src
    [junit] OK
    [junit] Loading data to table src1
    [junit] OK
    [junit] Loading data to table src_sequencefile
    [junit] OK
    [junit] Loading data to table src_thrift
    [junit] OK
    [junit] Loading data to table src_json
    [junit] OK
    [junit] diff http://hudson.zones.apache.org/hudson/job/Hive-trunk-h0.18/ws/hive/build/ql/test/logs/negative/unknown_table1.q.out  http://hudson.zones.apache.org/hudson/job/Hive-trunk-h0.18/ws/hive/ql/src/test/results/compiler/errors/unknown_table1.q.out 
    [junit] Done query: unknown_table1.q
    [junit] Begin query: unknown_table2.q
    [junit] Loading data to table srcpart partition {ds=2008-04-08, hr=11}
    [junit] OK
    [junit] Loading data to table srcpart partition {ds=2008-04-08, hr=12}
    [junit] OK
    [junit] Loading data to table srcpart partition {ds=2008-04-09, hr=11}
    [junit] OK
    [junit] Loading data to table srcpart partition {ds=2008-04-09, hr=12}
    [junit] OK
    [junit] Loading data to table srcbucket
    [junit] OK
    [junit] Loading data to table srcbucket
    [junit] OK
    [junit] Loading data to table src
    [junit] OK
    [junit] Loading data to table src1
    [junit] OK
    [junit] Loading data to table src_sequencefile
    [junit] OK
    [junit] Loading data to table src_thrift
    [junit] OK
    [junit] Loading data to table src_json
    [junit] OK
    [junit] diff http://hudson.zones.apache.org/hudson/job/Hive-trunk-h0.18/ws/hive/build/ql/test/logs/negative/unknown_table2.q.out  http://hudson.zones.apache.org/hudson/job/Hive-trunk-h0.18/ws/hive/ql/src/test/results/compiler/errors/unknown_table2.q.out 
    [junit] Done query: unknown_table2.q
    [junit] Begin query: wrong_distinct1.q
    [junit] Loading data to table srcpart partition {ds=2008-04-08, hr=11}
    [junit] OK
    [junit] Loading data to table srcpart partition {ds=2008-04-08, hr=12}
    [junit] OK
    [junit] Loading data to table srcpart partition {ds=2008-04-09, hr=11}
    [junit] OK
    [junit] Loading data to table srcpart partition {ds=2008-04-09, hr=12}
    [junit] OK
    [junit] Loading data to table srcbucket
    [junit] OK
    [junit] Loading data to table srcbucket
    [junit] OK
    [junit] Loading data to table src
    [junit] OK
    [junit] Loading data to table src1
    [junit] OK
    [junit] Loading data to table src_sequencefile
    [junit] OK
    [junit] Loading data to table src_thrift
    [junit] OK
    [junit] Loading data to table src_json
    [junit] OK
    [junit] diff http://hudson.zones.apache.org/hudson/job/Hive-trunk-h0.18/ws/hive/build/ql/test/logs/negative/wrong_distinct1.q.out  http://hudson.zones.apache.org/hudson/job/Hive-trunk-h0.18/ws/hive/ql/src/test/results/compiler/errors/wrong_distinct1.q.out 
    [junit] Done query: wrong_distinct1.q
    [junit] Begin query: wrong_distinct2.q
    [junit] Loading data to table srcpart partition {ds=2008-04-08, hr=11}
    [junit] OK
    [junit] Loading data to table srcpart partition {ds=2008-04-08, hr=12}
    [junit] OK
    [junit] Loading data to table srcpart partition {ds=2008-04-09, hr=11}
    [junit] OK
    [junit] Loading data to table srcpart partition {ds=2008-04-09, hr=12}
    [junit] OK
    [junit] Loading data to table srcbucket
    [junit] OK
    [junit] Loading data to table srcbucket
    [junit] OK
    [junit] Loading data to table src
    [junit] OK
    [junit] Loading data to table src1
    [junit] OK
    [junit] Loading data to table src_sequencefile
    [junit] OK
    [junit] Loading data to table src_thrift
    [junit] OK
    [junit] Loading data to table src_json
    [junit] OK
    [junit] diff http://hudson.zones.apache.org/hudson/job/Hive-trunk-h0.18/ws/hive/build/ql/test/logs/negative/wrong_distinct2.q.out  http://hudson.zones.apache.org/hudson/job/Hive-trunk-h0.18/ws/hive/ql/src/test/results/compiler/errors/wrong_distinct2.q.out 
    [junit] Done query: wrong_distinct2.q
    [junit] Tests run: 33, Failures: 0, Errors: 0, Time elapsed: 43.354 sec
    [junit] Running org.apache.hadoop.hive.ql.plan.TestAddPartition
    [junit] Table doesnotexist does not exist
    [junit] Tests run: 1, Failures: 0, Errors: 0, Time elapsed: 4.75 sec
    [junit] Running org.apache.hadoop.hive.ql.tool.TestLineageInfo
    [junit] Tests run: 5, Failures: 0, Errors: 0, Time elapsed: 0.27 sec

BUILD FAILED
http://hudson.zones.apache.org/hudson/job/Hive-trunk-h0.18/ws/hive/build.xml :118: The following error occurred while executing this line:
http://hudson.zones.apache.org/hudson/job/Hive-trunk-h0.18/ws/hive/build.xml :73: The following error occurred while executing this line:
http://hudson.zones.apache.org/hudson/job/Hive-trunk-h0.18/ws/hive/build-common.xml :276: Tests failed!

Total time: 25 minutes 10 seconds
Recording test results


Build failed in Hudson: Hive-trunk-h0.18 #81

Posted by Apache Hudson Server <hu...@hudson.zones.apache.org>.
See http://hudson.zones.apache.org/hudson/job/Hive-trunk-h0.18/81/changes

Changes:

[namit] HIVE-420. Support regular expressions for column names
(Zheng Shao via namit)

------------------------------------------
[...truncated 7130 lines...]
    [junit] Loading data to table src1
    [junit] OK
    [junit] Loading data to table src_sequencefile
    [junit] OK
    [junit] Loading data to table src_thrift
    [junit] OK
    [junit] Loading data to table src_json
    [junit] OK
    [junit] diff http://hudson.zones.apache.org/hudson/job/Hive-trunk-h0.18/ws/hive/build/ql/test/logs/negative/unknown_column6.q.out  http://hudson.zones.apache.org/hudson/job/Hive-trunk-h0.18/ws/hive/ql/src/test/results/compiler/errors/unknown_column6.q.out 
    [junit] Done query: unknown_column6.q
    [junit] Begin query: unknown_function1.q
    [junit] Loading data to table srcpart partition {ds=2008-04-08, hr=11}
    [junit] OK
    [junit] Loading data to table srcpart partition {ds=2008-04-08, hr=12}
    [junit] OK
    [junit] Loading data to table srcpart partition {ds=2008-04-09, hr=11}
    [junit] OK
    [junit] Loading data to table srcpart partition {ds=2008-04-09, hr=12}
    [junit] OK
    [junit] Loading data to table srcbucket
    [junit] OK
    [junit] Loading data to table srcbucket
    [junit] OK
    [junit] Loading data to table src
    [junit] OK
    [junit] Loading data to table src1
    [junit] OK
    [junit] Loading data to table src_sequencefile
    [junit] OK
    [junit] Loading data to table src_thrift
    [junit] OK
    [junit] Loading data to table src_json
    [junit] OK
    [junit] diff http://hudson.zones.apache.org/hudson/job/Hive-trunk-h0.18/ws/hive/build/ql/test/logs/negative/unknown_function1.q.out  http://hudson.zones.apache.org/hudson/job/Hive-trunk-h0.18/ws/hive/ql/src/test/results/compiler/errors/unknown_function1.q.out 
    [junit] Done query: unknown_function1.q
    [junit] Begin query: unknown_function2.q
    [junit] Loading data to table srcpart partition {ds=2008-04-08, hr=11}
    [junit] OK
    [junit] Loading data to table srcpart partition {ds=2008-04-08, hr=12}
    [junit] OK
    [junit] Loading data to table srcpart partition {ds=2008-04-09, hr=11}
    [junit] OK
    [junit] Loading data to table srcpart partition {ds=2008-04-09, hr=12}
    [junit] OK
    [junit] Loading data to table srcbucket
    [junit] OK
    [junit] Loading data to table srcbucket
    [junit] OK
    [junit] Loading data to table src
    [junit] OK
    [junit] Loading data to table src1
    [junit] OK
    [junit] Loading data to table src_sequencefile
    [junit] OK
    [junit] Loading data to table src_thrift
    [junit] OK
    [junit] Loading data to table src_json
    [junit] OK
    [junit] diff http://hudson.zones.apache.org/hudson/job/Hive-trunk-h0.18/ws/hive/build/ql/test/logs/negative/unknown_function2.q.out  http://hudson.zones.apache.org/hudson/job/Hive-trunk-h0.18/ws/hive/ql/src/test/results/compiler/errors/unknown_function2.q.out 
    [junit] Done query: unknown_function2.q
    [junit] Begin query: unknown_function3.q
    [junit] Loading data to table srcpart partition {ds=2008-04-08, hr=11}
    [junit] OK
    [junit] Loading data to table srcpart partition {ds=2008-04-08, hr=12}
    [junit] OK
    [junit] Loading data to table srcpart partition {ds=2008-04-09, hr=11}
    [junit] OK
    [junit] Loading data to table srcpart partition {ds=2008-04-09, hr=12}
    [junit] OK
    [junit] Loading data to table srcbucket
    [junit] OK
    [junit] Loading data to table srcbucket
    [junit] OK
    [junit] Loading data to table src
    [junit] OK
    [junit] Loading data to table src1
    [junit] OK
    [junit] Loading data to table src_sequencefile
    [junit] OK
    [junit] Loading data to table src_thrift
    [junit] OK
    [junit] Loading data to table src_json
    [junit] OK
    [junit] diff http://hudson.zones.apache.org/hudson/job/Hive-trunk-h0.18/ws/hive/build/ql/test/logs/negative/unknown_function3.q.out  http://hudson.zones.apache.org/hudson/job/Hive-trunk-h0.18/ws/hive/ql/src/test/results/compiler/errors/unknown_function3.q.out 
    [junit] Done query: unknown_function3.q
    [junit] Begin query: unknown_function4.q
    [junit] Loading data to table srcpart partition {ds=2008-04-08, hr=11}
    [junit] OK
    [junit] Loading data to table srcpart partition {ds=2008-04-08, hr=12}
    [junit] OK
    [junit] Loading data to table srcpart partition {ds=2008-04-09, hr=11}
    [junit] OK
    [junit] Loading data to table srcpart partition {ds=2008-04-09, hr=12}
    [junit] OK
    [junit] Loading data to table srcbucket
    [junit] OK
    [junit] Loading data to table srcbucket
    [junit] OK
    [junit] Loading data to table src
    [junit] OK
    [junit] Loading data to table src1
    [junit] OK
    [junit] Loading data to table src_sequencefile
    [junit] OK
    [junit] Loading data to table src_thrift
    [junit] OK
    [junit] Loading data to table src_json
    [junit] OK
    [junit] diff http://hudson.zones.apache.org/hudson/job/Hive-trunk-h0.18/ws/hive/build/ql/test/logs/negative/unknown_function4.q.out  http://hudson.zones.apache.org/hudson/job/Hive-trunk-h0.18/ws/hive/ql/src/test/results/compiler/errors/unknown_function4.q.out 
    [junit] Done query: unknown_function4.q
    [junit] Begin query: unknown_function5.q
    [junit] Loading data to table srcpart partition {ds=2008-04-08, hr=11}
    [junit] OK
    [junit] Loading data to table srcpart partition {ds=2008-04-08, hr=12}
    [junit] OK
    [junit] Loading data to table srcpart partition {ds=2008-04-09, hr=11}
    [junit] OK
    [junit] Loading data to table srcpart partition {ds=2008-04-09, hr=12}
    [junit] OK
    [junit] Loading data to table srcbucket
    [junit] OK
    [junit] Loading data to table srcbucket
    [junit] OK
    [junit] Loading data to table src
    [junit] OK
    [junit] Loading data to table src1
    [junit] OK
    [junit] Loading data to table src_sequencefile
    [junit] OK
    [junit] Loading data to table src_thrift
    [junit] OK
    [junit] Loading data to table src_json
    [junit] OK
    [junit] diff http://hudson.zones.apache.org/hudson/job/Hive-trunk-h0.18/ws/hive/build/ql/test/logs/negative/unknown_function5.q.out  http://hudson.zones.apache.org/hudson/job/Hive-trunk-h0.18/ws/hive/ql/src/test/results/compiler/errors/unknown_function5.q.out 
    [junit] Done query: unknown_function5.q
    [junit] Begin query: unknown_table1.q
    [junit] Loading data to table srcpart partition {ds=2008-04-08, hr=11}
    [junit] OK
    [junit] Loading data to table srcpart partition {ds=2008-04-08, hr=12}
    [junit] OK
    [junit] Loading data to table srcpart partition {ds=2008-04-09, hr=11}
    [junit] OK
    [junit] Loading data to table srcpart partition {ds=2008-04-09, hr=12}
    [junit] OK
    [junit] Loading data to table srcbucket
    [junit] OK
    [junit] Loading data to table srcbucket
    [junit] OK
    [junit] Loading data to table src
    [junit] OK
    [junit] Loading data to table src1
    [junit] OK
    [junit] Loading data to table src_sequencefile
    [junit] OK
    [junit] Loading data to table src_thrift
    [junit] OK
    [junit] Loading data to table src_json
    [junit] OK
    [junit] diff http://hudson.zones.apache.org/hudson/job/Hive-trunk-h0.18/ws/hive/build/ql/test/logs/negative/unknown_table1.q.out  http://hudson.zones.apache.org/hudson/job/Hive-trunk-h0.18/ws/hive/ql/src/test/results/compiler/errors/unknown_table1.q.out 
    [junit] Done query: unknown_table1.q
    [junit] Begin query: unknown_table2.q
    [junit] Loading data to table srcpart partition {ds=2008-04-08, hr=11}
    [junit] OK
    [junit] Loading data to table srcpart partition {ds=2008-04-08, hr=12}
    [junit] OK
    [junit] Loading data to table srcpart partition {ds=2008-04-09, hr=11}
    [junit] OK
    [junit] Loading data to table srcpart partition {ds=2008-04-09, hr=12}
    [junit] OK
    [junit] Loading data to table srcbucket
    [junit] OK
    [junit] Loading data to table srcbucket
    [junit] OK
    [junit] Loading data to table src
    [junit] OK
    [junit] Loading data to table src1
    [junit] OK
    [junit] Loading data to table src_sequencefile
    [junit] OK
    [junit] Loading data to table src_thrift
    [junit] OK
    [junit] Loading data to table src_json
    [junit] OK
    [junit] diff http://hudson.zones.apache.org/hudson/job/Hive-trunk-h0.18/ws/hive/build/ql/test/logs/negative/unknown_table2.q.out  http://hudson.zones.apache.org/hudson/job/Hive-trunk-h0.18/ws/hive/ql/src/test/results/compiler/errors/unknown_table2.q.out 
    [junit] Done query: unknown_table2.q
    [junit] Begin query: wrong_distinct1.q
    [junit] Loading data to table srcpart partition {ds=2008-04-08, hr=11}
    [junit] OK
    [junit] Loading data to table srcpart partition {ds=2008-04-08, hr=12}
    [junit] OK
    [junit] Loading data to table srcpart partition {ds=2008-04-09, hr=11}
    [junit] OK
    [junit] Loading data to table srcpart partition {ds=2008-04-09, hr=12}
    [junit] OK
    [junit] Loading data to table srcbucket
    [junit] OK
    [junit] Loading data to table srcbucket
    [junit] OK
    [junit] Loading data to table src
    [junit] OK
    [junit] Loading data to table src1
    [junit] OK
    [junit] Loading data to table src_sequencefile
    [junit] OK
    [junit] Loading data to table src_thrift
    [junit] OK
    [junit] Loading data to table src_json
    [junit] OK
    [junit] diff http://hudson.zones.apache.org/hudson/job/Hive-trunk-h0.18/ws/hive/build/ql/test/logs/negative/wrong_distinct1.q.out  http://hudson.zones.apache.org/hudson/job/Hive-trunk-h0.18/ws/hive/ql/src/test/results/compiler/errors/wrong_distinct1.q.out 
    [junit] Done query: wrong_distinct1.q
    [junit] Begin query: wrong_distinct2.q
    [junit] Loading data to table srcpart partition {ds=2008-04-08, hr=11}
    [junit] OK
    [junit] Loading data to table srcpart partition {ds=2008-04-08, hr=12}
    [junit] OK
    [junit] Loading data to table srcpart partition {ds=2008-04-09, hr=11}
    [junit] OK
    [junit] Loading data to table srcpart partition {ds=2008-04-09, hr=12}
    [junit] OK
    [junit] Loading data to table srcbucket
    [junit] OK
    [junit] Loading data to table srcbucket
    [junit] OK
    [junit] Loading data to table src
    [junit] OK
    [junit] Loading data to table src1
    [junit] OK
    [junit] Loading data to table src_sequencefile
    [junit] OK
    [junit] Loading data to table src_thrift
    [junit] OK
    [junit] Loading data to table src_json
    [junit] OK
    [junit] diff http://hudson.zones.apache.org/hudson/job/Hive-trunk-h0.18/ws/hive/build/ql/test/logs/negative/wrong_distinct2.q.out  http://hudson.zones.apache.org/hudson/job/Hive-trunk-h0.18/ws/hive/ql/src/test/results/compiler/errors/wrong_distinct2.q.out 
    [junit] Done query: wrong_distinct2.q
    [junit] Tests run: 33, Failures: 0, Errors: 0, Time elapsed: 42.696 sec
    [junit] Running org.apache.hadoop.hive.ql.plan.TestAddPartition
    [junit] Table doesnotexist does not exist
    [junit] Tests run: 1, Failures: 0, Errors: 0, Time elapsed: 4.73 sec
    [junit] Running org.apache.hadoop.hive.ql.tool.TestLineageInfo
    [junit] Tests run: 5, Failures: 0, Errors: 0, Time elapsed: 0.279 sec

BUILD FAILED
http://hudson.zones.apache.org/hudson/job/Hive-trunk-h0.18/ws/hive/build.xml :118: The following error occurred while executing this line:
http://hudson.zones.apache.org/hudson/job/Hive-trunk-h0.18/ws/hive/build.xml :73: The following error occurred while executing this line:
http://hudson.zones.apache.org/hudson/job/Hive-trunk-h0.18/ws/hive/build-common.xml :276: Tests failed!

Total time: 25 minutes 7 seconds
Recording test results


Build failed in Hudson: Hive-trunk-h0.18 #80

Posted by Apache Hudson Server <hu...@hudson.zones.apache.org>.
See http://hudson.zones.apache.org/hudson/job/Hive-trunk-h0.18/80/changes

Changes:

[zshao] HIVE-352. Column-based storage format RCFile. (Yongqiang He via zshao)

[zshao] HIVE-464. Add alter partition method to the meastore interface. (Prasad Chakka via zshao)

------------------------------------------
[...truncated 7102 lines...]
    [junit] Loading data to table src1
    [junit] OK
    [junit] Loading data to table src_sequencefile
    [junit] OK
    [junit] Loading data to table src_thrift
    [junit] OK
    [junit] Loading data to table src_json
    [junit] OK
    [junit] diff http://hudson.zones.apache.org/hudson/job/Hive-trunk-h0.18/ws/hive/build/ql/test/logs/negative/unknown_column6.q.out  http://hudson.zones.apache.org/hudson/job/Hive-trunk-h0.18/ws/hive/ql/src/test/results/compiler/errors/unknown_column6.q.out 
    [junit] Done query: unknown_column6.q
    [junit] Begin query: unknown_function1.q
    [junit] Loading data to table srcpart partition {ds=2008-04-08, hr=11}
    [junit] OK
    [junit] Loading data to table srcpart partition {ds=2008-04-08, hr=12}
    [junit] OK
    [junit] Loading data to table srcpart partition {ds=2008-04-09, hr=11}
    [junit] OK
    [junit] Loading data to table srcpart partition {ds=2008-04-09, hr=12}
    [junit] OK
    [junit] Loading data to table srcbucket
    [junit] OK
    [junit] Loading data to table srcbucket
    [junit] OK
    [junit] Loading data to table src
    [junit] OK
    [junit] Loading data to table src1
    [junit] OK
    [junit] Loading data to table src_sequencefile
    [junit] OK
    [junit] Loading data to table src_thrift
    [junit] OK
    [junit] Loading data to table src_json
    [junit] OK
    [junit] diff http://hudson.zones.apache.org/hudson/job/Hive-trunk-h0.18/ws/hive/build/ql/test/logs/negative/unknown_function1.q.out  http://hudson.zones.apache.org/hudson/job/Hive-trunk-h0.18/ws/hive/ql/src/test/results/compiler/errors/unknown_function1.q.out 
    [junit] Done query: unknown_function1.q
    [junit] Begin query: unknown_function2.q
    [junit] Loading data to table srcpart partition {ds=2008-04-08, hr=11}
    [junit] OK
    [junit] Loading data to table srcpart partition {ds=2008-04-08, hr=12}
    [junit] OK
    [junit] Loading data to table srcpart partition {ds=2008-04-09, hr=11}
    [junit] OK
    [junit] Loading data to table srcpart partition {ds=2008-04-09, hr=12}
    [junit] OK
    [junit] Loading data to table srcbucket
    [junit] OK
    [junit] Loading data to table srcbucket
    [junit] OK
    [junit] Loading data to table src
    [junit] OK
    [junit] Loading data to table src1
    [junit] OK
    [junit] Loading data to table src_sequencefile
    [junit] OK
    [junit] Loading data to table src_thrift
    [junit] OK
    [junit] Loading data to table src_json
    [junit] OK
    [junit] diff http://hudson.zones.apache.org/hudson/job/Hive-trunk-h0.18/ws/hive/build/ql/test/logs/negative/unknown_function2.q.out  http://hudson.zones.apache.org/hudson/job/Hive-trunk-h0.18/ws/hive/ql/src/test/results/compiler/errors/unknown_function2.q.out 
    [junit] Done query: unknown_function2.q
    [junit] Begin query: unknown_function3.q
    [junit] Loading data to table srcpart partition {ds=2008-04-08, hr=11}
    [junit] OK
    [junit] Loading data to table srcpart partition {ds=2008-04-08, hr=12}
    [junit] OK
    [junit] Loading data to table srcpart partition {ds=2008-04-09, hr=11}
    [junit] OK
    [junit] Loading data to table srcpart partition {ds=2008-04-09, hr=12}
    [junit] OK
    [junit] Loading data to table srcbucket
    [junit] OK
    [junit] Loading data to table srcbucket
    [junit] OK
    [junit] Loading data to table src
    [junit] OK
    [junit] Loading data to table src1
    [junit] OK
    [junit] Loading data to table src_sequencefile
    [junit] OK
    [junit] Loading data to table src_thrift
    [junit] OK
    [junit] Loading data to table src_json
    [junit] OK
    [junit] diff http://hudson.zones.apache.org/hudson/job/Hive-trunk-h0.18/ws/hive/build/ql/test/logs/negative/unknown_function3.q.out  http://hudson.zones.apache.org/hudson/job/Hive-trunk-h0.18/ws/hive/ql/src/test/results/compiler/errors/unknown_function3.q.out 
    [junit] Done query: unknown_function3.q
    [junit] Begin query: unknown_function4.q
    [junit] Loading data to table srcpart partition {ds=2008-04-08, hr=11}
    [junit] OK
    [junit] Loading data to table srcpart partition {ds=2008-04-08, hr=12}
    [junit] OK
    [junit] Loading data to table srcpart partition {ds=2008-04-09, hr=11}
    [junit] OK
    [junit] Loading data to table srcpart partition {ds=2008-04-09, hr=12}
    [junit] OK
    [junit] Loading data to table srcbucket
    [junit] OK
    [junit] Loading data to table srcbucket
    [junit] OK
    [junit] Loading data to table src
    [junit] OK
    [junit] Loading data to table src1
    [junit] OK
    [junit] Loading data to table src_sequencefile
    [junit] OK
    [junit] Loading data to table src_thrift
    [junit] OK
    [junit] Loading data to table src_json
    [junit] OK
    [junit] diff http://hudson.zones.apache.org/hudson/job/Hive-trunk-h0.18/ws/hive/build/ql/test/logs/negative/unknown_function4.q.out  http://hudson.zones.apache.org/hudson/job/Hive-trunk-h0.18/ws/hive/ql/src/test/results/compiler/errors/unknown_function4.q.out 
    [junit] Done query: unknown_function4.q
    [junit] Begin query: unknown_function5.q
    [junit] Loading data to table srcpart partition {ds=2008-04-08, hr=11}
    [junit] OK
    [junit] Loading data to table srcpart partition {ds=2008-04-08, hr=12}
    [junit] OK
    [junit] Loading data to table srcpart partition {ds=2008-04-09, hr=11}
    [junit] OK
    [junit] Loading data to table srcpart partition {ds=2008-04-09, hr=12}
    [junit] OK
    [junit] Loading data to table srcbucket
    [junit] OK
    [junit] Loading data to table srcbucket
    [junit] OK
    [junit] Loading data to table src
    [junit] OK
    [junit] Loading data to table src1
    [junit] OK
    [junit] Loading data to table src_sequencefile
    [junit] OK
    [junit] Loading data to table src_thrift
    [junit] OK
    [junit] Loading data to table src_json
    [junit] OK
    [junit] diff http://hudson.zones.apache.org/hudson/job/Hive-trunk-h0.18/ws/hive/build/ql/test/logs/negative/unknown_function5.q.out  http://hudson.zones.apache.org/hudson/job/Hive-trunk-h0.18/ws/hive/ql/src/test/results/compiler/errors/unknown_function5.q.out 
    [junit] Done query: unknown_function5.q
    [junit] Begin query: unknown_table1.q
    [junit] Loading data to table srcpart partition {ds=2008-04-08, hr=11}
    [junit] OK
    [junit] Loading data to table srcpart partition {ds=2008-04-08, hr=12}
    [junit] OK
    [junit] Loading data to table srcpart partition {ds=2008-04-09, hr=11}
    [junit] OK
    [junit] Loading data to table srcpart partition {ds=2008-04-09, hr=12}
    [junit] OK
    [junit] Loading data to table srcbucket
    [junit] OK
    [junit] Loading data to table srcbucket
    [junit] OK
    [junit] Loading data to table src
    [junit] OK
    [junit] Loading data to table src1
    [junit] OK
    [junit] Loading data to table src_sequencefile
    [junit] OK
    [junit] Loading data to table src_thrift
    [junit] OK
    [junit] Loading data to table src_json
    [junit] OK
    [junit] diff http://hudson.zones.apache.org/hudson/job/Hive-trunk-h0.18/ws/hive/build/ql/test/logs/negative/unknown_table1.q.out  http://hudson.zones.apache.org/hudson/job/Hive-trunk-h0.18/ws/hive/ql/src/test/results/compiler/errors/unknown_table1.q.out 
    [junit] Done query: unknown_table1.q
    [junit] Begin query: unknown_table2.q
    [junit] Loading data to table srcpart partition {ds=2008-04-08, hr=11}
    [junit] OK
    [junit] Loading data to table srcpart partition {ds=2008-04-08, hr=12}
    [junit] OK
    [junit] Loading data to table srcpart partition {ds=2008-04-09, hr=11}
    [junit] OK
    [junit] Loading data to table srcpart partition {ds=2008-04-09, hr=12}
    [junit] OK
    [junit] Loading data to table srcbucket
    [junit] OK
    [junit] Loading data to table srcbucket
    [junit] OK
    [junit] Loading data to table src
    [junit] OK
    [junit] Loading data to table src1
    [junit] OK
    [junit] Loading data to table src_sequencefile
    [junit] OK
    [junit] Loading data to table src_thrift
    [junit] OK
    [junit] Loading data to table src_json
    [junit] OK
    [junit] diff http://hudson.zones.apache.org/hudson/job/Hive-trunk-h0.18/ws/hive/build/ql/test/logs/negative/unknown_table2.q.out  http://hudson.zones.apache.org/hudson/job/Hive-trunk-h0.18/ws/hive/ql/src/test/results/compiler/errors/unknown_table2.q.out 
    [junit] Done query: unknown_table2.q
    [junit] Begin query: wrong_distinct1.q
    [junit] Loading data to table srcpart partition {ds=2008-04-08, hr=11}
    [junit] OK
    [junit] Loading data to table srcpart partition {ds=2008-04-08, hr=12}
    [junit] OK
    [junit] Loading data to table srcpart partition {ds=2008-04-09, hr=11}
    [junit] OK
    [junit] Loading data to table srcpart partition {ds=2008-04-09, hr=12}
    [junit] OK
    [junit] Loading data to table srcbucket
    [junit] OK
    [junit] Loading data to table srcbucket
    [junit] OK
    [junit] Loading data to table src
    [junit] OK
    [junit] Loading data to table src1
    [junit] OK
    [junit] Loading data to table src_sequencefile
    [junit] OK
    [junit] Loading data to table src_thrift
    [junit] OK
    [junit] Loading data to table src_json
    [junit] OK
    [junit] diff http://hudson.zones.apache.org/hudson/job/Hive-trunk-h0.18/ws/hive/build/ql/test/logs/negative/wrong_distinct1.q.out  http://hudson.zones.apache.org/hudson/job/Hive-trunk-h0.18/ws/hive/ql/src/test/results/compiler/errors/wrong_distinct1.q.out 
    [junit] Done query: wrong_distinct1.q
    [junit] Begin query: wrong_distinct2.q
    [junit] Loading data to table srcpart partition {ds=2008-04-08, hr=11}
    [junit] OK
    [junit] Loading data to table srcpart partition {ds=2008-04-08, hr=12}
    [junit] OK
    [junit] Loading data to table srcpart partition {ds=2008-04-09, hr=11}
    [junit] OK
    [junit] Loading data to table srcpart partition {ds=2008-04-09, hr=12}
    [junit] OK
    [junit] Loading data to table srcbucket
    [junit] OK
    [junit] Loading data to table srcbucket
    [junit] OK
    [junit] Loading data to table src
    [junit] OK
    [junit] Loading data to table src1
    [junit] OK
    [junit] Loading data to table src_sequencefile
    [junit] OK
    [junit] Loading data to table src_thrift
    [junit] OK
    [junit] Loading data to table src_json
    [junit] OK
    [junit] diff http://hudson.zones.apache.org/hudson/job/Hive-trunk-h0.18/ws/hive/build/ql/test/logs/negative/wrong_distinct2.q.out  http://hudson.zones.apache.org/hudson/job/Hive-trunk-h0.18/ws/hive/ql/src/test/results/compiler/errors/wrong_distinct2.q.out 
    [junit] Done query: wrong_distinct2.q
    [junit] Tests run: 33, Failures: 0, Errors: 0, Time elapsed: 43.391 sec
    [junit] Running org.apache.hadoop.hive.ql.plan.TestAddPartition
    [junit] Table doesnotexist does not exist
    [junit] Tests run: 1, Failures: 0, Errors: 0, Time elapsed: 4.796 sec
    [junit] Running org.apache.hadoop.hive.ql.tool.TestLineageInfo
    [junit] Tests run: 5, Failures: 0, Errors: 0, Time elapsed: 0.284 sec

BUILD FAILED
http://hudson.zones.apache.org/hudson/job/Hive-trunk-h0.18/ws/hive/build.xml :118: The following error occurred while executing this line:
http://hudson.zones.apache.org/hudson/job/Hive-trunk-h0.18/ws/hive/build.xml :73: The following error occurred while executing this line:
http://hudson.zones.apache.org/hudson/job/Hive-trunk-h0.18/ws/hive/build-common.xml :276: Tests failed!

Total time: 24 minutes 45 seconds
Recording test results


Build failed in Hudson: Hive-trunk-h0.18 #79

Posted by Apache Hudson Server <hu...@hudson.zones.apache.org>.
See http://hudson.zones.apache.org/hudson/job/Hive-trunk-h0.18/79/changes

Changes:

[namit] HIVE-462. Avoid Text->String->Text conversion (Namit Jain via zshao)

[athusoo] HIVE-422 New logo for Hive. (Aaron Newton via athusoo)

[athusoo] Fix CHANGES.txt to reflect changes in proper releases

------------------------------------------
[...truncated 7055 lines...]
    [junit] Loading data to table src1
    [junit] OK
    [junit] Loading data to table src_sequencefile
    [junit] OK
    [junit] Loading data to table src_thrift
    [junit] OK
    [junit] Loading data to table src_json
    [junit] OK
    [junit] diff http://hudson.zones.apache.org/hudson/job/Hive-trunk-h0.18/ws/hive/build/ql/test/logs/negative/unknown_column6.q.out  http://hudson.zones.apache.org/hudson/job/Hive-trunk-h0.18/ws/hive/ql/src/test/results/compiler/errors/unknown_column6.q.out 
    [junit] Done query: unknown_column6.q
    [junit] Begin query: unknown_function1.q
    [junit] Loading data to table srcpart partition {ds=2008-04-08, hr=11}
    [junit] OK
    [junit] Loading data to table srcpart partition {ds=2008-04-08, hr=12}
    [junit] OK
    [junit] Loading data to table srcpart partition {ds=2008-04-09, hr=11}
    [junit] OK
    [junit] Loading data to table srcpart partition {ds=2008-04-09, hr=12}
    [junit] OK
    [junit] Loading data to table srcbucket
    [junit] OK
    [junit] Loading data to table srcbucket
    [junit] OK
    [junit] Loading data to table src
    [junit] OK
    [junit] Loading data to table src1
    [junit] OK
    [junit] Loading data to table src_sequencefile
    [junit] OK
    [junit] Loading data to table src_thrift
    [junit] OK
    [junit] Loading data to table src_json
    [junit] OK
    [junit] diff http://hudson.zones.apache.org/hudson/job/Hive-trunk-h0.18/ws/hive/build/ql/test/logs/negative/unknown_function1.q.out  http://hudson.zones.apache.org/hudson/job/Hive-trunk-h0.18/ws/hive/ql/src/test/results/compiler/errors/unknown_function1.q.out 
    [junit] Done query: unknown_function1.q
    [junit] Begin query: unknown_function2.q
    [junit] Loading data to table srcpart partition {ds=2008-04-08, hr=11}
    [junit] OK
    [junit] Loading data to table srcpart partition {ds=2008-04-08, hr=12}
    [junit] OK
    [junit] Loading data to table srcpart partition {ds=2008-04-09, hr=11}
    [junit] OK
    [junit] Loading data to table srcpart partition {ds=2008-04-09, hr=12}
    [junit] OK
    [junit] Loading data to table srcbucket
    [junit] OK
    [junit] Loading data to table srcbucket
    [junit] OK
    [junit] Loading data to table src
    [junit] OK
    [junit] Loading data to table src1
    [junit] OK
    [junit] Loading data to table src_sequencefile
    [junit] OK
    [junit] Loading data to table src_thrift
    [junit] OK
    [junit] Loading data to table src_json
    [junit] OK
    [junit] diff http://hudson.zones.apache.org/hudson/job/Hive-trunk-h0.18/ws/hive/build/ql/test/logs/negative/unknown_function2.q.out  http://hudson.zones.apache.org/hudson/job/Hive-trunk-h0.18/ws/hive/ql/src/test/results/compiler/errors/unknown_function2.q.out 
    [junit] Done query: unknown_function2.q
    [junit] Begin query: unknown_function3.q
    [junit] Loading data to table srcpart partition {ds=2008-04-08, hr=11}
    [junit] OK
    [junit] Loading data to table srcpart partition {ds=2008-04-08, hr=12}
    [junit] OK
    [junit] Loading data to table srcpart partition {ds=2008-04-09, hr=11}
    [junit] OK
    [junit] Loading data to table srcpart partition {ds=2008-04-09, hr=12}
    [junit] OK
    [junit] Loading data to table srcbucket
    [junit] OK
    [junit] Loading data to table srcbucket
    [junit] OK
    [junit] Loading data to table src
    [junit] OK
    [junit] Loading data to table src1
    [junit] OK
    [junit] Loading data to table src_sequencefile
    [junit] OK
    [junit] Loading data to table src_thrift
    [junit] OK
    [junit] Loading data to table src_json
    [junit] OK
    [junit] diff http://hudson.zones.apache.org/hudson/job/Hive-trunk-h0.18/ws/hive/build/ql/test/logs/negative/unknown_function3.q.out  http://hudson.zones.apache.org/hudson/job/Hive-trunk-h0.18/ws/hive/ql/src/test/results/compiler/errors/unknown_function3.q.out 
    [junit] Done query: unknown_function3.q
    [junit] Begin query: unknown_function4.q
    [junit] Loading data to table srcpart partition {ds=2008-04-08, hr=11}
    [junit] OK
    [junit] Loading data to table srcpart partition {ds=2008-04-08, hr=12}
    [junit] OK
    [junit] Loading data to table srcpart partition {ds=2008-04-09, hr=11}
    [junit] OK
    [junit] Loading data to table srcpart partition {ds=2008-04-09, hr=12}
    [junit] OK
    [junit] Loading data to table srcbucket
    [junit] OK
    [junit] Loading data to table srcbucket
    [junit] OK
    [junit] Loading data to table src
    [junit] OK
    [junit] Loading data to table src1
    [junit] OK
    [junit] Loading data to table src_sequencefile
    [junit] OK
    [junit] Loading data to table src_thrift
    [junit] OK
    [junit] Loading data to table src_json
    [junit] OK
    [junit] diff http://hudson.zones.apache.org/hudson/job/Hive-trunk-h0.18/ws/hive/build/ql/test/logs/negative/unknown_function4.q.out  http://hudson.zones.apache.org/hudson/job/Hive-trunk-h0.18/ws/hive/ql/src/test/results/compiler/errors/unknown_function4.q.out 
    [junit] Done query: unknown_function4.q
    [junit] Begin query: unknown_function5.q
    [junit] Loading data to table srcpart partition {ds=2008-04-08, hr=11}
    [junit] OK
    [junit] Loading data to table srcpart partition {ds=2008-04-08, hr=12}
    [junit] OK
    [junit] Loading data to table srcpart partition {ds=2008-04-09, hr=11}
    [junit] OK
    [junit] Loading data to table srcpart partition {ds=2008-04-09, hr=12}
    [junit] OK
    [junit] Loading data to table srcbucket
    [junit] OK
    [junit] Loading data to table srcbucket
    [junit] OK
    [junit] Loading data to table src
    [junit] OK
    [junit] Loading data to table src1
    [junit] OK
    [junit] Loading data to table src_sequencefile
    [junit] OK
    [junit] Loading data to table src_thrift
    [junit] OK
    [junit] Loading data to table src_json
    [junit] OK
    [junit] diff http://hudson.zones.apache.org/hudson/job/Hive-trunk-h0.18/ws/hive/build/ql/test/logs/negative/unknown_function5.q.out  http://hudson.zones.apache.org/hudson/job/Hive-trunk-h0.18/ws/hive/ql/src/test/results/compiler/errors/unknown_function5.q.out 
    [junit] Done query: unknown_function5.q
    [junit] Begin query: unknown_table1.q
    [junit] Loading data to table srcpart partition {ds=2008-04-08, hr=11}
    [junit] OK
    [junit] Loading data to table srcpart partition {ds=2008-04-08, hr=12}
    [junit] OK
    [junit] Loading data to table srcpart partition {ds=2008-04-09, hr=11}
    [junit] OK
    [junit] Loading data to table srcpart partition {ds=2008-04-09, hr=12}
    [junit] OK
    [junit] Loading data to table srcbucket
    [junit] OK
    [junit] Loading data to table srcbucket
    [junit] OK
    [junit] Loading data to table src
    [junit] OK
    [junit] Loading data to table src1
    [junit] OK
    [junit] Loading data to table src_sequencefile
    [junit] OK
    [junit] Loading data to table src_thrift
    [junit] OK
    [junit] Loading data to table src_json
    [junit] OK
    [junit] diff http://hudson.zones.apache.org/hudson/job/Hive-trunk-h0.18/ws/hive/build/ql/test/logs/negative/unknown_table1.q.out  http://hudson.zones.apache.org/hudson/job/Hive-trunk-h0.18/ws/hive/ql/src/test/results/compiler/errors/unknown_table1.q.out 
    [junit] Done query: unknown_table1.q
    [junit] Begin query: unknown_table2.q
    [junit] Loading data to table srcpart partition {ds=2008-04-08, hr=11}
    [junit] OK
    [junit] Loading data to table srcpart partition {ds=2008-04-08, hr=12}
    [junit] OK
    [junit] Loading data to table srcpart partition {ds=2008-04-09, hr=11}
    [junit] OK
    [junit] Loading data to table srcpart partition {ds=2008-04-09, hr=12}
    [junit] OK
    [junit] Loading data to table srcbucket
    [junit] OK
    [junit] Loading data to table srcbucket
    [junit] OK
    [junit] Loading data to table src
    [junit] OK
    [junit] Loading data to table src1
    [junit] OK
    [junit] Loading data to table src_sequencefile
    [junit] OK
    [junit] Loading data to table src_thrift
    [junit] OK
    [junit] Loading data to table src_json
    [junit] OK
    [junit] diff http://hudson.zones.apache.org/hudson/job/Hive-trunk-h0.18/ws/hive/build/ql/test/logs/negative/unknown_table2.q.out  http://hudson.zones.apache.org/hudson/job/Hive-trunk-h0.18/ws/hive/ql/src/test/results/compiler/errors/unknown_table2.q.out 
    [junit] Done query: unknown_table2.q
    [junit] Begin query: wrong_distinct1.q
    [junit] Loading data to table srcpart partition {ds=2008-04-08, hr=11}
    [junit] OK
    [junit] Loading data to table srcpart partition {ds=2008-04-08, hr=12}
    [junit] OK
    [junit] Loading data to table srcpart partition {ds=2008-04-09, hr=11}
    [junit] OK
    [junit] Loading data to table srcpart partition {ds=2008-04-09, hr=12}
    [junit] OK
    [junit] Loading data to table srcbucket
    [junit] OK
    [junit] Loading data to table srcbucket
    [junit] OK
    [junit] Loading data to table src
    [junit] OK
    [junit] Loading data to table src1
    [junit] OK
    [junit] Loading data to table src_sequencefile
    [junit] OK
    [junit] Loading data to table src_thrift
    [junit] OK
    [junit] Loading data to table src_json
    [junit] OK
    [junit] diff http://hudson.zones.apache.org/hudson/job/Hive-trunk-h0.18/ws/hive/build/ql/test/logs/negative/wrong_distinct1.q.out  http://hudson.zones.apache.org/hudson/job/Hive-trunk-h0.18/ws/hive/ql/src/test/results/compiler/errors/wrong_distinct1.q.out 
    [junit] Done query: wrong_distinct1.q
    [junit] Begin query: wrong_distinct2.q
    [junit] Loading data to table srcpart partition {ds=2008-04-08, hr=11}
    [junit] OK
    [junit] Loading data to table srcpart partition {ds=2008-04-08, hr=12}
    [junit] OK
    [junit] Loading data to table srcpart partition {ds=2008-04-09, hr=11}
    [junit] OK
    [junit] Loading data to table srcpart partition {ds=2008-04-09, hr=12}
    [junit] OK
    [junit] Loading data to table srcbucket
    [junit] OK
    [junit] Loading data to table srcbucket
    [junit] OK
    [junit] Loading data to table src
    [junit] OK
    [junit] Loading data to table src1
    [junit] OK
    [junit] Loading data to table src_sequencefile
    [junit] OK
    [junit] Loading data to table src_thrift
    [junit] OK
    [junit] Loading data to table src_json
    [junit] OK
    [junit] diff http://hudson.zones.apache.org/hudson/job/Hive-trunk-h0.18/ws/hive/build/ql/test/logs/negative/wrong_distinct2.q.out  http://hudson.zones.apache.org/hudson/job/Hive-trunk-h0.18/ws/hive/ql/src/test/results/compiler/errors/wrong_distinct2.q.out 
    [junit] Done query: wrong_distinct2.q
    [junit] Tests run: 33, Failures: 0, Errors: 0, Time elapsed: 43.719 sec
    [junit] Running org.apache.hadoop.hive.ql.plan.TestAddPartition
    [junit] Table doesnotexist does not exist
    [junit] Tests run: 1, Failures: 0, Errors: 0, Time elapsed: 4.68 sec
    [junit] Running org.apache.hadoop.hive.ql.tool.TestLineageInfo
    [junit] Tests run: 5, Failures: 0, Errors: 0, Time elapsed: 0.278 sec

BUILD FAILED
http://hudson.zones.apache.org/hudson/job/Hive-trunk-h0.18/ws/hive/build.xml :118: The following error occurred while executing this line:
http://hudson.zones.apache.org/hudson/job/Hive-trunk-h0.18/ws/hive/build.xml :73: The following error occurred while executing this line:
http://hudson.zones.apache.org/hudson/job/Hive-trunk-h0.18/ws/hive/build-common.xml :276: Tests failed!

Total time: 24 minutes 3 seconds
Recording test results


Build failed in Hudson: Hive-trunk-h0.18 #78

Posted by Apache Hudson Server <hu...@hudson.zones.apache.org>.
See http://hudson.zones.apache.org/hudson/job/Hive-trunk-h0.18/78/changes

Changes:

[namit] HIVE-164. Use CASE through GenericUDF (Zheng Shao via namit)

[prasadc] HIVE-456: Remove redundant test output

------------------------------------------
[...truncated 7056 lines...]
    [junit] Loading data to table src1
    [junit] OK
    [junit] Loading data to table src_sequencefile
    [junit] OK
    [junit] Loading data to table src_thrift
    [junit] OK
    [junit] Loading data to table src_json
    [junit] OK
    [junit] diff http://hudson.zones.apache.org/hudson/job/Hive-trunk-h0.18/ws/hive/build/ql/test/logs/negative/unknown_column6.q.out  http://hudson.zones.apache.org/hudson/job/Hive-trunk-h0.18/ws/hive/ql/src/test/results/compiler/errors/unknown_column6.q.out 
    [junit] Done query: unknown_column6.q
    [junit] Begin query: unknown_function1.q
    [junit] Loading data to table srcpart partition {ds=2008-04-08, hr=11}
    [junit] OK
    [junit] Loading data to table srcpart partition {ds=2008-04-08, hr=12}
    [junit] OK
    [junit] Loading data to table srcpart partition {ds=2008-04-09, hr=11}
    [junit] OK
    [junit] Loading data to table srcpart partition {ds=2008-04-09, hr=12}
    [junit] OK
    [junit] Loading data to table srcbucket
    [junit] OK
    [junit] Loading data to table srcbucket
    [junit] OK
    [junit] Loading data to table src
    [junit] OK
    [junit] Loading data to table src1
    [junit] OK
    [junit] Loading data to table src_sequencefile
    [junit] OK
    [junit] Loading data to table src_thrift
    [junit] OK
    [junit] Loading data to table src_json
    [junit] OK
    [junit] diff http://hudson.zones.apache.org/hudson/job/Hive-trunk-h0.18/ws/hive/build/ql/test/logs/negative/unknown_function1.q.out  http://hudson.zones.apache.org/hudson/job/Hive-trunk-h0.18/ws/hive/ql/src/test/results/compiler/errors/unknown_function1.q.out 
    [junit] Done query: unknown_function1.q
    [junit] Begin query: unknown_function2.q
    [junit] Loading data to table srcpart partition {ds=2008-04-08, hr=11}
    [junit] OK
    [junit] Loading data to table srcpart partition {ds=2008-04-08, hr=12}
    [junit] OK
    [junit] Loading data to table srcpart partition {ds=2008-04-09, hr=11}
    [junit] OK
    [junit] Loading data to table srcpart partition {ds=2008-04-09, hr=12}
    [junit] OK
    [junit] Loading data to table srcbucket
    [junit] OK
    [junit] Loading data to table srcbucket
    [junit] OK
    [junit] Loading data to table src
    [junit] OK
    [junit] Loading data to table src1
    [junit] OK
    [junit] Loading data to table src_sequencefile
    [junit] OK
    [junit] Loading data to table src_thrift
    [junit] OK
    [junit] Loading data to table src_json
    [junit] OK
    [junit] diff http://hudson.zones.apache.org/hudson/job/Hive-trunk-h0.18/ws/hive/build/ql/test/logs/negative/unknown_function2.q.out  http://hudson.zones.apache.org/hudson/job/Hive-trunk-h0.18/ws/hive/ql/src/test/results/compiler/errors/unknown_function2.q.out 
    [junit] Done query: unknown_function2.q
    [junit] Begin query: unknown_function3.q
    [junit] Loading data to table srcpart partition {ds=2008-04-08, hr=11}
    [junit] OK
    [junit] Loading data to table srcpart partition {ds=2008-04-08, hr=12}
    [junit] OK
    [junit] Loading data to table srcpart partition {ds=2008-04-09, hr=11}
    [junit] OK
    [junit] Loading data to table srcpart partition {ds=2008-04-09, hr=12}
    [junit] OK
    [junit] Loading data to table srcbucket
    [junit] OK
    [junit] Loading data to table srcbucket
    [junit] OK
    [junit] Loading data to table src
    [junit] OK
    [junit] Loading data to table src1
    [junit] OK
    [junit] Loading data to table src_sequencefile
    [junit] OK
    [junit] Loading data to table src_thrift
    [junit] OK
    [junit] Loading data to table src_json
    [junit] OK
    [junit] diff http://hudson.zones.apache.org/hudson/job/Hive-trunk-h0.18/ws/hive/build/ql/test/logs/negative/unknown_function3.q.out  http://hudson.zones.apache.org/hudson/job/Hive-trunk-h0.18/ws/hive/ql/src/test/results/compiler/errors/unknown_function3.q.out 
    [junit] Done query: unknown_function3.q
    [junit] Begin query: unknown_function4.q
    [junit] Loading data to table srcpart partition {ds=2008-04-08, hr=11}
    [junit] OK
    [junit] Loading data to table srcpart partition {ds=2008-04-08, hr=12}
    [junit] OK
    [junit] Loading data to table srcpart partition {ds=2008-04-09, hr=11}
    [junit] OK
    [junit] Loading data to table srcpart partition {ds=2008-04-09, hr=12}
    [junit] OK
    [junit] Loading data to table srcbucket
    [junit] OK
    [junit] Loading data to table srcbucket
    [junit] OK
    [junit] Loading data to table src
    [junit] OK
    [junit] Loading data to table src1
    [junit] OK
    [junit] Loading data to table src_sequencefile
    [junit] OK
    [junit] Loading data to table src_thrift
    [junit] OK
    [junit] Loading data to table src_json
    [junit] OK
    [junit] diff http://hudson.zones.apache.org/hudson/job/Hive-trunk-h0.18/ws/hive/build/ql/test/logs/negative/unknown_function4.q.out  http://hudson.zones.apache.org/hudson/job/Hive-trunk-h0.18/ws/hive/ql/src/test/results/compiler/errors/unknown_function4.q.out 
    [junit] Done query: unknown_function4.q
    [junit] Begin query: unknown_function5.q
    [junit] Loading data to table srcpart partition {ds=2008-04-08, hr=11}
    [junit] OK
    [junit] Loading data to table srcpart partition {ds=2008-04-08, hr=12}
    [junit] OK
    [junit] Loading data to table srcpart partition {ds=2008-04-09, hr=11}
    [junit] OK
    [junit] Loading data to table srcpart partition {ds=2008-04-09, hr=12}
    [junit] OK
    [junit] Loading data to table srcbucket
    [junit] OK
    [junit] Loading data to table srcbucket
    [junit] OK
    [junit] Loading data to table src
    [junit] OK
    [junit] Loading data to table src1
    [junit] OK
    [junit] Loading data to table src_sequencefile
    [junit] OK
    [junit] Loading data to table src_thrift
    [junit] OK
    [junit] Loading data to table src_json
    [junit] OK
    [junit] diff http://hudson.zones.apache.org/hudson/job/Hive-trunk-h0.18/ws/hive/build/ql/test/logs/negative/unknown_function5.q.out  http://hudson.zones.apache.org/hudson/job/Hive-trunk-h0.18/ws/hive/ql/src/test/results/compiler/errors/unknown_function5.q.out 
    [junit] Done query: unknown_function5.q
    [junit] Begin query: unknown_table1.q
    [junit] Loading data to table srcpart partition {ds=2008-04-08, hr=11}
    [junit] OK
    [junit] Loading data to table srcpart partition {ds=2008-04-08, hr=12}
    [junit] OK
    [junit] Loading data to table srcpart partition {ds=2008-04-09, hr=11}
    [junit] OK
    [junit] Loading data to table srcpart partition {ds=2008-04-09, hr=12}
    [junit] OK
    [junit] Loading data to table srcbucket
    [junit] OK
    [junit] Loading data to table srcbucket
    [junit] OK
    [junit] Loading data to table src
    [junit] OK
    [junit] Loading data to table src1
    [junit] OK
    [junit] Loading data to table src_sequencefile
    [junit] OK
    [junit] Loading data to table src_thrift
    [junit] OK
    [junit] Loading data to table src_json
    [junit] OK
    [junit] diff http://hudson.zones.apache.org/hudson/job/Hive-trunk-h0.18/ws/hive/build/ql/test/logs/negative/unknown_table1.q.out  http://hudson.zones.apache.org/hudson/job/Hive-trunk-h0.18/ws/hive/ql/src/test/results/compiler/errors/unknown_table1.q.out 
    [junit] Done query: unknown_table1.q
    [junit] Begin query: unknown_table2.q
    [junit] Loading data to table srcpart partition {ds=2008-04-08, hr=11}
    [junit] OK
    [junit] Loading data to table srcpart partition {ds=2008-04-08, hr=12}
    [junit] OK
    [junit] Loading data to table srcpart partition {ds=2008-04-09, hr=11}
    [junit] OK
    [junit] Loading data to table srcpart partition {ds=2008-04-09, hr=12}
    [junit] OK
    [junit] Loading data to table srcbucket
    [junit] OK
    [junit] Loading data to table srcbucket
    [junit] OK
    [junit] Loading data to table src
    [junit] OK
    [junit] Loading data to table src1
    [junit] OK
    [junit] Loading data to table src_sequencefile
    [junit] OK
    [junit] Loading data to table src_thrift
    [junit] OK
    [junit] Loading data to table src_json
    [junit] OK
    [junit] diff http://hudson.zones.apache.org/hudson/job/Hive-trunk-h0.18/ws/hive/build/ql/test/logs/negative/unknown_table2.q.out  http://hudson.zones.apache.org/hudson/job/Hive-trunk-h0.18/ws/hive/ql/src/test/results/compiler/errors/unknown_table2.q.out 
    [junit] Done query: unknown_table2.q
    [junit] Begin query: wrong_distinct1.q
    [junit] Loading data to table srcpart partition {ds=2008-04-08, hr=11}
    [junit] OK
    [junit] Loading data to table srcpart partition {ds=2008-04-08, hr=12}
    [junit] OK
    [junit] Loading data to table srcpart partition {ds=2008-04-09, hr=11}
    [junit] OK
    [junit] Loading data to table srcpart partition {ds=2008-04-09, hr=12}
    [junit] OK
    [junit] Loading data to table srcbucket
    [junit] OK
    [junit] Loading data to table srcbucket
    [junit] OK
    [junit] Loading data to table src
    [junit] OK
    [junit] Loading data to table src1
    [junit] OK
    [junit] Loading data to table src_sequencefile
    [junit] OK
    [junit] Loading data to table src_thrift
    [junit] OK
    [junit] Loading data to table src_json
    [junit] OK
    [junit] diff http://hudson.zones.apache.org/hudson/job/Hive-trunk-h0.18/ws/hive/build/ql/test/logs/negative/wrong_distinct1.q.out  http://hudson.zones.apache.org/hudson/job/Hive-trunk-h0.18/ws/hive/ql/src/test/results/compiler/errors/wrong_distinct1.q.out 
    [junit] Done query: wrong_distinct1.q
    [junit] Begin query: wrong_distinct2.q
    [junit] Loading data to table srcpart partition {ds=2008-04-08, hr=11}
    [junit] OK
    [junit] Loading data to table srcpart partition {ds=2008-04-08, hr=12}
    [junit] OK
    [junit] Loading data to table srcpart partition {ds=2008-04-09, hr=11}
    [junit] OK
    [junit] Loading data to table srcpart partition {ds=2008-04-09, hr=12}
    [junit] OK
    [junit] Loading data to table srcbucket
    [junit] OK
    [junit] Loading data to table srcbucket
    [junit] OK
    [junit] Loading data to table src
    [junit] OK
    [junit] Loading data to table src1
    [junit] OK
    [junit] Loading data to table src_sequencefile
    [junit] OK
    [junit] Loading data to table src_thrift
    [junit] OK
    [junit] Loading data to table src_json
    [junit] OK
    [junit] diff http://hudson.zones.apache.org/hudson/job/Hive-trunk-h0.18/ws/hive/build/ql/test/logs/negative/wrong_distinct2.q.out  http://hudson.zones.apache.org/hudson/job/Hive-trunk-h0.18/ws/hive/ql/src/test/results/compiler/errors/wrong_distinct2.q.out 
    [junit] Done query: wrong_distinct2.q
    [junit] Tests run: 33, Failures: 0, Errors: 0, Time elapsed: 43.073 sec
    [junit] Running org.apache.hadoop.hive.ql.plan.TestAddPartition
    [junit] Table doesnotexist does not exist
    [junit] Tests run: 1, Failures: 0, Errors: 0, Time elapsed: 4.695 sec
    [junit] Running org.apache.hadoop.hive.ql.tool.TestLineageInfo
    [junit] Tests run: 5, Failures: 0, Errors: 0, Time elapsed: 0.278 sec

BUILD FAILED
http://hudson.zones.apache.org/hudson/job/Hive-trunk-h0.18/ws/hive/build.xml :118: The following error occurred while executing this line:
http://hudson.zones.apache.org/hudson/job/Hive-trunk-h0.18/ws/hive/build.xml :73: The following error occurred while executing this line:
http://hudson.zones.apache.org/hudson/job/Hive-trunk-h0.18/ws/hive/build-common.xml :276: Tests failed!

Total time: 23 minutes 56 seconds
Recording test results


Build failed in Hudson: Hive-trunk-h0.18 #77

Posted by Apache Hudson Server <hu...@hudson.zones.apache.org>.
See http://hudson.zones.apache.org/hudson/job/Hive-trunk-h0.18/77/changes

Changes:

[athusoo] HIVE-254. Link jobtracker from Hive History in Hive Web Interface.
(Edward Capriolo via athusoo)

[zshao] Deleting the undeleted empty test result file.

------------------------------------------
[...truncated 34930 lines...]
    [junit] Loading data to table src1
    [junit] OK
    [junit] Loading data to table src_sequencefile
    [junit] OK
    [junit] Loading data to table src_thrift
    [junit] OK
    [junit] Loading data to table src_json
    [junit] OK
    [junit] diff http://hudson.zones.apache.org/hudson/job/Hive-trunk-h0.18/ws/hive/build/ql/test/logs/negative/unknown_column6.q.out  http://hudson.zones.apache.org/hudson/job/Hive-trunk-h0.18/ws/hive/ql/src/test/results/compiler/errors/unknown_column6.q.out 
    [junit] Done query: unknown_column6.q
    [junit] Begin query: unknown_function1.q
    [junit] Loading data to table srcpart partition {ds=2008-04-08, hr=11}
    [junit] OK
    [junit] Loading data to table srcpart partition {ds=2008-04-08, hr=12}
    [junit] OK
    [junit] Loading data to table srcpart partition {ds=2008-04-09, hr=11}
    [junit] OK
    [junit] Loading data to table srcpart partition {ds=2008-04-09, hr=12}
    [junit] OK
    [junit] Loading data to table srcbucket
    [junit] OK
    [junit] Loading data to table srcbucket
    [junit] OK
    [junit] Loading data to table src
    [junit] OK
    [junit] Loading data to table src1
    [junit] OK
    [junit] Loading data to table src_sequencefile
    [junit] OK
    [junit] Loading data to table src_thrift
    [junit] OK
    [junit] Loading data to table src_json
    [junit] OK
    [junit] diff http://hudson.zones.apache.org/hudson/job/Hive-trunk-h0.18/ws/hive/build/ql/test/logs/negative/unknown_function1.q.out  http://hudson.zones.apache.org/hudson/job/Hive-trunk-h0.18/ws/hive/ql/src/test/results/compiler/errors/unknown_function1.q.out 
    [junit] Done query: unknown_function1.q
    [junit] Begin query: unknown_function2.q
    [junit] Loading data to table srcpart partition {ds=2008-04-08, hr=11}
    [junit] OK
    [junit] Loading data to table srcpart partition {ds=2008-04-08, hr=12}
    [junit] OK
    [junit] Loading data to table srcpart partition {ds=2008-04-09, hr=11}
    [junit] OK
    [junit] Loading data to table srcpart partition {ds=2008-04-09, hr=12}
    [junit] OK
    [junit] Loading data to table srcbucket
    [junit] OK
    [junit] Loading data to table srcbucket
    [junit] OK
    [junit] Loading data to table src
    [junit] OK
    [junit] Loading data to table src1
    [junit] OK
    [junit] Loading data to table src_sequencefile
    [junit] OK
    [junit] Loading data to table src_thrift
    [junit] OK
    [junit] Loading data to table src_json
    [junit] OK
    [junit] diff http://hudson.zones.apache.org/hudson/job/Hive-trunk-h0.18/ws/hive/build/ql/test/logs/negative/unknown_function2.q.out  http://hudson.zones.apache.org/hudson/job/Hive-trunk-h0.18/ws/hive/ql/src/test/results/compiler/errors/unknown_function2.q.out 
    [junit] Done query: unknown_function2.q
    [junit] Begin query: unknown_function3.q
    [junit] Loading data to table srcpart partition {ds=2008-04-08, hr=11}
    [junit] OK
    [junit] Loading data to table srcpart partition {ds=2008-04-08, hr=12}
    [junit] OK
    [junit] Loading data to table srcpart partition {ds=2008-04-09, hr=11}
    [junit] OK
    [junit] Loading data to table srcpart partition {ds=2008-04-09, hr=12}
    [junit] OK
    [junit] Loading data to table srcbucket
    [junit] OK
    [junit] Loading data to table srcbucket
    [junit] OK
    [junit] Loading data to table src
    [junit] OK
    [junit] Loading data to table src1
    [junit] OK
    [junit] Loading data to table src_sequencefile
    [junit] OK
    [junit] Loading data to table src_thrift
    [junit] OK
    [junit] Loading data to table src_json
    [junit] OK
    [junit] diff http://hudson.zones.apache.org/hudson/job/Hive-trunk-h0.18/ws/hive/build/ql/test/logs/negative/unknown_function3.q.out  http://hudson.zones.apache.org/hudson/job/Hive-trunk-h0.18/ws/hive/ql/src/test/results/compiler/errors/unknown_function3.q.out 
    [junit] Done query: unknown_function3.q
    [junit] Begin query: unknown_function4.q
    [junit] Loading data to table srcpart partition {ds=2008-04-08, hr=11}
    [junit] OK
    [junit] Loading data to table srcpart partition {ds=2008-04-08, hr=12}
    [junit] OK
    [junit] Loading data to table srcpart partition {ds=2008-04-09, hr=11}
    [junit] OK
    [junit] Loading data to table srcpart partition {ds=2008-04-09, hr=12}
    [junit] OK
    [junit] Loading data to table srcbucket
    [junit] OK
    [junit] Loading data to table srcbucket
    [junit] OK
    [junit] Loading data to table src
    [junit] OK
    [junit] Loading data to table src1
    [junit] OK
    [junit] Loading data to table src_sequencefile
    [junit] OK
    [junit] Loading data to table src_thrift
    [junit] OK
    [junit] Loading data to table src_json
    [junit] OK
    [junit] diff http://hudson.zones.apache.org/hudson/job/Hive-trunk-h0.18/ws/hive/build/ql/test/logs/negative/unknown_function4.q.out  http://hudson.zones.apache.org/hudson/job/Hive-trunk-h0.18/ws/hive/ql/src/test/results/compiler/errors/unknown_function4.q.out 
    [junit] Done query: unknown_function4.q
    [junit] Begin query: unknown_function5.q
    [junit] Loading data to table srcpart partition {ds=2008-04-08, hr=11}
    [junit] OK
    [junit] Loading data to table srcpart partition {ds=2008-04-08, hr=12}
    [junit] OK
    [junit] Loading data to table srcpart partition {ds=2008-04-09, hr=11}
    [junit] OK
    [junit] Loading data to table srcpart partition {ds=2008-04-09, hr=12}
    [junit] OK
    [junit] Loading data to table srcbucket
    [junit] OK
    [junit] Loading data to table srcbucket
    [junit] OK
    [junit] Loading data to table src
    [junit] OK
    [junit] Loading data to table src1
    [junit] OK
    [junit] Loading data to table src_sequencefile
    [junit] OK
    [junit] Loading data to table src_thrift
    [junit] OK
    [junit] Loading data to table src_json
    [junit] OK
    [junit] diff http://hudson.zones.apache.org/hudson/job/Hive-trunk-h0.18/ws/hive/build/ql/test/logs/negative/unknown_function5.q.out  http://hudson.zones.apache.org/hudson/job/Hive-trunk-h0.18/ws/hive/ql/src/test/results/compiler/errors/unknown_function5.q.out 
    [junit] Done query: unknown_function5.q
    [junit] Begin query: unknown_table1.q
    [junit] Loading data to table srcpart partition {ds=2008-04-08, hr=11}
    [junit] OK
    [junit] Loading data to table srcpart partition {ds=2008-04-08, hr=12}
    [junit] OK
    [junit] Loading data to table srcpart partition {ds=2008-04-09, hr=11}
    [junit] OK
    [junit] Loading data to table srcpart partition {ds=2008-04-09, hr=12}
    [junit] OK
    [junit] Loading data to table srcbucket
    [junit] OK
    [junit] Loading data to table srcbucket
    [junit] OK
    [junit] Loading data to table src
    [junit] OK
    [junit] Loading data to table src1
    [junit] OK
    [junit] Loading data to table src_sequencefile
    [junit] OK
    [junit] Loading data to table src_thrift
    [junit] OK
    [junit] Loading data to table src_json
    [junit] OK
    [junit] diff http://hudson.zones.apache.org/hudson/job/Hive-trunk-h0.18/ws/hive/build/ql/test/logs/negative/unknown_table1.q.out  http://hudson.zones.apache.org/hudson/job/Hive-trunk-h0.18/ws/hive/ql/src/test/results/compiler/errors/unknown_table1.q.out 
    [junit] Done query: unknown_table1.q
    [junit] Begin query: unknown_table2.q
    [junit] Loading data to table srcpart partition {ds=2008-04-08, hr=11}
    [junit] OK
    [junit] Loading data to table srcpart partition {ds=2008-04-08, hr=12}
    [junit] OK
    [junit] Loading data to table srcpart partition {ds=2008-04-09, hr=11}
    [junit] OK
    [junit] Loading data to table srcpart partition {ds=2008-04-09, hr=12}
    [junit] OK
    [junit] Loading data to table srcbucket
    [junit] OK
    [junit] Loading data to table srcbucket
    [junit] OK
    [junit] Loading data to table src
    [junit] OK
    [junit] Loading data to table src1
    [junit] OK
    [junit] Loading data to table src_sequencefile
    [junit] OK
    [junit] Loading data to table src_thrift
    [junit] OK
    [junit] Loading data to table src_json
    [junit] OK
    [junit] diff http://hudson.zones.apache.org/hudson/job/Hive-trunk-h0.18/ws/hive/build/ql/test/logs/negative/unknown_table2.q.out  http://hudson.zones.apache.org/hudson/job/Hive-trunk-h0.18/ws/hive/ql/src/test/results/compiler/errors/unknown_table2.q.out 
    [junit] Done query: unknown_table2.q
    [junit] Begin query: wrong_distinct1.q
    [junit] Loading data to table srcpart partition {ds=2008-04-08, hr=11}
    [junit] OK
    [junit] Loading data to table srcpart partition {ds=2008-04-08, hr=12}
    [junit] OK
    [junit] Loading data to table srcpart partition {ds=2008-04-09, hr=11}
    [junit] OK
    [junit] Loading data to table srcpart partition {ds=2008-04-09, hr=12}
    [junit] OK
    [junit] Loading data to table srcbucket
    [junit] OK
    [junit] Loading data to table srcbucket
    [junit] OK
    [junit] Loading data to table src
    [junit] OK
    [junit] Loading data to table src1
    [junit] OK
    [junit] Loading data to table src_sequencefile
    [junit] OK
    [junit] Loading data to table src_thrift
    [junit] OK
    [junit] Loading data to table src_json
    [junit] OK
    [junit] diff http://hudson.zones.apache.org/hudson/job/Hive-trunk-h0.18/ws/hive/build/ql/test/logs/negative/wrong_distinct1.q.out  http://hudson.zones.apache.org/hudson/job/Hive-trunk-h0.18/ws/hive/ql/src/test/results/compiler/errors/wrong_distinct1.q.out 
    [junit] Done query: wrong_distinct1.q
    [junit] Begin query: wrong_distinct2.q
    [junit] Loading data to table srcpart partition {ds=2008-04-08, hr=11}
    [junit] OK
    [junit] Loading data to table srcpart partition {ds=2008-04-08, hr=12}
    [junit] OK
    [junit] Loading data to table srcpart partition {ds=2008-04-09, hr=11}
    [junit] OK
    [junit] Loading data to table srcpart partition {ds=2008-04-09, hr=12}
    [junit] OK
    [junit] Loading data to table srcbucket
    [junit] OK
    [junit] Loading data to table srcbucket
    [junit] OK
    [junit] Loading data to table src
    [junit] OK
    [junit] Loading data to table src1
    [junit] OK
    [junit] Loading data to table src_sequencefile
    [junit] OK
    [junit] Loading data to table src_thrift
    [junit] OK
    [junit] Loading data to table src_json
    [junit] OK
    [junit] diff http://hudson.zones.apache.org/hudson/job/Hive-trunk-h0.18/ws/hive/build/ql/test/logs/negative/wrong_distinct2.q.out  http://hudson.zones.apache.org/hudson/job/Hive-trunk-h0.18/ws/hive/ql/src/test/results/compiler/errors/wrong_distinct2.q.out 
    [junit] Done query: wrong_distinct2.q
    [junit] Tests run: 33, Failures: 0, Errors: 0, Time elapsed: 43.023 sec
    [junit] Running org.apache.hadoop.hive.ql.plan.TestAddPartition
    [junit] Table doesnotexist does not exist
    [junit] Tests run: 1, Failures: 0, Errors: 0, Time elapsed: 4.628 sec
    [junit] Running org.apache.hadoop.hive.ql.tool.TestLineageInfo
    [junit] Tests run: 5, Failures: 0, Errors: 0, Time elapsed: 0.276 sec

BUILD FAILED
http://hudson.zones.apache.org/hudson/job/Hive-trunk-h0.18/ws/hive/build.xml :118: The following error occurred while executing this line:
http://hudson.zones.apache.org/hudson/job/Hive-trunk-h0.18/ws/hive/build.xml :73: The following error occurred while executing this line:
http://hudson.zones.apache.org/hudson/job/Hive-trunk-h0.18/ws/hive/build-common.xml :274: Tests failed!

Total time: 23 minutes 47 seconds
Recording test results


Build failed in Hudson: Hive-trunk-h0.18 #76

Posted by Apache Hudson Server <hu...@hudson.zones.apache.org>.
See http://hudson.zones.apache.org/hudson/job/Hive-trunk-h0.18/76/changes

Changes:

[zshao] HIVE-447. Fix tests on hudson. (Ashish Thusoo via zshao)

[athusoo] HIVE-395. Fix build problems with eclipse and 0.19 hadoop.
(Neil Conway via athusoo)

------------------------------------------
[...truncated 34928 lines...]
    [junit] Loading data to table src1
    [junit] OK
    [junit] Loading data to table src_sequencefile
    [junit] OK
    [junit] Loading data to table src_thrift
    [junit] OK
    [junit] Loading data to table src_json
    [junit] OK
    [junit] diff http://hudson.zones.apache.org/hudson/job/Hive-trunk-h0.18/ws/hive/build/ql/test/logs/negative/unknown_column6.q.out  http://hudson.zones.apache.org/hudson/job/Hive-trunk-h0.18/ws/hive/ql/src/test/results/compiler/errors/unknown_column6.q.out 
    [junit] Done query: unknown_column6.q
    [junit] Begin query: unknown_function1.q
    [junit] Loading data to table srcpart partition {ds=2008-04-08, hr=11}
    [junit] OK
    [junit] Loading data to table srcpart partition {ds=2008-04-08, hr=12}
    [junit] OK
    [junit] Loading data to table srcpart partition {ds=2008-04-09, hr=11}
    [junit] OK
    [junit] Loading data to table srcpart partition {ds=2008-04-09, hr=12}
    [junit] OK
    [junit] Loading data to table srcbucket
    [junit] OK
    [junit] Loading data to table srcbucket
    [junit] OK
    [junit] Loading data to table src
    [junit] OK
    [junit] Loading data to table src1
    [junit] OK
    [junit] Loading data to table src_sequencefile
    [junit] OK
    [junit] Loading data to table src_thrift
    [junit] OK
    [junit] Loading data to table src_json
    [junit] OK
    [junit] diff http://hudson.zones.apache.org/hudson/job/Hive-trunk-h0.18/ws/hive/build/ql/test/logs/negative/unknown_function1.q.out  http://hudson.zones.apache.org/hudson/job/Hive-trunk-h0.18/ws/hive/ql/src/test/results/compiler/errors/unknown_function1.q.out 
    [junit] Done query: unknown_function1.q
    [junit] Begin query: unknown_function2.q
    [junit] Loading data to table srcpart partition {ds=2008-04-08, hr=11}
    [junit] OK
    [junit] Loading data to table srcpart partition {ds=2008-04-08, hr=12}
    [junit] OK
    [junit] Loading data to table srcpart partition {ds=2008-04-09, hr=11}
    [junit] OK
    [junit] Loading data to table srcpart partition {ds=2008-04-09, hr=12}
    [junit] OK
    [junit] Loading data to table srcbucket
    [junit] OK
    [junit] Loading data to table srcbucket
    [junit] OK
    [junit] Loading data to table src
    [junit] OK
    [junit] Loading data to table src1
    [junit] OK
    [junit] Loading data to table src_sequencefile
    [junit] OK
    [junit] Loading data to table src_thrift
    [junit] OK
    [junit] Loading data to table src_json
    [junit] OK
    [junit] diff http://hudson.zones.apache.org/hudson/job/Hive-trunk-h0.18/ws/hive/build/ql/test/logs/negative/unknown_function2.q.out  http://hudson.zones.apache.org/hudson/job/Hive-trunk-h0.18/ws/hive/ql/src/test/results/compiler/errors/unknown_function2.q.out 
    [junit] Done query: unknown_function2.q
    [junit] Begin query: unknown_function3.q
    [junit] Loading data to table srcpart partition {ds=2008-04-08, hr=11}
    [junit] OK
    [junit] Loading data to table srcpart partition {ds=2008-04-08, hr=12}
    [junit] OK
    [junit] Loading data to table srcpart partition {ds=2008-04-09, hr=11}
    [junit] OK
    [junit] Loading data to table srcpart partition {ds=2008-04-09, hr=12}
    [junit] OK
    [junit] Loading data to table srcbucket
    [junit] OK
    [junit] Loading data to table srcbucket
    [junit] OK
    [junit] Loading data to table src
    [junit] OK
    [junit] Loading data to table src1
    [junit] OK
    [junit] Loading data to table src_sequencefile
    [junit] OK
    [junit] Loading data to table src_thrift
    [junit] OK
    [junit] Loading data to table src_json
    [junit] OK
    [junit] diff http://hudson.zones.apache.org/hudson/job/Hive-trunk-h0.18/ws/hive/build/ql/test/logs/negative/unknown_function3.q.out  http://hudson.zones.apache.org/hudson/job/Hive-trunk-h0.18/ws/hive/ql/src/test/results/compiler/errors/unknown_function3.q.out 
    [junit] Done query: unknown_function3.q
    [junit] Begin query: unknown_function4.q
    [junit] Loading data to table srcpart partition {ds=2008-04-08, hr=11}
    [junit] OK
    [junit] Loading data to table srcpart partition {ds=2008-04-08, hr=12}
    [junit] OK
    [junit] Loading data to table srcpart partition {ds=2008-04-09, hr=11}
    [junit] OK
    [junit] Loading data to table srcpart partition {ds=2008-04-09, hr=12}
    [junit] OK
    [junit] Loading data to table srcbucket
    [junit] OK
    [junit] Loading data to table srcbucket
    [junit] OK
    [junit] Loading data to table src
    [junit] OK
    [junit] Loading data to table src1
    [junit] OK
    [junit] Loading data to table src_sequencefile
    [junit] OK
    [junit] Loading data to table src_thrift
    [junit] OK
    [junit] Loading data to table src_json
    [junit] OK
    [junit] diff http://hudson.zones.apache.org/hudson/job/Hive-trunk-h0.18/ws/hive/build/ql/test/logs/negative/unknown_function4.q.out  http://hudson.zones.apache.org/hudson/job/Hive-trunk-h0.18/ws/hive/ql/src/test/results/compiler/errors/unknown_function4.q.out 
    [junit] Done query: unknown_function4.q
    [junit] Begin query: unknown_function5.q
    [junit] Loading data to table srcpart partition {ds=2008-04-08, hr=11}
    [junit] OK
    [junit] Loading data to table srcpart partition {ds=2008-04-08, hr=12}
    [junit] OK
    [junit] Loading data to table srcpart partition {ds=2008-04-09, hr=11}
    [junit] OK
    [junit] Loading data to table srcpart partition {ds=2008-04-09, hr=12}
    [junit] OK
    [junit] Loading data to table srcbucket
    [junit] OK
    [junit] Loading data to table srcbucket
    [junit] OK
    [junit] Loading data to table src
    [junit] OK
    [junit] Loading data to table src1
    [junit] OK
    [junit] Loading data to table src_sequencefile
    [junit] OK
    [junit] Loading data to table src_thrift
    [junit] OK
    [junit] Loading data to table src_json
    [junit] OK
    [junit] diff http://hudson.zones.apache.org/hudson/job/Hive-trunk-h0.18/ws/hive/build/ql/test/logs/negative/unknown_function5.q.out  http://hudson.zones.apache.org/hudson/job/Hive-trunk-h0.18/ws/hive/ql/src/test/results/compiler/errors/unknown_function5.q.out 
    [junit] Done query: unknown_function5.q
    [junit] Begin query: unknown_table1.q
    [junit] Loading data to table srcpart partition {ds=2008-04-08, hr=11}
    [junit] OK
    [junit] Loading data to table srcpart partition {ds=2008-04-08, hr=12}
    [junit] OK
    [junit] Loading data to table srcpart partition {ds=2008-04-09, hr=11}
    [junit] OK
    [junit] Loading data to table srcpart partition {ds=2008-04-09, hr=12}
    [junit] OK
    [junit] Loading data to table srcbucket
    [junit] OK
    [junit] Loading data to table srcbucket
    [junit] OK
    [junit] Loading data to table src
    [junit] OK
    [junit] Loading data to table src1
    [junit] OK
    [junit] Loading data to table src_sequencefile
    [junit] OK
    [junit] Loading data to table src_thrift
    [junit] OK
    [junit] Loading data to table src_json
    [junit] OK
    [junit] diff http://hudson.zones.apache.org/hudson/job/Hive-trunk-h0.18/ws/hive/build/ql/test/logs/negative/unknown_table1.q.out  http://hudson.zones.apache.org/hudson/job/Hive-trunk-h0.18/ws/hive/ql/src/test/results/compiler/errors/unknown_table1.q.out 
    [junit] Done query: unknown_table1.q
    [junit] Begin query: unknown_table2.q
    [junit] Loading data to table srcpart partition {ds=2008-04-08, hr=11}
    [junit] OK
    [junit] Loading data to table srcpart partition {ds=2008-04-08, hr=12}
    [junit] OK
    [junit] Loading data to table srcpart partition {ds=2008-04-09, hr=11}
    [junit] OK
    [junit] Loading data to table srcpart partition {ds=2008-04-09, hr=12}
    [junit] OK
    [junit] Loading data to table srcbucket
    [junit] OK
    [junit] Loading data to table srcbucket
    [junit] OK
    [junit] Loading data to table src
    [junit] OK
    [junit] Loading data to table src1
    [junit] OK
    [junit] Loading data to table src_sequencefile
    [junit] OK
    [junit] Loading data to table src_thrift
    [junit] OK
    [junit] Loading data to table src_json
    [junit] OK
    [junit] diff http://hudson.zones.apache.org/hudson/job/Hive-trunk-h0.18/ws/hive/build/ql/test/logs/negative/unknown_table2.q.out  http://hudson.zones.apache.org/hudson/job/Hive-trunk-h0.18/ws/hive/ql/src/test/results/compiler/errors/unknown_table2.q.out 
    [junit] Done query: unknown_table2.q
    [junit] Begin query: wrong_distinct1.q
    [junit] Loading data to table srcpart partition {ds=2008-04-08, hr=11}
    [junit] OK
    [junit] Loading data to table srcpart partition {ds=2008-04-08, hr=12}
    [junit] OK
    [junit] Loading data to table srcpart partition {ds=2008-04-09, hr=11}
    [junit] OK
    [junit] Loading data to table srcpart partition {ds=2008-04-09, hr=12}
    [junit] OK
    [junit] Loading data to table srcbucket
    [junit] OK
    [junit] Loading data to table srcbucket
    [junit] OK
    [junit] Loading data to table src
    [junit] OK
    [junit] Loading data to table src1
    [junit] OK
    [junit] Loading data to table src_sequencefile
    [junit] OK
    [junit] Loading data to table src_thrift
    [junit] OK
    [junit] Loading data to table src_json
    [junit] OK
    [junit] diff http://hudson.zones.apache.org/hudson/job/Hive-trunk-h0.18/ws/hive/build/ql/test/logs/negative/wrong_distinct1.q.out  http://hudson.zones.apache.org/hudson/job/Hive-trunk-h0.18/ws/hive/ql/src/test/results/compiler/errors/wrong_distinct1.q.out 
    [junit] Done query: wrong_distinct1.q
    [junit] Begin query: wrong_distinct2.q
    [junit] Loading data to table srcpart partition {ds=2008-04-08, hr=11}
    [junit] OK
    [junit] Loading data to table srcpart partition {ds=2008-04-08, hr=12}
    [junit] OK
    [junit] Loading data to table srcpart partition {ds=2008-04-09, hr=11}
    [junit] OK
    [junit] Loading data to table srcpart partition {ds=2008-04-09, hr=12}
    [junit] OK
    [junit] Loading data to table srcbucket
    [junit] OK
    [junit] Loading data to table srcbucket
    [junit] OK
    [junit] Loading data to table src
    [junit] OK
    [junit] Loading data to table src1
    [junit] OK
    [junit] Loading data to table src_sequencefile
    [junit] OK
    [junit] Loading data to table src_thrift
    [junit] OK
    [junit] Loading data to table src_json
    [junit] OK
    [junit] diff http://hudson.zones.apache.org/hudson/job/Hive-trunk-h0.18/ws/hive/build/ql/test/logs/negative/wrong_distinct2.q.out  http://hudson.zones.apache.org/hudson/job/Hive-trunk-h0.18/ws/hive/ql/src/test/results/compiler/errors/wrong_distinct2.q.out 
    [junit] Done query: wrong_distinct2.q
    [junit] Tests run: 33, Failures: 0, Errors: 0, Time elapsed: 42.75 sec
    [junit] Running org.apache.hadoop.hive.ql.plan.TestAddPartition
    [junit] Table doesnotexist does not exist
    [junit] Tests run: 1, Failures: 0, Errors: 0, Time elapsed: 4.61 sec
    [junit] Running org.apache.hadoop.hive.ql.tool.TestLineageInfo
    [junit] Tests run: 5, Failures: 0, Errors: 0, Time elapsed: 0.283 sec

BUILD FAILED
http://hudson.zones.apache.org/hudson/job/Hive-trunk-h0.18/ws/hive/build.xml :118: The following error occurred while executing this line:
http://hudson.zones.apache.org/hudson/job/Hive-trunk-h0.18/ws/hive/build.xml :73: The following error occurred while executing this line:
http://hudson.zones.apache.org/hudson/job/Hive-trunk-h0.18/ws/hive/build-common.xml :274: Tests failed!

Total time: 23 minutes 45 seconds
Recording test results


Build failed in Hudson: Hive-trunk-h0.18 #75

Posted by Apache Hudson Server <hu...@hudson.zones.apache.org>.
See http://hudson.zones.apache.org/hudson/job/Hive-trunk-h0.18/75/

------------------------------------------
[...truncated 34907 lines...]
    [junit] Loading data to table src1
    [junit] OK
    [junit] Loading data to table src_sequencefile
    [junit] OK
    [junit] Loading data to table src_thrift
    [junit] OK
    [junit] Loading data to table src_json
    [junit] OK
    [junit] diff http://hudson.zones.apache.org/hudson/job/Hive-trunk-h0.18/ws/hive/build/ql/test/logs/negative/unknown_column6.q.out  http://hudson.zones.apache.org/hudson/job/Hive-trunk-h0.18/ws/hive/ql/src/test/results/compiler/errors/unknown_column6.q.out 
    [junit] Done query: unknown_column6.q
    [junit] Begin query: unknown_function1.q
    [junit] Loading data to table srcpart partition {ds=2008-04-08, hr=11}
    [junit] OK
    [junit] Loading data to table srcpart partition {ds=2008-04-08, hr=12}
    [junit] OK
    [junit] Loading data to table srcpart partition {ds=2008-04-09, hr=11}
    [junit] OK
    [junit] Loading data to table srcpart partition {ds=2008-04-09, hr=12}
    [junit] OK
    [junit] Loading data to table srcbucket
    [junit] OK
    [junit] Loading data to table srcbucket
    [junit] OK
    [junit] Loading data to table src
    [junit] OK
    [junit] Loading data to table src1
    [junit] OK
    [junit] Loading data to table src_sequencefile
    [junit] OK
    [junit] Loading data to table src_thrift
    [junit] OK
    [junit] Loading data to table src_json
    [junit] OK
    [junit] diff http://hudson.zones.apache.org/hudson/job/Hive-trunk-h0.18/ws/hive/build/ql/test/logs/negative/unknown_function1.q.out  http://hudson.zones.apache.org/hudson/job/Hive-trunk-h0.18/ws/hive/ql/src/test/results/compiler/errors/unknown_function1.q.out 
    [junit] Done query: unknown_function1.q
    [junit] Begin query: unknown_function2.q
    [junit] Loading data to table srcpart partition {ds=2008-04-08, hr=11}
    [junit] OK
    [junit] Loading data to table srcpart partition {ds=2008-04-08, hr=12}
    [junit] OK
    [junit] Loading data to table srcpart partition {ds=2008-04-09, hr=11}
    [junit] OK
    [junit] Loading data to table srcpart partition {ds=2008-04-09, hr=12}
    [junit] OK
    [junit] Loading data to table srcbucket
    [junit] OK
    [junit] Loading data to table srcbucket
    [junit] OK
    [junit] Loading data to table src
    [junit] OK
    [junit] Loading data to table src1
    [junit] OK
    [junit] Loading data to table src_sequencefile
    [junit] OK
    [junit] Loading data to table src_thrift
    [junit] OK
    [junit] Loading data to table src_json
    [junit] OK
    [junit] diff http://hudson.zones.apache.org/hudson/job/Hive-trunk-h0.18/ws/hive/build/ql/test/logs/negative/unknown_function2.q.out  http://hudson.zones.apache.org/hudson/job/Hive-trunk-h0.18/ws/hive/ql/src/test/results/compiler/errors/unknown_function2.q.out 
    [junit] Done query: unknown_function2.q
    [junit] Begin query: unknown_function3.q
    [junit] Loading data to table srcpart partition {ds=2008-04-08, hr=11}
    [junit] OK
    [junit] Loading data to table srcpart partition {ds=2008-04-08, hr=12}
    [junit] OK
    [junit] Loading data to table srcpart partition {ds=2008-04-09, hr=11}
    [junit] OK
    [junit] Loading data to table srcpart partition {ds=2008-04-09, hr=12}
    [junit] OK
    [junit] Loading data to table srcbucket
    [junit] OK
    [junit] Loading data to table srcbucket
    [junit] OK
    [junit] Loading data to table src
    [junit] OK
    [junit] Loading data to table src1
    [junit] OK
    [junit] Loading data to table src_sequencefile
    [junit] OK
    [junit] Loading data to table src_thrift
    [junit] OK
    [junit] Loading data to table src_json
    [junit] OK
    [junit] diff http://hudson.zones.apache.org/hudson/job/Hive-trunk-h0.18/ws/hive/build/ql/test/logs/negative/unknown_function3.q.out  http://hudson.zones.apache.org/hudson/job/Hive-trunk-h0.18/ws/hive/ql/src/test/results/compiler/errors/unknown_function3.q.out 
    [junit] Done query: unknown_function3.q
    [junit] Begin query: unknown_function4.q
    [junit] Loading data to table srcpart partition {ds=2008-04-08, hr=11}
    [junit] OK
    [junit] Loading data to table srcpart partition {ds=2008-04-08, hr=12}
    [junit] OK
    [junit] Loading data to table srcpart partition {ds=2008-04-09, hr=11}
    [junit] OK
    [junit] Loading data to table srcpart partition {ds=2008-04-09, hr=12}
    [junit] OK
    [junit] Loading data to table srcbucket
    [junit] OK
    [junit] Loading data to table srcbucket
    [junit] OK
    [junit] Loading data to table src
    [junit] OK
    [junit] Loading data to table src1
    [junit] OK
    [junit] Loading data to table src_sequencefile
    [junit] OK
    [junit] Loading data to table src_thrift
    [junit] OK
    [junit] Loading data to table src_json
    [junit] OK
    [junit] diff http://hudson.zones.apache.org/hudson/job/Hive-trunk-h0.18/ws/hive/build/ql/test/logs/negative/unknown_function4.q.out  http://hudson.zones.apache.org/hudson/job/Hive-trunk-h0.18/ws/hive/ql/src/test/results/compiler/errors/unknown_function4.q.out 
    [junit] Done query: unknown_function4.q
    [junit] Begin query: unknown_function5.q
    [junit] Loading data to table srcpart partition {ds=2008-04-08, hr=11}
    [junit] OK
    [junit] Loading data to table srcpart partition {ds=2008-04-08, hr=12}
    [junit] OK
    [junit] Loading data to table srcpart partition {ds=2008-04-09, hr=11}
    [junit] OK
    [junit] Loading data to table srcpart partition {ds=2008-04-09, hr=12}
    [junit] OK
    [junit] Loading data to table srcbucket
    [junit] OK
    [junit] Loading data to table srcbucket
    [junit] OK
    [junit] Loading data to table src
    [junit] OK
    [junit] Loading data to table src1
    [junit] OK
    [junit] Loading data to table src_sequencefile
    [junit] OK
    [junit] Loading data to table src_thrift
    [junit] OK
    [junit] Loading data to table src_json
    [junit] OK
    [junit] diff http://hudson.zones.apache.org/hudson/job/Hive-trunk-h0.18/ws/hive/build/ql/test/logs/negative/unknown_function5.q.out  http://hudson.zones.apache.org/hudson/job/Hive-trunk-h0.18/ws/hive/ql/src/test/results/compiler/errors/unknown_function5.q.out 
    [junit] Done query: unknown_function5.q
    [junit] Begin query: unknown_table1.q
    [junit] Loading data to table srcpart partition {ds=2008-04-08, hr=11}
    [junit] OK
    [junit] Loading data to table srcpart partition {ds=2008-04-08, hr=12}
    [junit] OK
    [junit] Loading data to table srcpart partition {ds=2008-04-09, hr=11}
    [junit] OK
    [junit] Loading data to table srcpart partition {ds=2008-04-09, hr=12}
    [junit] OK
    [junit] Loading data to table srcbucket
    [junit] OK
    [junit] Loading data to table srcbucket
    [junit] OK
    [junit] Loading data to table src
    [junit] OK
    [junit] Loading data to table src1
    [junit] OK
    [junit] Loading data to table src_sequencefile
    [junit] OK
    [junit] Loading data to table src_thrift
    [junit] OK
    [junit] Loading data to table src_json
    [junit] OK
    [junit] diff http://hudson.zones.apache.org/hudson/job/Hive-trunk-h0.18/ws/hive/build/ql/test/logs/negative/unknown_table1.q.out  http://hudson.zones.apache.org/hudson/job/Hive-trunk-h0.18/ws/hive/ql/src/test/results/compiler/errors/unknown_table1.q.out 
    [junit] Done query: unknown_table1.q
    [junit] Begin query: unknown_table2.q
    [junit] Loading data to table srcpart partition {ds=2008-04-08, hr=11}
    [junit] OK
    [junit] Loading data to table srcpart partition {ds=2008-04-08, hr=12}
    [junit] OK
    [junit] Loading data to table srcpart partition {ds=2008-04-09, hr=11}
    [junit] OK
    [junit] Loading data to table srcpart partition {ds=2008-04-09, hr=12}
    [junit] OK
    [junit] Loading data to table srcbucket
    [junit] OK
    [junit] Loading data to table srcbucket
    [junit] OK
    [junit] Loading data to table src
    [junit] OK
    [junit] Loading data to table src1
    [junit] OK
    [junit] Loading data to table src_sequencefile
    [junit] OK
    [junit] Loading data to table src_thrift
    [junit] OK
    [junit] Loading data to table src_json
    [junit] OK
    [junit] diff http://hudson.zones.apache.org/hudson/job/Hive-trunk-h0.18/ws/hive/build/ql/test/logs/negative/unknown_table2.q.out  http://hudson.zones.apache.org/hudson/job/Hive-trunk-h0.18/ws/hive/ql/src/test/results/compiler/errors/unknown_table2.q.out 
    [junit] Done query: unknown_table2.q
    [junit] Begin query: wrong_distinct1.q
    [junit] Loading data to table srcpart partition {ds=2008-04-08, hr=11}
    [junit] OK
    [junit] Loading data to table srcpart partition {ds=2008-04-08, hr=12}
    [junit] OK
    [junit] Loading data to table srcpart partition {ds=2008-04-09, hr=11}
    [junit] OK
    [junit] Loading data to table srcpart partition {ds=2008-04-09, hr=12}
    [junit] OK
    [junit] Loading data to table srcbucket
    [junit] OK
    [junit] Loading data to table srcbucket
    [junit] OK
    [junit] Loading data to table src
    [junit] OK
    [junit] Loading data to table src1
    [junit] OK
    [junit] Loading data to table src_sequencefile
    [junit] OK
    [junit] Loading data to table src_thrift
    [junit] OK
    [junit] Loading data to table src_json
    [junit] OK
    [junit] diff http://hudson.zones.apache.org/hudson/job/Hive-trunk-h0.18/ws/hive/build/ql/test/logs/negative/wrong_distinct1.q.out  http://hudson.zones.apache.org/hudson/job/Hive-trunk-h0.18/ws/hive/ql/src/test/results/compiler/errors/wrong_distinct1.q.out 
    [junit] Done query: wrong_distinct1.q
    [junit] Begin query: wrong_distinct2.q
    [junit] Loading data to table srcpart partition {ds=2008-04-08, hr=11}
    [junit] OK
    [junit] Loading data to table srcpart partition {ds=2008-04-08, hr=12}
    [junit] OK
    [junit] Loading data to table srcpart partition {ds=2008-04-09, hr=11}
    [junit] OK
    [junit] Loading data to table srcpart partition {ds=2008-04-09, hr=12}
    [junit] OK
    [junit] Loading data to table srcbucket
    [junit] OK
    [junit] Loading data to table srcbucket
    [junit] OK
    [junit] Loading data to table src
    [junit] OK
    [junit] Loading data to table src1
    [junit] OK
    [junit] Loading data to table src_sequencefile
    [junit] OK
    [junit] Loading data to table src_thrift
    [junit] OK
    [junit] Loading data to table src_json
    [junit] OK
    [junit] diff http://hudson.zones.apache.org/hudson/job/Hive-trunk-h0.18/ws/hive/build/ql/test/logs/negative/wrong_distinct2.q.out  http://hudson.zones.apache.org/hudson/job/Hive-trunk-h0.18/ws/hive/ql/src/test/results/compiler/errors/wrong_distinct2.q.out 
    [junit] Done query: wrong_distinct2.q
    [junit] Tests run: 33, Failures: 0, Errors: 0, Time elapsed: 43.06 sec
    [junit] Running org.apache.hadoop.hive.ql.plan.TestAddPartition
    [junit] Table doesnotexist does not exist
    [junit] Tests run: 1, Failures: 0, Errors: 0, Time elapsed: 4.651 sec
    [junit] Running org.apache.hadoop.hive.ql.tool.TestLineageInfo
    [junit] Tests run: 5, Failures: 0, Errors: 0, Time elapsed: 0.277 sec

BUILD FAILED
http://hudson.zones.apache.org/hudson/job/Hive-trunk-h0.18/ws/hive/build.xml :118: The following error occurred while executing this line:
http://hudson.zones.apache.org/hudson/job/Hive-trunk-h0.18/ws/hive/build.xml :73: The following error occurred while executing this line:
http://hudson.zones.apache.org/hudson/job/Hive-trunk-h0.18/ws/hive/build-common.xml :274: Tests failed!

Total time: 23 minutes 38 seconds
Recording test results


Build failed in Hudson: Hive-trunk-h0.18 #74

Posted by Apache Hudson Server <hu...@hudson.zones.apache.org>.
See http://hudson.zones.apache.org/hudson/job/Hive-trunk-h0.18/74/changes

Changes:

[zshao] HIVE-442. Move the data before creating the partition. (Prasad Chakka via zshao)

[zshao] HIVE-324. Fix AccessControlException when loading data. (Ashish Thusoo via zshao)

[johan] HIVE-433. Fixed union18 and union19 tests. (athusoo via johan)

[zshao] HIVE-376. In strict mode do not allow join without "ON" condition. (Namit Jain via zshao)

[zshao] HIVE-250. Shared memory java dbm for map-side joins. (Joydeep Sen Sarma via zshao)

[namit] HIVE-366. testParse should not depend on a static field
(Zheng Shao via namit)

[namit] HIVE-437. Allow both table.name and col.field
(Zheng Shao via namit)

------------------------------------------
[...truncated 34903 lines...]
    [junit] Loading data to table src1
    [junit] OK
    [junit] Loading data to table src_sequencefile
    [junit] OK
    [junit] Loading data to table src_thrift
    [junit] OK
    [junit] Loading data to table src_json
    [junit] OK
    [junit] diff http://hudson.zones.apache.org/hudson/job/Hive-trunk-h0.18/ws/hive/build/ql/test/logs/negative/unknown_column6.q.out  http://hudson.zones.apache.org/hudson/job/Hive-trunk-h0.18/ws/hive/ql/src/test/results/compiler/errors/unknown_column6.q.out 
    [junit] Done query: unknown_column6.q
    [junit] Begin query: unknown_function1.q
    [junit] Loading data to table srcpart partition {ds=2008-04-08, hr=11}
    [junit] OK
    [junit] Loading data to table srcpart partition {ds=2008-04-08, hr=12}
    [junit] OK
    [junit] Loading data to table srcpart partition {ds=2008-04-09, hr=11}
    [junit] OK
    [junit] Loading data to table srcpart partition {ds=2008-04-09, hr=12}
    [junit] OK
    [junit] Loading data to table srcbucket
    [junit] OK
    [junit] Loading data to table srcbucket
    [junit] OK
    [junit] Loading data to table src
    [junit] OK
    [junit] Loading data to table src1
    [junit] OK
    [junit] Loading data to table src_sequencefile
    [junit] OK
    [junit] Loading data to table src_thrift
    [junit] OK
    [junit] Loading data to table src_json
    [junit] OK
    [junit] diff http://hudson.zones.apache.org/hudson/job/Hive-trunk-h0.18/ws/hive/build/ql/test/logs/negative/unknown_function1.q.out  http://hudson.zones.apache.org/hudson/job/Hive-trunk-h0.18/ws/hive/ql/src/test/results/compiler/errors/unknown_function1.q.out 
    [junit] Done query: unknown_function1.q
    [junit] Begin query: unknown_function2.q
    [junit] Loading data to table srcpart partition {ds=2008-04-08, hr=11}
    [junit] OK
    [junit] Loading data to table srcpart partition {ds=2008-04-08, hr=12}
    [junit] OK
    [junit] Loading data to table srcpart partition {ds=2008-04-09, hr=11}
    [junit] OK
    [junit] Loading data to table srcpart partition {ds=2008-04-09, hr=12}
    [junit] OK
    [junit] Loading data to table srcbucket
    [junit] OK
    [junit] Loading data to table srcbucket
    [junit] OK
    [junit] Loading data to table src
    [junit] OK
    [junit] Loading data to table src1
    [junit] OK
    [junit] Loading data to table src_sequencefile
    [junit] OK
    [junit] Loading data to table src_thrift
    [junit] OK
    [junit] Loading data to table src_json
    [junit] OK
    [junit] diff http://hudson.zones.apache.org/hudson/job/Hive-trunk-h0.18/ws/hive/build/ql/test/logs/negative/unknown_function2.q.out  http://hudson.zones.apache.org/hudson/job/Hive-trunk-h0.18/ws/hive/ql/src/test/results/compiler/errors/unknown_function2.q.out 
    [junit] Done query: unknown_function2.q
    [junit] Begin query: unknown_function3.q
    [junit] Loading data to table srcpart partition {ds=2008-04-08, hr=11}
    [junit] OK
    [junit] Loading data to table srcpart partition {ds=2008-04-08, hr=12}
    [junit] OK
    [junit] Loading data to table srcpart partition {ds=2008-04-09, hr=11}
    [junit] OK
    [junit] Loading data to table srcpart partition {ds=2008-04-09, hr=12}
    [junit] OK
    [junit] Loading data to table srcbucket
    [junit] OK
    [junit] Loading data to table srcbucket
    [junit] OK
    [junit] Loading data to table src
    [junit] OK
    [junit] Loading data to table src1
    [junit] OK
    [junit] Loading data to table src_sequencefile
    [junit] OK
    [junit] Loading data to table src_thrift
    [junit] OK
    [junit] Loading data to table src_json
    [junit] OK
    [junit] diff http://hudson.zones.apache.org/hudson/job/Hive-trunk-h0.18/ws/hive/build/ql/test/logs/negative/unknown_function3.q.out  http://hudson.zones.apache.org/hudson/job/Hive-trunk-h0.18/ws/hive/ql/src/test/results/compiler/errors/unknown_function3.q.out 
    [junit] Done query: unknown_function3.q
    [junit] Begin query: unknown_function4.q
    [junit] Loading data to table srcpart partition {ds=2008-04-08, hr=11}
    [junit] OK
    [junit] Loading data to table srcpart partition {ds=2008-04-08, hr=12}
    [junit] OK
    [junit] Loading data to table srcpart partition {ds=2008-04-09, hr=11}
    [junit] OK
    [junit] Loading data to table srcpart partition {ds=2008-04-09, hr=12}
    [junit] OK
    [junit] Loading data to table srcbucket
    [junit] OK
    [junit] Loading data to table srcbucket
    [junit] OK
    [junit] Loading data to table src
    [junit] OK
    [junit] Loading data to table src1
    [junit] OK
    [junit] Loading data to table src_sequencefile
    [junit] OK
    [junit] Loading data to table src_thrift
    [junit] OK
    [junit] Loading data to table src_json
    [junit] OK
    [junit] diff http://hudson.zones.apache.org/hudson/job/Hive-trunk-h0.18/ws/hive/build/ql/test/logs/negative/unknown_function4.q.out  http://hudson.zones.apache.org/hudson/job/Hive-trunk-h0.18/ws/hive/ql/src/test/results/compiler/errors/unknown_function4.q.out 
    [junit] Done query: unknown_function4.q
    [junit] Begin query: unknown_function5.q
    [junit] Loading data to table srcpart partition {ds=2008-04-08, hr=11}
    [junit] OK
    [junit] Loading data to table srcpart partition {ds=2008-04-08, hr=12}
    [junit] OK
    [junit] Loading data to table srcpart partition {ds=2008-04-09, hr=11}
    [junit] OK
    [junit] Loading data to table srcpart partition {ds=2008-04-09, hr=12}
    [junit] OK
    [junit] Loading data to table srcbucket
    [junit] OK
    [junit] Loading data to table srcbucket
    [junit] OK
    [junit] Loading data to table src
    [junit] OK
    [junit] Loading data to table src1
    [junit] OK
    [junit] Loading data to table src_sequencefile
    [junit] OK
    [junit] Loading data to table src_thrift
    [junit] OK
    [junit] Loading data to table src_json
    [junit] OK
    [junit] diff http://hudson.zones.apache.org/hudson/job/Hive-trunk-h0.18/ws/hive/build/ql/test/logs/negative/unknown_function5.q.out  http://hudson.zones.apache.org/hudson/job/Hive-trunk-h0.18/ws/hive/ql/src/test/results/compiler/errors/unknown_function5.q.out 
    [junit] Done query: unknown_function5.q
    [junit] Begin query: unknown_table1.q
    [junit] Loading data to table srcpart partition {ds=2008-04-08, hr=11}
    [junit] OK
    [junit] Loading data to table srcpart partition {ds=2008-04-08, hr=12}
    [junit] OK
    [junit] Loading data to table srcpart partition {ds=2008-04-09, hr=11}
    [junit] OK
    [junit] Loading data to table srcpart partition {ds=2008-04-09, hr=12}
    [junit] OK
    [junit] Loading data to table srcbucket
    [junit] OK
    [junit] Loading data to table srcbucket
    [junit] OK
    [junit] Loading data to table src
    [junit] OK
    [junit] Loading data to table src1
    [junit] OK
    [junit] Loading data to table src_sequencefile
    [junit] OK
    [junit] Loading data to table src_thrift
    [junit] OK
    [junit] Loading data to table src_json
    [junit] OK
    [junit] diff http://hudson.zones.apache.org/hudson/job/Hive-trunk-h0.18/ws/hive/build/ql/test/logs/negative/unknown_table1.q.out  http://hudson.zones.apache.org/hudson/job/Hive-trunk-h0.18/ws/hive/ql/src/test/results/compiler/errors/unknown_table1.q.out 
    [junit] Done query: unknown_table1.q
    [junit] Begin query: unknown_table2.q
    [junit] Loading data to table srcpart partition {ds=2008-04-08, hr=11}
    [junit] OK
    [junit] Loading data to table srcpart partition {ds=2008-04-08, hr=12}
    [junit] OK
    [junit] Loading data to table srcpart partition {ds=2008-04-09, hr=11}
    [junit] OK
    [junit] Loading data to table srcpart partition {ds=2008-04-09, hr=12}
    [junit] OK
    [junit] Loading data to table srcbucket
    [junit] OK
    [junit] Loading data to table srcbucket
    [junit] OK
    [junit] Loading data to table src
    [junit] OK
    [junit] Loading data to table src1
    [junit] OK
    [junit] Loading data to table src_sequencefile
    [junit] OK
    [junit] Loading data to table src_thrift
    [junit] OK
    [junit] Loading data to table src_json
    [junit] OK
    [junit] diff http://hudson.zones.apache.org/hudson/job/Hive-trunk-h0.18/ws/hive/build/ql/test/logs/negative/unknown_table2.q.out  http://hudson.zones.apache.org/hudson/job/Hive-trunk-h0.18/ws/hive/ql/src/test/results/compiler/errors/unknown_table2.q.out 
    [junit] Done query: unknown_table2.q
    [junit] Begin query: wrong_distinct1.q
    [junit] Loading data to table srcpart partition {ds=2008-04-08, hr=11}
    [junit] OK
    [junit] Loading data to table srcpart partition {ds=2008-04-08, hr=12}
    [junit] OK
    [junit] Loading data to table srcpart partition {ds=2008-04-09, hr=11}
    [junit] OK
    [junit] Loading data to table srcpart partition {ds=2008-04-09, hr=12}
    [junit] OK
    [junit] Loading data to table srcbucket
    [junit] OK
    [junit] Loading data to table srcbucket
    [junit] OK
    [junit] Loading data to table src
    [junit] OK
    [junit] Loading data to table src1
    [junit] OK
    [junit] Loading data to table src_sequencefile
    [junit] OK
    [junit] Loading data to table src_thrift
    [junit] OK
    [junit] Loading data to table src_json
    [junit] OK
    [junit] diff http://hudson.zones.apache.org/hudson/job/Hive-trunk-h0.18/ws/hive/build/ql/test/logs/negative/wrong_distinct1.q.out  http://hudson.zones.apache.org/hudson/job/Hive-trunk-h0.18/ws/hive/ql/src/test/results/compiler/errors/wrong_distinct1.q.out 
    [junit] Done query: wrong_distinct1.q
    [junit] Begin query: wrong_distinct2.q
    [junit] Loading data to table srcpart partition {ds=2008-04-08, hr=11}
    [junit] OK
    [junit] Loading data to table srcpart partition {ds=2008-04-08, hr=12}
    [junit] OK
    [junit] Loading data to table srcpart partition {ds=2008-04-09, hr=11}
    [junit] OK
    [junit] Loading data to table srcpart partition {ds=2008-04-09, hr=12}
    [junit] OK
    [junit] Loading data to table srcbucket
    [junit] OK
    [junit] Loading data to table srcbucket
    [junit] OK
    [junit] Loading data to table src
    [junit] OK
    [junit] Loading data to table src1
    [junit] OK
    [junit] Loading data to table src_sequencefile
    [junit] OK
    [junit] Loading data to table src_thrift
    [junit] OK
    [junit] Loading data to table src_json
    [junit] OK
    [junit] diff http://hudson.zones.apache.org/hudson/job/Hive-trunk-h0.18/ws/hive/build/ql/test/logs/negative/wrong_distinct2.q.out  http://hudson.zones.apache.org/hudson/job/Hive-trunk-h0.18/ws/hive/ql/src/test/results/compiler/errors/wrong_distinct2.q.out 
    [junit] Done query: wrong_distinct2.q
    [junit] Tests run: 33, Failures: 0, Errors: 0, Time elapsed: 43.124 sec
    [junit] Running org.apache.hadoop.hive.ql.plan.TestAddPartition
    [junit] Table doesnotexist does not exist
    [junit] Tests run: 1, Failures: 0, Errors: 0, Time elapsed: 4.747 sec
    [junit] Running org.apache.hadoop.hive.ql.tool.TestLineageInfo
    [junit] Tests run: 5, Failures: 0, Errors: 0, Time elapsed: 0.276 sec

BUILD FAILED
http://hudson.zones.apache.org/hudson/job/Hive-trunk-h0.18/ws/hive/build.xml :118: The following error occurred while executing this line:
http://hudson.zones.apache.org/hudson/job/Hive-trunk-h0.18/ws/hive/build.xml :73: The following error occurred while executing this line:
http://hudson.zones.apache.org/hudson/job/Hive-trunk-h0.18/ws/hive/build-common.xml :274: Tests failed!

Total time: 23 minutes 39 seconds
Recording test results


Build failed in Hudson: Hive-trunk-h0.18 #73

Posted by Apache Hudson Server <hu...@hudson.zones.apache.org>.
See http://hudson.zones.apache.org/hudson/job/Hive-trunk-h0.18/73/changes

Changes:

[zshao] HIVE-440. Reducer and Join to print out number of rows processed. (Namit Jain via zshao)

------------------------------------------
[...truncated 31718 lines...]
    [junit] Loading data to table srcpart partition {ds=2008-04-08, hr=12}
    [junit] OK
    [junit] Loading data to table srcpart partition {ds=2008-04-09, hr=11}
    [junit] OK
    [junit] Loading data to table srcpart partition {ds=2008-04-09, hr=12}
    [junit] OK
    [junit] Loading data to table srcbucket
    [junit] OK
    [junit] Loading data to table srcbucket
    [junit] OK
    [junit] Loading data to table src
    [junit] OK
    [junit] diff http://hudson.zones.apache.org/hudson/job/Hive-trunk-h0.18/ws/hive/build/ql/test/logs/negative/unknown_column2.q.out  http://hudson.zones.apache.org/hudson/job/Hive-trunk-h0.18/ws/hive/ql/src/test/results/compiler/errors/unknown_column2.q.out 
    [junit] Done query: unknown_column2.q
    [junit] Begin query: unknown_column3.q
    [junit] Loading data to table srcpart partition {ds=2008-04-08, hr=11}
    [junit] OK
    [junit] Loading data to table srcpart partition {ds=2008-04-08, hr=12}
    [junit] OK
    [junit] Loading data to table srcpart partition {ds=2008-04-09, hr=11}
    [junit] OK
    [junit] Loading data to table srcpart partition {ds=2008-04-09, hr=12}
    [junit] OK
    [junit] Loading data to table srcbucket
    [junit] OK
    [junit] Loading data to table srcbucket
    [junit] OK
    [junit] Loading data to table src
    [junit] OK
    [junit] diff http://hudson.zones.apache.org/hudson/job/Hive-trunk-h0.18/ws/hive/build/ql/test/logs/negative/unknown_column3.q.out  http://hudson.zones.apache.org/hudson/job/Hive-trunk-h0.18/ws/hive/ql/src/test/results/compiler/errors/unknown_column3.q.out 
    [junit] Done query: unknown_column3.q
    [junit] Begin query: unknown_column4.q
    [junit] Loading data to table srcpart partition {ds=2008-04-08, hr=11}
    [junit] OK
    [junit] Loading data to table srcpart partition {ds=2008-04-08, hr=12}
    [junit] OK
    [junit] Loading data to table srcpart partition {ds=2008-04-09, hr=11}
    [junit] OK
    [junit] Loading data to table srcpart partition {ds=2008-04-09, hr=12}
    [junit] OK
    [junit] Loading data to table srcbucket
    [junit] OK
    [junit] Loading data to table srcbucket
    [junit] OK
    [junit] Loading data to table src
    [junit] OK
    [junit] diff http://hudson.zones.apache.org/hudson/job/Hive-trunk-h0.18/ws/hive/build/ql/test/logs/negative/unknown_column4.q.out  http://hudson.zones.apache.org/hudson/job/Hive-trunk-h0.18/ws/hive/ql/src/test/results/compiler/errors/unknown_column4.q.out 
    [junit] Done query: unknown_column4.q
    [junit] Begin query: unknown_column5.q
    [junit] Loading data to table srcpart partition {ds=2008-04-08, hr=11}
    [junit] OK
    [junit] Loading data to table srcpart partition {ds=2008-04-08, hr=12}
    [junit] OK
    [junit] Loading data to table srcpart partition {ds=2008-04-09, hr=11}
    [junit] OK
    [junit] Loading data to table srcpart partition {ds=2008-04-09, hr=12}
    [junit] OK
    [junit] Loading data to table srcbucket
    [junit] OK
    [junit] Loading data to table srcbucket
    [junit] OK
    [junit] Loading data to table src
    [junit] OK
    [junit] diff http://hudson.zones.apache.org/hudson/job/Hive-trunk-h0.18/ws/hive/build/ql/test/logs/negative/unknown_column5.q.out  http://hudson.zones.apache.org/hudson/job/Hive-trunk-h0.18/ws/hive/ql/src/test/results/compiler/errors/unknown_column5.q.out 
    [junit] Done query: unknown_column5.q
    [junit] Begin query: unknown_column6.q
    [junit] Loading data to table srcpart partition {ds=2008-04-08, hr=11}
    [junit] OK
    [junit] Loading data to table srcpart partition {ds=2008-04-08, hr=12}
    [junit] OK
    [junit] Loading data to table srcpart partition {ds=2008-04-09, hr=11}
    [junit] OK
    [junit] Loading data to table srcpart partition {ds=2008-04-09, hr=12}
    [junit] OK
    [junit] Loading data to table srcbucket
    [junit] OK
    [junit] Loading data to table srcbucket
    [junit] OK
    [junit] Loading data to table src
    [junit] OK
    [junit] diff http://hudson.zones.apache.org/hudson/job/Hive-trunk-h0.18/ws/hive/build/ql/test/logs/negative/unknown_column6.q.out  http://hudson.zones.apache.org/hudson/job/Hive-trunk-h0.18/ws/hive/ql/src/test/results/compiler/errors/unknown_column6.q.out 
    [junit] Done query: unknown_column6.q
    [junit] Begin query: unknown_function1.q
    [junit] Loading data to table srcpart partition {ds=2008-04-08, hr=11}
    [junit] OK
    [junit] Loading data to table srcpart partition {ds=2008-04-08, hr=12}
    [junit] OK
    [junit] Loading data to table srcpart partition {ds=2008-04-09, hr=11}
    [junit] OK
    [junit] Loading data to table srcpart partition {ds=2008-04-09, hr=12}
    [junit] OK
    [junit] Loading data to table srcbucket
    [junit] OK
    [junit] Loading data to table srcbucket
    [junit] OK
    [junit] Loading data to table src
    [junit] OK
    [junit] diff http://hudson.zones.apache.org/hudson/job/Hive-trunk-h0.18/ws/hive/build/ql/test/logs/negative/unknown_function1.q.out  http://hudson.zones.apache.org/hudson/job/Hive-trunk-h0.18/ws/hive/ql/src/test/results/compiler/errors/unknown_function1.q.out 
    [junit] Done query: unknown_function1.q
    [junit] Begin query: unknown_function2.q
    [junit] Loading data to table srcpart partition {ds=2008-04-08, hr=11}
    [junit] OK
    [junit] Loading data to table srcpart partition {ds=2008-04-08, hr=12}
    [junit] OK
    [junit] Loading data to table srcpart partition {ds=2008-04-09, hr=11}
    [junit] OK
    [junit] Loading data to table srcpart partition {ds=2008-04-09, hr=12}
    [junit] OK
    [junit] Loading data to table srcbucket
    [junit] OK
    [junit] Loading data to table srcbucket
    [junit] OK
    [junit] Loading data to table src
    [junit] OK
    [junit] diff http://hudson.zones.apache.org/hudson/job/Hive-trunk-h0.18/ws/hive/build/ql/test/logs/negative/unknown_function2.q.out  http://hudson.zones.apache.org/hudson/job/Hive-trunk-h0.18/ws/hive/ql/src/test/results/compiler/errors/unknown_function2.q.out 
    [junit] Done query: unknown_function2.q
    [junit] Begin query: unknown_function3.q
    [junit] Loading data to table srcpart partition {ds=2008-04-08, hr=11}
    [junit] OK
    [junit] Loading data to table srcpart partition {ds=2008-04-08, hr=12}
    [junit] OK
    [junit] Loading data to table srcpart partition {ds=2008-04-09, hr=11}
    [junit] OK
    [junit] Loading data to table srcpart partition {ds=2008-04-09, hr=12}
    [junit] OK
    [junit] Loading data to table srcbucket
    [junit] OK
    [junit] Loading data to table srcbucket
    [junit] OK
    [junit] Loading data to table src
    [junit] OK
    [junit] diff http://hudson.zones.apache.org/hudson/job/Hive-trunk-h0.18/ws/hive/build/ql/test/logs/negative/unknown_function3.q.out  http://hudson.zones.apache.org/hudson/job/Hive-trunk-h0.18/ws/hive/ql/src/test/results/compiler/errors/unknown_function3.q.out 
    [junit] Done query: unknown_function3.q
    [junit] Begin query: unknown_function4.q
    [junit] Loading data to table srcpart partition {ds=2008-04-08, hr=11}
    [junit] OK
    [junit] Loading data to table srcpart partition {ds=2008-04-08, hr=12}
    [junit] OK
    [junit] Loading data to table srcpart partition {ds=2008-04-09, hr=11}
    [junit] OK
    [junit] Loading data to table srcpart partition {ds=2008-04-09, hr=12}
    [junit] OK
    [junit] Loading data to table srcbucket
    [junit] OK
    [junit] Loading data to table srcbucket
    [junit] OK
    [junit] Loading data to table src
    [junit] OK
    [junit] diff http://hudson.zones.apache.org/hudson/job/Hive-trunk-h0.18/ws/hive/build/ql/test/logs/negative/unknown_function4.q.out  http://hudson.zones.apache.org/hudson/job/Hive-trunk-h0.18/ws/hive/ql/src/test/results/compiler/errors/unknown_function4.q.out 
    [junit] Done query: unknown_function4.q
    [junit] Begin query: unknown_function5.q
    [junit] Loading data to table srcpart partition {ds=2008-04-08, hr=11}
    [junit] OK
    [junit] Loading data to table srcpart partition {ds=2008-04-08, hr=12}
    [junit] OK
    [junit] Loading data to table srcpart partition {ds=2008-04-09, hr=11}
    [junit] OK
    [junit] Loading data to table srcpart partition {ds=2008-04-09, hr=12}
    [junit] OK
    [junit] Loading data to table srcbucket
    [junit] OK
    [junit] Loading data to table srcbucket
    [junit] OK
    [junit] Loading data to table src
    [junit] OK
    [junit] diff http://hudson.zones.apache.org/hudson/job/Hive-trunk-h0.18/ws/hive/build/ql/test/logs/negative/unknown_function5.q.out  http://hudson.zones.apache.org/hudson/job/Hive-trunk-h0.18/ws/hive/ql/src/test/results/compiler/errors/unknown_function5.q.out 
    [junit] Done query: unknown_function5.q
    [junit] Begin query: unknown_table1.q
    [junit] Loading data to table srcpart partition {ds=2008-04-08, hr=11}
    [junit] OK
    [junit] Loading data to table srcpart partition {ds=2008-04-08, hr=12}
    [junit] OK
    [junit] Loading data to table srcpart partition {ds=2008-04-09, hr=11}
    [junit] OK
    [junit] Loading data to table srcpart partition {ds=2008-04-09, hr=12}
    [junit] OK
    [junit] Loading data to table srcbucket
    [junit] OK
    [junit] Loading data to table srcbucket
    [junit] OK
    [junit] Loading data to table src
    [junit] OK
    [junit] diff http://hudson.zones.apache.org/hudson/job/Hive-trunk-h0.18/ws/hive/build/ql/test/logs/negative/unknown_table1.q.out  http://hudson.zones.apache.org/hudson/job/Hive-trunk-h0.18/ws/hive/ql/src/test/results/compiler/errors/unknown_table1.q.out 
    [junit] Done query: unknown_table1.q
    [junit] Begin query: unknown_table2.q
    [junit] Loading data to table srcpart partition {ds=2008-04-08, hr=11}
    [junit] OK
    [junit] Loading data to table srcpart partition {ds=2008-04-08, hr=12}
    [junit] OK
    [junit] Loading data to table srcpart partition {ds=2008-04-09, hr=11}
    [junit] OK
    [junit] Loading data to table srcpart partition {ds=2008-04-09, hr=12}
    [junit] OK
    [junit] Loading data to table srcbucket
    [junit] OK
    [junit] Loading data to table srcbucket
    [junit] OK
    [junit] Loading data to table src
    [junit] OK
    [junit] diff http://hudson.zones.apache.org/hudson/job/Hive-trunk-h0.18/ws/hive/build/ql/test/logs/negative/unknown_table2.q.out  http://hudson.zones.apache.org/hudson/job/Hive-trunk-h0.18/ws/hive/ql/src/test/results/compiler/errors/unknown_table2.q.out 
    [junit] Done query: unknown_table2.q
    [junit] Begin query: wrong_distinct1.q
    [junit] Loading data to table srcpart partition {ds=2008-04-08, hr=11}
    [junit] OK
    [junit] Loading data to table srcpart partition {ds=2008-04-08, hr=12}
    [junit] OK
    [junit] Loading data to table srcpart partition {ds=2008-04-09, hr=11}
    [junit] OK
    [junit] Loading data to table srcpart partition {ds=2008-04-09, hr=12}
    [junit] OK
    [junit] Loading data to table srcbucket
    [junit] OK
    [junit] Loading data to table srcbucket
    [junit] OK
    [junit] Loading data to table src
    [junit] OK
    [junit] diff http://hudson.zones.apache.org/hudson/job/Hive-trunk-h0.18/ws/hive/build/ql/test/logs/negative/wrong_distinct1.q.out  http://hudson.zones.apache.org/hudson/job/Hive-trunk-h0.18/ws/hive/ql/src/test/results/compiler/errors/wrong_distinct1.q.out 
    [junit] Done query: wrong_distinct1.q
    [junit] Begin query: wrong_distinct2.q
    [junit] Loading data to table srcpart partition {ds=2008-04-08, hr=11}
    [junit] OK
    [junit] Loading data to table srcpart partition {ds=2008-04-08, hr=12}
    [junit] OK
    [junit] Loading data to table srcpart partition {ds=2008-04-09, hr=11}
    [junit] OK
    [junit] Loading data to table srcpart partition {ds=2008-04-09, hr=12}
    [junit] OK
    [junit] Loading data to table srcbucket
    [junit] OK
    [junit] Loading data to table srcbucket
    [junit] OK
    [junit] Loading data to table src
    [junit] OK
    [junit] diff http://hudson.zones.apache.org/hudson/job/Hive-trunk-h0.18/ws/hive/build/ql/test/logs/negative/wrong_distinct2.q.out  http://hudson.zones.apache.org/hudson/job/Hive-trunk-h0.18/ws/hive/ql/src/test/results/compiler/errors/wrong_distinct2.q.out 
    [junit] Done query: wrong_distinct2.q
    [junit] Tests run: 31, Failures: 0, Errors: 0, Time elapsed: 38.735 sec
    [junit] Running org.apache.hadoop.hive.ql.plan.TestAddPartition
    [junit] Table doesnotexist does not exist
    [junit] Tests run: 1, Failures: 0, Errors: 0, Time elapsed: 4.683 sec
    [junit] Running org.apache.hadoop.hive.ql.tool.TestLineageInfo
    [junit] Tests run: 5, Failures: 0, Errors: 0, Time elapsed: 0.276 sec

BUILD FAILED
http://hudson.zones.apache.org/hudson/job/Hive-trunk-h0.18/ws/hive/build.xml :118: The following error occurred while executing this line:
http://hudson.zones.apache.org/hudson/job/Hive-trunk-h0.18/ws/hive/build.xml :73: The following error occurred while executing this line:
http://hudson.zones.apache.org/hudson/job/Hive-trunk-h0.18/ws/hive/build-common.xml :274: Tests failed!

Total time: 22 minutes 47 seconds
Recording test results