You are viewing a plain text version of this content. The canonical link for it is here.
Posted to dev@lucene.apache.org by Apache Jenkins Server <je...@builds.apache.org> on 2016/05/06 18:00:51 UTC
[JENKINS] Lucene-Solr-NightlyTests-master - Build # 1007 - Still
Failing
Build: https://builds.apache.org/job/Lucene-Solr-NightlyTests-master/1007/
11 tests failed.
FAILED: org.apache.solr.cloud.SharedFSAutoReplicaFailoverTest.test
Error Message:
Timeout waiting for all live and active
Stack Trace:
java.lang.AssertionError: Timeout waiting for all live and active
at __randomizedtesting.SeedInfo.seed([7FF2899D3F00B9D7:F7A6B64791FCD42F]:0)
at org.junit.Assert.fail(Assert.java:93)
at org.junit.Assert.assertTrue(Assert.java:43)
at org.apache.solr.cloud.SharedFSAutoReplicaFailoverTest.testBasics(SharedFSAutoReplicaFailoverTest.java:202)
at org.apache.solr.cloud.SharedFSAutoReplicaFailoverTest.test(SharedFSAutoReplicaFailoverTest.java:107)
at sun.reflect.NativeMethodAccessorImpl.invoke0(Native Method)
at sun.reflect.NativeMethodAccessorImpl.invoke(NativeMethodAccessorImpl.java:62)
at sun.reflect.DelegatingMethodAccessorImpl.invoke(DelegatingMethodAccessorImpl.java:43)
at java.lang.reflect.Method.invoke(Method.java:498)
at com.carrotsearch.randomizedtesting.RandomizedRunner.invoke(RandomizedRunner.java:1764)
at com.carrotsearch.randomizedtesting.RandomizedRunner$8.evaluate(RandomizedRunner.java:871)
at com.carrotsearch.randomizedtesting.RandomizedRunner$9.evaluate(RandomizedRunner.java:907)
at com.carrotsearch.randomizedtesting.RandomizedRunner$10.evaluate(RandomizedRunner.java:921)
at org.apache.solr.BaseDistributedSearchTestCase$ShardsRepeatRule$ShardsFixedStatement.callStatement(BaseDistributedSearchTestCase.java:985)
at org.apache.solr.BaseDistributedSearchTestCase$ShardsRepeatRule$ShardsStatement.evaluate(BaseDistributedSearchTestCase.java:960)
at com.carrotsearch.randomizedtesting.rules.SystemPropertiesRestoreRule$1.evaluate(SystemPropertiesRestoreRule.java:57)
at org.apache.lucene.util.TestRuleSetupTeardownChained$1.evaluate(TestRuleSetupTeardownChained.java:49)
at org.apache.lucene.util.AbstractBeforeAfterRule$1.evaluate(AbstractBeforeAfterRule.java:45)
at org.apache.lucene.util.TestRuleThreadAndTestName$1.evaluate(TestRuleThreadAndTestName.java:48)
at org.apache.lucene.util.TestRuleIgnoreAfterMaxFailures$1.evaluate(TestRuleIgnoreAfterMaxFailures.java:64)
at org.apache.lucene.util.TestRuleMarkFailure$1.evaluate(TestRuleMarkFailure.java:47)
at com.carrotsearch.randomizedtesting.rules.StatementAdapter.evaluate(StatementAdapter.java:36)
at com.carrotsearch.randomizedtesting.ThreadLeakControl$StatementRunner.run(ThreadLeakControl.java:367)
at com.carrotsearch.randomizedtesting.ThreadLeakControl.forkTimeoutingTask(ThreadLeakControl.java:809)
at com.carrotsearch.randomizedtesting.ThreadLeakControl$3.evaluate(ThreadLeakControl.java:460)
at com.carrotsearch.randomizedtesting.RandomizedRunner.runSingleTest(RandomizedRunner.java:880)
at com.carrotsearch.randomizedtesting.RandomizedRunner$5.evaluate(RandomizedRunner.java:781)
at com.carrotsearch.randomizedtesting.RandomizedRunner$6.evaluate(RandomizedRunner.java:816)
at com.carrotsearch.randomizedtesting.RandomizedRunner$7.evaluate(RandomizedRunner.java:827)
at com.carrotsearch.randomizedtesting.rules.StatementAdapter.evaluate(StatementAdapter.java:36)
at com.carrotsearch.randomizedtesting.rules.SystemPropertiesRestoreRule$1.evaluate(SystemPropertiesRestoreRule.java:57)
at org.apache.lucene.util.AbstractBeforeAfterRule$1.evaluate(AbstractBeforeAfterRule.java:45)
at com.carrotsearch.randomizedtesting.rules.StatementAdapter.evaluate(StatementAdapter.java:36)
at org.apache.lucene.util.TestRuleStoreClassName$1.evaluate(TestRuleStoreClassName.java:41)
at com.carrotsearch.randomizedtesting.rules.NoShadowingOrOverridesOnMethodsRule$1.evaluate(NoShadowingOrOverridesOnMethodsRule.java:40)
at com.carrotsearch.randomizedtesting.rules.NoShadowingOrOverridesOnMethodsRule$1.evaluate(NoShadowingOrOverridesOnMethodsRule.java:40)
at com.carrotsearch.randomizedtesting.rules.StatementAdapter.evaluate(StatementAdapter.java:36)
at com.carrotsearch.randomizedtesting.rules.StatementAdapter.evaluate(StatementAdapter.java:36)
at com.carrotsearch.randomizedtesting.rules.StatementAdapter.evaluate(StatementAdapter.java:36)
at org.apache.lucene.util.TestRuleAssertionsRequired$1.evaluate(TestRuleAssertionsRequired.java:53)
at org.apache.lucene.util.TestRuleMarkFailure$1.evaluate(TestRuleMarkFailure.java:47)
at org.apache.lucene.util.TestRuleIgnoreAfterMaxFailures$1.evaluate(TestRuleIgnoreAfterMaxFailures.java:64)
at org.apache.lucene.util.TestRuleIgnoreTestSuites$1.evaluate(TestRuleIgnoreTestSuites.java:54)
at com.carrotsearch.randomizedtesting.rules.StatementAdapter.evaluate(StatementAdapter.java:36)
at com.carrotsearch.randomizedtesting.ThreadLeakControl$StatementRunner.run(ThreadLeakControl.java:367)
at java.lang.Thread.run(Thread.java:745)
FAILED: org.apache.solr.cloud.hdfs.HdfsCollectionsAPIDistributedZkTest.test
Error Message:
Timeout occured while waiting response from server at: https://127.0.0.1:56144/i_hrp/rs
Stack Trace:
org.apache.solr.client.solrj.SolrServerException: Timeout occured while waiting response from server at: https://127.0.0.1:56144/i_hrp/rs
at org.apache.solr.client.solrj.impl.HttpSolrClient.executeMethod(HttpSolrClient.java:617)
at org.apache.solr.client.solrj.impl.HttpSolrClient.request(HttpSolrClient.java:259)
at org.apache.solr.client.solrj.impl.HttpSolrClient.request(HttpSolrClient.java:248)
at org.apache.solr.client.solrj.SolrClient.request(SolrClient.java:1219)
at org.apache.solr.cloud.CollectionsAPIDistributedZkTest.makeRequest(CollectionsAPIDistributedZkTest.java:400)
at org.apache.solr.cloud.CollectionsAPIDistributedZkTest.testErrorHandling(CollectionsAPIDistributedZkTest.java:527)
at org.apache.solr.cloud.CollectionsAPIDistributedZkTest.test(CollectionsAPIDistributedZkTest.java:180)
at sun.reflect.NativeMethodAccessorImpl.invoke0(Native Method)
at sun.reflect.NativeMethodAccessorImpl.invoke(NativeMethodAccessorImpl.java:62)
at sun.reflect.DelegatingMethodAccessorImpl.invoke(DelegatingMethodAccessorImpl.java:43)
at java.lang.reflect.Method.invoke(Method.java:498)
at com.carrotsearch.randomizedtesting.RandomizedRunner.invoke(RandomizedRunner.java:1764)
at com.carrotsearch.randomizedtesting.RandomizedRunner$8.evaluate(RandomizedRunner.java:871)
at com.carrotsearch.randomizedtesting.RandomizedRunner$9.evaluate(RandomizedRunner.java:907)
at com.carrotsearch.randomizedtesting.RandomizedRunner$10.evaluate(RandomizedRunner.java:921)
at org.apache.solr.BaseDistributedSearchTestCase$ShardsRepeatRule$ShardsFixedStatement.callStatement(BaseDistributedSearchTestCase.java:985)
at org.apache.solr.BaseDistributedSearchTestCase$ShardsRepeatRule$ShardsStatement.evaluate(BaseDistributedSearchTestCase.java:960)
at com.carrotsearch.randomizedtesting.rules.SystemPropertiesRestoreRule$1.evaluate(SystemPropertiesRestoreRule.java:57)
at org.apache.lucene.util.TestRuleSetupTeardownChained$1.evaluate(TestRuleSetupTeardownChained.java:49)
at org.apache.lucene.util.AbstractBeforeAfterRule$1.evaluate(AbstractBeforeAfterRule.java:45)
at org.apache.lucene.util.TestRuleThreadAndTestName$1.evaluate(TestRuleThreadAndTestName.java:48)
at org.apache.lucene.util.TestRuleIgnoreAfterMaxFailures$1.evaluate(TestRuleIgnoreAfterMaxFailures.java:64)
at org.apache.lucene.util.TestRuleMarkFailure$1.evaluate(TestRuleMarkFailure.java:47)
at com.carrotsearch.randomizedtesting.rules.StatementAdapter.evaluate(StatementAdapter.java:36)
at com.carrotsearch.randomizedtesting.ThreadLeakControl$StatementRunner.run(ThreadLeakControl.java:367)
at com.carrotsearch.randomizedtesting.ThreadLeakControl.forkTimeoutingTask(ThreadLeakControl.java:809)
at com.carrotsearch.randomizedtesting.ThreadLeakControl$3.evaluate(ThreadLeakControl.java:460)
at com.carrotsearch.randomizedtesting.RandomizedRunner.runSingleTest(RandomizedRunner.java:880)
at com.carrotsearch.randomizedtesting.RandomizedRunner$5.evaluate(RandomizedRunner.java:781)
at com.carrotsearch.randomizedtesting.RandomizedRunner$6.evaluate(RandomizedRunner.java:816)
at com.carrotsearch.randomizedtesting.RandomizedRunner$7.evaluate(RandomizedRunner.java:827)
at com.carrotsearch.randomizedtesting.rules.StatementAdapter.evaluate(StatementAdapter.java:36)
at com.carrotsearch.randomizedtesting.rules.SystemPropertiesRestoreRule$1.evaluate(SystemPropertiesRestoreRule.java:57)
at org.apache.lucene.util.AbstractBeforeAfterRule$1.evaluate(AbstractBeforeAfterRule.java:45)
at com.carrotsearch.randomizedtesting.rules.StatementAdapter.evaluate(StatementAdapter.java:36)
at org.apache.lucene.util.TestRuleStoreClassName$1.evaluate(TestRuleStoreClassName.java:41)
at com.carrotsearch.randomizedtesting.rules.NoShadowingOrOverridesOnMethodsRule$1.evaluate(NoShadowingOrOverridesOnMethodsRule.java:40)
at com.carrotsearch.randomizedtesting.rules.NoShadowingOrOverridesOnMethodsRule$1.evaluate(NoShadowingOrOverridesOnMethodsRule.java:40)
at com.carrotsearch.randomizedtesting.rules.StatementAdapter.evaluate(StatementAdapter.java:36)
at com.carrotsearch.randomizedtesting.rules.StatementAdapter.evaluate(StatementAdapter.java:36)
at com.carrotsearch.randomizedtesting.rules.StatementAdapter.evaluate(StatementAdapter.java:36)
at org.apache.lucene.util.TestRuleAssertionsRequired$1.evaluate(TestRuleAssertionsRequired.java:53)
at org.apache.lucene.util.TestRuleMarkFailure$1.evaluate(TestRuleMarkFailure.java:47)
at org.apache.lucene.util.TestRuleIgnoreAfterMaxFailures$1.evaluate(TestRuleIgnoreAfterMaxFailures.java:64)
at org.apache.lucene.util.TestRuleIgnoreTestSuites$1.evaluate(TestRuleIgnoreTestSuites.java:54)
at com.carrotsearch.randomizedtesting.rules.StatementAdapter.evaluate(StatementAdapter.java:36)
at com.carrotsearch.randomizedtesting.ThreadLeakControl$StatementRunner.run(ThreadLeakControl.java:367)
at java.lang.Thread.run(Thread.java:745)
Caused by: java.net.SocketTimeoutException: Read timed out
at java.net.SocketInputStream.socketRead0(Native Method)
at java.net.SocketInputStream.socketRead(SocketInputStream.java:116)
at java.net.SocketInputStream.read(SocketInputStream.java:170)
at java.net.SocketInputStream.read(SocketInputStream.java:141)
at sun.security.ssl.InputRecord.readFully(InputRecord.java:465)
at sun.security.ssl.InputRecord.read(InputRecord.java:503)
at sun.security.ssl.SSLSocketImpl.readRecord(SSLSocketImpl.java:973)
at sun.security.ssl.SSLSocketImpl.readDataRecord(SSLSocketImpl.java:930)
at sun.security.ssl.AppInputStream.read(AppInputStream.java:105)
at org.apache.http.impl.io.SessionInputBufferImpl.streamRead(SessionInputBufferImpl.java:139)
at org.apache.http.impl.io.SessionInputBufferImpl.fillBuffer(SessionInputBufferImpl.java:155)
at org.apache.http.impl.io.SessionInputBufferImpl.readLine(SessionInputBufferImpl.java:284)
at org.apache.http.impl.conn.DefaultHttpResponseParser.parseHead(DefaultHttpResponseParser.java:140)
at org.apache.http.impl.conn.DefaultHttpResponseParser.parseHead(DefaultHttpResponseParser.java:57)
at org.apache.http.impl.io.AbstractMessageParser.parse(AbstractMessageParser.java:261)
at org.apache.http.impl.DefaultBHttpClientConnection.receiveResponseHeader(DefaultBHttpClientConnection.java:165)
at org.apache.http.impl.conn.CPoolProxy.receiveResponseHeader(CPoolProxy.java:167)
at org.apache.http.protocol.HttpRequestExecutor.doReceiveResponse(HttpRequestExecutor.java:272)
at org.apache.http.protocol.HttpRequestExecutor.execute(HttpRequestExecutor.java:124)
at org.apache.http.impl.execchain.MainClientExec.execute(MainClientExec.java:271)
at org.apache.http.impl.execchain.ProtocolExec.execute(ProtocolExec.java:184)
at org.apache.http.impl.execchain.RetryExec.execute(RetryExec.java:88)
at org.apache.http.impl.execchain.RedirectExec.execute(RedirectExec.java:110)
at org.apache.http.impl.client.InternalHttpClient.doExecute(InternalHttpClient.java:184)
at org.apache.http.impl.client.CloseableHttpClient.execute(CloseableHttpClient.java:82)
at org.apache.http.impl.client.CloseableHttpClient.execute(CloseableHttpClient.java:55)
at org.apache.solr.client.solrj.impl.HttpSolrClient.executeMethod(HttpSolrClient.java:511)
... 47 more
FAILED: org.apache.solr.cloud.CollectionsAPIDistributedZkTest.test
Error Message:
Timeout occured while waiting response from server at: http://127.0.0.1:49200/qa_oj/e
Stack Trace:
org.apache.solr.client.solrj.SolrServerException: Timeout occured while waiting response from server at: http://127.0.0.1:49200/qa_oj/e
at org.apache.solr.client.solrj.impl.HttpSolrClient.executeMethod(HttpSolrClient.java:617)
at org.apache.solr.client.solrj.impl.HttpSolrClient.request(HttpSolrClient.java:259)
at org.apache.solr.client.solrj.impl.HttpSolrClient.request(HttpSolrClient.java:248)
at org.apache.solr.client.solrj.SolrClient.request(SolrClient.java:1219)
at org.apache.solr.cloud.CollectionsAPIDistributedZkTest.makeRequest(CollectionsAPIDistributedZkTest.java:400)
at org.apache.solr.cloud.CollectionsAPIDistributedZkTest.testErrorHandling(CollectionsAPIDistributedZkTest.java:458)
at org.apache.solr.cloud.CollectionsAPIDistributedZkTest.test(CollectionsAPIDistributedZkTest.java:180)
at sun.reflect.NativeMethodAccessorImpl.invoke0(Native Method)
at sun.reflect.NativeMethodAccessorImpl.invoke(NativeMethodAccessorImpl.java:62)
at sun.reflect.DelegatingMethodAccessorImpl.invoke(DelegatingMethodAccessorImpl.java:43)
at java.lang.reflect.Method.invoke(Method.java:498)
at com.carrotsearch.randomizedtesting.RandomizedRunner.invoke(RandomizedRunner.java:1764)
at com.carrotsearch.randomizedtesting.RandomizedRunner$8.evaluate(RandomizedRunner.java:871)
at com.carrotsearch.randomizedtesting.RandomizedRunner$9.evaluate(RandomizedRunner.java:907)
at com.carrotsearch.randomizedtesting.RandomizedRunner$10.evaluate(RandomizedRunner.java:921)
at org.apache.solr.BaseDistributedSearchTestCase$ShardsRepeatRule$ShardsFixedStatement.callStatement(BaseDistributedSearchTestCase.java:985)
at org.apache.solr.BaseDistributedSearchTestCase$ShardsRepeatRule$ShardsStatement.evaluate(BaseDistributedSearchTestCase.java:960)
at com.carrotsearch.randomizedtesting.rules.SystemPropertiesRestoreRule$1.evaluate(SystemPropertiesRestoreRule.java:57)
at org.apache.lucene.util.TestRuleSetupTeardownChained$1.evaluate(TestRuleSetupTeardownChained.java:49)
at org.apache.lucene.util.AbstractBeforeAfterRule$1.evaluate(AbstractBeforeAfterRule.java:45)
at org.apache.lucene.util.TestRuleThreadAndTestName$1.evaluate(TestRuleThreadAndTestName.java:48)
at org.apache.lucene.util.TestRuleIgnoreAfterMaxFailures$1.evaluate(TestRuleIgnoreAfterMaxFailures.java:64)
at org.apache.lucene.util.TestRuleMarkFailure$1.evaluate(TestRuleMarkFailure.java:47)
at com.carrotsearch.randomizedtesting.rules.StatementAdapter.evaluate(StatementAdapter.java:36)
at com.carrotsearch.randomizedtesting.ThreadLeakControl$StatementRunner.run(ThreadLeakControl.java:367)
at com.carrotsearch.randomizedtesting.ThreadLeakControl.forkTimeoutingTask(ThreadLeakControl.java:809)
at com.carrotsearch.randomizedtesting.ThreadLeakControl$3.evaluate(ThreadLeakControl.java:460)
at com.carrotsearch.randomizedtesting.RandomizedRunner.runSingleTest(RandomizedRunner.java:880)
at com.carrotsearch.randomizedtesting.RandomizedRunner$5.evaluate(RandomizedRunner.java:781)
at com.carrotsearch.randomizedtesting.RandomizedRunner$6.evaluate(RandomizedRunner.java:816)
at com.carrotsearch.randomizedtesting.RandomizedRunner$7.evaluate(RandomizedRunner.java:827)
at com.carrotsearch.randomizedtesting.rules.StatementAdapter.evaluate(StatementAdapter.java:36)
at com.carrotsearch.randomizedtesting.rules.SystemPropertiesRestoreRule$1.evaluate(SystemPropertiesRestoreRule.java:57)
at org.apache.lucene.util.AbstractBeforeAfterRule$1.evaluate(AbstractBeforeAfterRule.java:45)
at com.carrotsearch.randomizedtesting.rules.StatementAdapter.evaluate(StatementAdapter.java:36)
at org.apache.lucene.util.TestRuleStoreClassName$1.evaluate(TestRuleStoreClassName.java:41)
at com.carrotsearch.randomizedtesting.rules.NoShadowingOrOverridesOnMethodsRule$1.evaluate(NoShadowingOrOverridesOnMethodsRule.java:40)
at com.carrotsearch.randomizedtesting.rules.NoShadowingOrOverridesOnMethodsRule$1.evaluate(NoShadowingOrOverridesOnMethodsRule.java:40)
at com.carrotsearch.randomizedtesting.rules.StatementAdapter.evaluate(StatementAdapter.java:36)
at com.carrotsearch.randomizedtesting.rules.StatementAdapter.evaluate(StatementAdapter.java:36)
at com.carrotsearch.randomizedtesting.rules.StatementAdapter.evaluate(StatementAdapter.java:36)
at org.apache.lucene.util.TestRuleAssertionsRequired$1.evaluate(TestRuleAssertionsRequired.java:53)
at org.apache.lucene.util.TestRuleMarkFailure$1.evaluate(TestRuleMarkFailure.java:47)
at org.apache.lucene.util.TestRuleIgnoreAfterMaxFailures$1.evaluate(TestRuleIgnoreAfterMaxFailures.java:64)
at org.apache.lucene.util.TestRuleIgnoreTestSuites$1.evaluate(TestRuleIgnoreTestSuites.java:54)
at com.carrotsearch.randomizedtesting.rules.StatementAdapter.evaluate(StatementAdapter.java:36)
at com.carrotsearch.randomizedtesting.ThreadLeakControl$StatementRunner.run(ThreadLeakControl.java:367)
at java.lang.Thread.run(Thread.java:745)
Caused by: java.net.SocketTimeoutException: Read timed out
at java.net.SocketInputStream.socketRead0(Native Method)
at java.net.SocketInputStream.socketRead(SocketInputStream.java:116)
at java.net.SocketInputStream.read(SocketInputStream.java:170)
at java.net.SocketInputStream.read(SocketInputStream.java:141)
at org.apache.http.impl.io.SessionInputBufferImpl.streamRead(SessionInputBufferImpl.java:139)
at org.apache.http.impl.io.SessionInputBufferImpl.fillBuffer(SessionInputBufferImpl.java:155)
at org.apache.http.impl.io.SessionInputBufferImpl.readLine(SessionInputBufferImpl.java:284)
at org.apache.http.impl.conn.DefaultHttpResponseParser.parseHead(DefaultHttpResponseParser.java:140)
at org.apache.http.impl.conn.DefaultHttpResponseParser.parseHead(DefaultHttpResponseParser.java:57)
at org.apache.http.impl.io.AbstractMessageParser.parse(AbstractMessageParser.java:261)
at org.apache.http.impl.DefaultBHttpClientConnection.receiveResponseHeader(DefaultBHttpClientConnection.java:165)
at org.apache.http.impl.conn.CPoolProxy.receiveResponseHeader(CPoolProxy.java:167)
at org.apache.http.protocol.HttpRequestExecutor.doReceiveResponse(HttpRequestExecutor.java:272)
at org.apache.http.protocol.HttpRequestExecutor.execute(HttpRequestExecutor.java:124)
at org.apache.http.impl.execchain.MainClientExec.execute(MainClientExec.java:271)
at org.apache.http.impl.execchain.ProtocolExec.execute(ProtocolExec.java:184)
at org.apache.http.impl.execchain.RetryExec.execute(RetryExec.java:88)
at org.apache.http.impl.execchain.RedirectExec.execute(RedirectExec.java:110)
at org.apache.http.impl.client.InternalHttpClient.doExecute(InternalHttpClient.java:184)
at org.apache.http.impl.client.CloseableHttpClient.execute(CloseableHttpClient.java:82)
at org.apache.http.impl.client.CloseableHttpClient.execute(CloseableHttpClient.java:55)
at org.apache.solr.client.solrj.impl.HttpSolrClient.executeMethod(HttpSolrClient.java:511)
... 47 more
FAILED: junit.framework.TestSuite.org.apache.solr.cloud.CdcrReplicationHandlerTest
Error Message:
ObjectTracker found 12 object(s) that were not released!!! [InternalHttpClient, InternalHttpClient, InternalHttpClient, InternalHttpClient, InternalHttpClient, InternalHttpClient, InternalHttpClient, InternalHttpClient, InternalHttpClient, InternalHttpClient, InternalHttpClient, InternalHttpClient]
Stack Trace:
java.lang.AssertionError: ObjectTracker found 12 object(s) that were not released!!! [InternalHttpClient, InternalHttpClient, InternalHttpClient, InternalHttpClient, InternalHttpClient, InternalHttpClient, InternalHttpClient, InternalHttpClient, InternalHttpClient, InternalHttpClient, InternalHttpClient, InternalHttpClient]
at __randomizedtesting.SeedInfo.seed([7FF2899D3F00B9D7]:0)
at org.junit.Assert.fail(Assert.java:93)
at org.junit.Assert.assertTrue(Assert.java:43)
at org.junit.Assert.assertNull(Assert.java:551)
at org.apache.solr.SolrTestCaseJ4.afterClass(SolrTestCaseJ4.java:255)
at sun.reflect.NativeMethodAccessorImpl.invoke0(Native Method)
at sun.reflect.NativeMethodAccessorImpl.invoke(NativeMethodAccessorImpl.java:62)
at sun.reflect.DelegatingMethodAccessorImpl.invoke(DelegatingMethodAccessorImpl.java:43)
at java.lang.reflect.Method.invoke(Method.java:498)
at com.carrotsearch.randomizedtesting.RandomizedRunner.invoke(RandomizedRunner.java:1764)
at com.carrotsearch.randomizedtesting.RandomizedRunner$7.evaluate(RandomizedRunner.java:834)
at com.carrotsearch.randomizedtesting.rules.StatementAdapter.evaluate(StatementAdapter.java:36)
at com.carrotsearch.randomizedtesting.rules.SystemPropertiesRestoreRule$1.evaluate(SystemPropertiesRestoreRule.java:57)
at org.apache.lucene.util.AbstractBeforeAfterRule$1.evaluate(AbstractBeforeAfterRule.java:45)
at com.carrotsearch.randomizedtesting.rules.StatementAdapter.evaluate(StatementAdapter.java:36)
at org.apache.lucene.util.TestRuleStoreClassName$1.evaluate(TestRuleStoreClassName.java:41)
at com.carrotsearch.randomizedtesting.rules.NoShadowingOrOverridesOnMethodsRule$1.evaluate(NoShadowingOrOverridesOnMethodsRule.java:40)
at com.carrotsearch.randomizedtesting.rules.NoShadowingOrOverridesOnMethodsRule$1.evaluate(NoShadowingOrOverridesOnMethodsRule.java:40)
at com.carrotsearch.randomizedtesting.rules.StatementAdapter.evaluate(StatementAdapter.java:36)
at com.carrotsearch.randomizedtesting.rules.StatementAdapter.evaluate(StatementAdapter.java:36)
at com.carrotsearch.randomizedtesting.rules.StatementAdapter.evaluate(StatementAdapter.java:36)
at org.apache.lucene.util.TestRuleAssertionsRequired$1.evaluate(TestRuleAssertionsRequired.java:53)
at org.apache.lucene.util.TestRuleMarkFailure$1.evaluate(TestRuleMarkFailure.java:47)
at org.apache.lucene.util.TestRuleIgnoreAfterMaxFailures$1.evaluate(TestRuleIgnoreAfterMaxFailures.java:64)
at org.apache.lucene.util.TestRuleIgnoreTestSuites$1.evaluate(TestRuleIgnoreTestSuites.java:54)
at com.carrotsearch.randomizedtesting.rules.StatementAdapter.evaluate(StatementAdapter.java:36)
at com.carrotsearch.randomizedtesting.ThreadLeakControl$StatementRunner.run(ThreadLeakControl.java:367)
at java.lang.Thread.run(Thread.java:745)
FAILED: junit.framework.TestSuite.org.apache.solr.cloud.CdcrReplicationHandlerTest
Error Message:
12 threads leaked from SUITE scope at org.apache.solr.cloud.CdcrReplicationHandlerTest: 1) Thread[id=2157, name=Connection evictor, state=TIMED_WAITING, group=TGRP-CdcrReplicationHandlerTest] at java.lang.Thread.sleep(Native Method) at org.apache.http.impl.client.IdleConnectionEvictor$1.run(IdleConnectionEvictor.java:66) at java.lang.Thread.run(Thread.java:745) 2) Thread[id=1810, name=Connection evictor, state=TIMED_WAITING, group=TGRP-CdcrReplicationHandlerTest] at java.lang.Thread.sleep(Native Method) at org.apache.http.impl.client.IdleConnectionEvictor$1.run(IdleConnectionEvictor.java:66) at java.lang.Thread.run(Thread.java:745) 3) Thread[id=1928, name=Connection evictor, state=TIMED_WAITING, group=TGRP-CdcrReplicationHandlerTest] at java.lang.Thread.sleep(Native Method) at org.apache.http.impl.client.IdleConnectionEvictor$1.run(IdleConnectionEvictor.java:66) at java.lang.Thread.run(Thread.java:745) 4) Thread[id=2417, name=Connection evictor, state=TIMED_WAITING, group=TGRP-CdcrReplicationHandlerTest] at java.lang.Thread.sleep(Native Method) at org.apache.http.impl.client.IdleConnectionEvictor$1.run(IdleConnectionEvictor.java:66) at java.lang.Thread.run(Thread.java:745) 5) Thread[id=1929, name=Connection evictor, state=TIMED_WAITING, group=TGRP-CdcrReplicationHandlerTest] at java.lang.Thread.sleep(Native Method) at org.apache.http.impl.client.IdleConnectionEvictor$1.run(IdleConnectionEvictor.java:66) at java.lang.Thread.run(Thread.java:745) 6) Thread[id=1545, name=Connection evictor, state=TIMED_WAITING, group=TGRP-CdcrReplicationHandlerTest] at java.lang.Thread.sleep(Native Method) at org.apache.http.impl.client.IdleConnectionEvictor$1.run(IdleConnectionEvictor.java:66) at java.lang.Thread.run(Thread.java:745) 7) Thread[id=2156, name=Connection evictor, state=TIMED_WAITING, group=TGRP-CdcrReplicationHandlerTest] at java.lang.Thread.sleep(Native Method) at org.apache.http.impl.client.IdleConnectionEvictor$1.run(IdleConnectionEvictor.java:66) at java.lang.Thread.run(Thread.java:745) 8) Thread[id=2418, name=Connection evictor, state=TIMED_WAITING, group=TGRP-CdcrReplicationHandlerTest] at java.lang.Thread.sleep(Native Method) at org.apache.http.impl.client.IdleConnectionEvictor$1.run(IdleConnectionEvictor.java:66) at java.lang.Thread.run(Thread.java:745) 9) Thread[id=1809, name=Connection evictor, state=TIMED_WAITING, group=TGRP-CdcrReplicationHandlerTest] at java.lang.Thread.sleep(Native Method) at org.apache.http.impl.client.IdleConnectionEvictor$1.run(IdleConnectionEvictor.java:66) at java.lang.Thread.run(Thread.java:745) 10) Thread[id=356, name=Connection evictor, state=TIMED_WAITING, group=TGRP-CdcrReplicationHandlerTest] at java.lang.Thread.sleep(Native Method) at org.apache.http.impl.client.IdleConnectionEvictor$1.run(IdleConnectionEvictor.java:66) at java.lang.Thread.run(Thread.java:745) 11) Thread[id=357, name=Connection evictor, state=TIMED_WAITING, group=TGRP-CdcrReplicationHandlerTest] at java.lang.Thread.sleep(Native Method) at org.apache.http.impl.client.IdleConnectionEvictor$1.run(IdleConnectionEvictor.java:66) at java.lang.Thread.run(Thread.java:745) 12) Thread[id=1544, name=Connection evictor, state=TIMED_WAITING, group=TGRP-CdcrReplicationHandlerTest] at java.lang.Thread.sleep(Native Method) at org.apache.http.impl.client.IdleConnectionEvictor$1.run(IdleConnectionEvictor.java:66) at java.lang.Thread.run(Thread.java:745)
Stack Trace:
com.carrotsearch.randomizedtesting.ThreadLeakError: 12 threads leaked from SUITE scope at org.apache.solr.cloud.CdcrReplicationHandlerTest:
1) Thread[id=2157, name=Connection evictor, state=TIMED_WAITING, group=TGRP-CdcrReplicationHandlerTest]
at java.lang.Thread.sleep(Native Method)
at org.apache.http.impl.client.IdleConnectionEvictor$1.run(IdleConnectionEvictor.java:66)
at java.lang.Thread.run(Thread.java:745)
2) Thread[id=1810, name=Connection evictor, state=TIMED_WAITING, group=TGRP-CdcrReplicationHandlerTest]
at java.lang.Thread.sleep(Native Method)
at org.apache.http.impl.client.IdleConnectionEvictor$1.run(IdleConnectionEvictor.java:66)
at java.lang.Thread.run(Thread.java:745)
3) Thread[id=1928, name=Connection evictor, state=TIMED_WAITING, group=TGRP-CdcrReplicationHandlerTest]
at java.lang.Thread.sleep(Native Method)
at org.apache.http.impl.client.IdleConnectionEvictor$1.run(IdleConnectionEvictor.java:66)
at java.lang.Thread.run(Thread.java:745)
4) Thread[id=2417, name=Connection evictor, state=TIMED_WAITING, group=TGRP-CdcrReplicationHandlerTest]
at java.lang.Thread.sleep(Native Method)
at org.apache.http.impl.client.IdleConnectionEvictor$1.run(IdleConnectionEvictor.java:66)
at java.lang.Thread.run(Thread.java:745)
5) Thread[id=1929, name=Connection evictor, state=TIMED_WAITING, group=TGRP-CdcrReplicationHandlerTest]
at java.lang.Thread.sleep(Native Method)
at org.apache.http.impl.client.IdleConnectionEvictor$1.run(IdleConnectionEvictor.java:66)
at java.lang.Thread.run(Thread.java:745)
6) Thread[id=1545, name=Connection evictor, state=TIMED_WAITING, group=TGRP-CdcrReplicationHandlerTest]
at java.lang.Thread.sleep(Native Method)
at org.apache.http.impl.client.IdleConnectionEvictor$1.run(IdleConnectionEvictor.java:66)
at java.lang.Thread.run(Thread.java:745)
7) Thread[id=2156, name=Connection evictor, state=TIMED_WAITING, group=TGRP-CdcrReplicationHandlerTest]
at java.lang.Thread.sleep(Native Method)
at org.apache.http.impl.client.IdleConnectionEvictor$1.run(IdleConnectionEvictor.java:66)
at java.lang.Thread.run(Thread.java:745)
8) Thread[id=2418, name=Connection evictor, state=TIMED_WAITING, group=TGRP-CdcrReplicationHandlerTest]
at java.lang.Thread.sleep(Native Method)
at org.apache.http.impl.client.IdleConnectionEvictor$1.run(IdleConnectionEvictor.java:66)
at java.lang.Thread.run(Thread.java:745)
9) Thread[id=1809, name=Connection evictor, state=TIMED_WAITING, group=TGRP-CdcrReplicationHandlerTest]
at java.lang.Thread.sleep(Native Method)
at org.apache.http.impl.client.IdleConnectionEvictor$1.run(IdleConnectionEvictor.java:66)
at java.lang.Thread.run(Thread.java:745)
10) Thread[id=356, name=Connection evictor, state=TIMED_WAITING, group=TGRP-CdcrReplicationHandlerTest]
at java.lang.Thread.sleep(Native Method)
at org.apache.http.impl.client.IdleConnectionEvictor$1.run(IdleConnectionEvictor.java:66)
at java.lang.Thread.run(Thread.java:745)
11) Thread[id=357, name=Connection evictor, state=TIMED_WAITING, group=TGRP-CdcrReplicationHandlerTest]
at java.lang.Thread.sleep(Native Method)
at org.apache.http.impl.client.IdleConnectionEvictor$1.run(IdleConnectionEvictor.java:66)
at java.lang.Thread.run(Thread.java:745)
12) Thread[id=1544, name=Connection evictor, state=TIMED_WAITING, group=TGRP-CdcrReplicationHandlerTest]
at java.lang.Thread.sleep(Native Method)
at org.apache.http.impl.client.IdleConnectionEvictor$1.run(IdleConnectionEvictor.java:66)
at java.lang.Thread.run(Thread.java:745)
at __randomizedtesting.SeedInfo.seed([7FF2899D3F00B9D7]:0)
FAILED: junit.framework.TestSuite.org.apache.solr.cloud.CdcrReplicationDistributedZkTest
Error Message:
ObjectTracker found 48 object(s) that were not released!!! [InternalHttpClient, InternalHttpClient, InternalHttpClient, InternalHttpClient, InternalHttpClient, InternalHttpClient, InternalHttpClient, InternalHttpClient, InternalHttpClient, InternalHttpClient, InternalHttpClient, InternalHttpClient, InternalHttpClient, InternalHttpClient, InternalHttpClient, InternalHttpClient, InternalHttpClient, InternalHttpClient, InternalHttpClient, InternalHttpClient, InternalHttpClient, InternalHttpClient, InternalHttpClient, InternalHttpClient, InternalHttpClient, InternalHttpClient, InternalHttpClient, InternalHttpClient, InternalHttpClient, InternalHttpClient, InternalHttpClient, InternalHttpClient, InternalHttpClient, InternalHttpClient, InternalHttpClient, InternalHttpClient, InternalHttpClient, InternalHttpClient, InternalHttpClient, InternalHttpClient, InternalHttpClient, InternalHttpClient, InternalHttpClient, InternalHttpClient, InternalHttpClient, InternalHttpClient, InternalHttpClient, InternalHttpClient]
Stack Trace:
java.lang.AssertionError: ObjectTracker found 48 object(s) that were not released!!! [InternalHttpClient, InternalHttpClient, InternalHttpClient, InternalHttpClient, InternalHttpClient, InternalHttpClient, InternalHttpClient, InternalHttpClient, InternalHttpClient, InternalHttpClient, InternalHttpClient, InternalHttpClient, InternalHttpClient, InternalHttpClient, InternalHttpClient, InternalHttpClient, InternalHttpClient, InternalHttpClient, InternalHttpClient, InternalHttpClient, InternalHttpClient, InternalHttpClient, InternalHttpClient, InternalHttpClient, InternalHttpClient, InternalHttpClient, InternalHttpClient, InternalHttpClient, InternalHttpClient, InternalHttpClient, InternalHttpClient, InternalHttpClient, InternalHttpClient, InternalHttpClient, InternalHttpClient, InternalHttpClient, InternalHttpClient, InternalHttpClient, InternalHttpClient, InternalHttpClient, InternalHttpClient, InternalHttpClient, InternalHttpClient, InternalHttpClient, InternalHttpClient, InternalHttpClient, InternalHttpClient, InternalHttpClient]
at __randomizedtesting.SeedInfo.seed([7FF2899D3F00B9D7]:0)
at org.junit.Assert.fail(Assert.java:93)
at org.junit.Assert.assertTrue(Assert.java:43)
at org.junit.Assert.assertNull(Assert.java:551)
at org.apache.solr.SolrTestCaseJ4.afterClass(SolrTestCaseJ4.java:255)
at sun.reflect.GeneratedMethodAccessor17.invoke(Unknown Source)
at sun.reflect.DelegatingMethodAccessorImpl.invoke(DelegatingMethodAccessorImpl.java:43)
at java.lang.reflect.Method.invoke(Method.java:498)
at com.carrotsearch.randomizedtesting.RandomizedRunner.invoke(RandomizedRunner.java:1764)
at com.carrotsearch.randomizedtesting.RandomizedRunner$7.evaluate(RandomizedRunner.java:834)
at com.carrotsearch.randomizedtesting.rules.StatementAdapter.evaluate(StatementAdapter.java:36)
at com.carrotsearch.randomizedtesting.rules.SystemPropertiesRestoreRule$1.evaluate(SystemPropertiesRestoreRule.java:57)
at org.apache.lucene.util.AbstractBeforeAfterRule$1.evaluate(AbstractBeforeAfterRule.java:45)
at com.carrotsearch.randomizedtesting.rules.StatementAdapter.evaluate(StatementAdapter.java:36)
at org.apache.lucene.util.TestRuleStoreClassName$1.evaluate(TestRuleStoreClassName.java:41)
at com.carrotsearch.randomizedtesting.rules.NoShadowingOrOverridesOnMethodsRule$1.evaluate(NoShadowingOrOverridesOnMethodsRule.java:40)
at com.carrotsearch.randomizedtesting.rules.NoShadowingOrOverridesOnMethodsRule$1.evaluate(NoShadowingOrOverridesOnMethodsRule.java:40)
at com.carrotsearch.randomizedtesting.rules.StatementAdapter.evaluate(StatementAdapter.java:36)
at com.carrotsearch.randomizedtesting.rules.StatementAdapter.evaluate(StatementAdapter.java:36)
at com.carrotsearch.randomizedtesting.rules.StatementAdapter.evaluate(StatementAdapter.java:36)
at org.apache.lucene.util.TestRuleAssertionsRequired$1.evaluate(TestRuleAssertionsRequired.java:53)
at org.apache.lucene.util.TestRuleMarkFailure$1.evaluate(TestRuleMarkFailure.java:47)
at org.apache.lucene.util.TestRuleIgnoreAfterMaxFailures$1.evaluate(TestRuleIgnoreAfterMaxFailures.java:64)
at org.apache.lucene.util.TestRuleIgnoreTestSuites$1.evaluate(TestRuleIgnoreTestSuites.java:54)
at com.carrotsearch.randomizedtesting.rules.StatementAdapter.evaluate(StatementAdapter.java:36)
at com.carrotsearch.randomizedtesting.ThreadLeakControl$StatementRunner.run(ThreadLeakControl.java:367)
at java.lang.Thread.run(Thread.java:745)
FAILED: junit.framework.TestSuite.org.apache.solr.cloud.CdcrReplicationDistributedZkTest
Error Message:
48 threads leaked from SUITE scope at org.apache.solr.cloud.CdcrReplicationDistributedZkTest: 1) Thread[id=179741, name=Connection evictor, state=TIMED_WAITING, group=TGRP-CdcrReplicationDistributedZkTest] at java.lang.Thread.sleep(Native Method) at org.apache.http.impl.client.IdleConnectionEvictor$1.run(IdleConnectionEvictor.java:66) at java.lang.Thread.run(Thread.java:745) 2) Thread[id=180089, name=Connection evictor, state=TIMED_WAITING, group=TGRP-CdcrReplicationDistributedZkTest] at java.lang.Thread.sleep(Native Method) at org.apache.http.impl.client.IdleConnectionEvictor$1.run(IdleConnectionEvictor.java:66) at java.lang.Thread.run(Thread.java:745) 3) Thread[id=176857, name=Connection evictor, state=TIMED_WAITING, group=TGRP-CdcrReplicationDistributedZkTest] at java.lang.Thread.sleep(Native Method) at org.apache.http.impl.client.IdleConnectionEvictor$1.run(IdleConnectionEvictor.java:66) at java.lang.Thread.run(Thread.java:745) 4) Thread[id=180220, name=Connection evictor, state=TIMED_WAITING, group=TGRP-CdcrReplicationDistributedZkTest] at java.lang.Thread.sleep(Native Method) at org.apache.http.impl.client.IdleConnectionEvictor$1.run(IdleConnectionEvictor.java:66) at java.lang.Thread.run(Thread.java:745) 5) Thread[id=183498, name=Connection evictor, state=TIMED_WAITING, group=TGRP-CdcrReplicationDistributedZkTest] at java.lang.Thread.sleep(Native Method) at org.apache.http.impl.client.IdleConnectionEvictor$1.run(IdleConnectionEvictor.java:66) at java.lang.Thread.run(Thread.java:745) 6) Thread[id=176687, name=Connection evictor, state=TIMED_WAITING, group=TGRP-CdcrReplicationDistributedZkTest] at java.lang.Thread.sleep(Native Method) at org.apache.http.impl.client.IdleConnectionEvictor$1.run(IdleConnectionEvictor.java:66) at java.lang.Thread.run(Thread.java:745) 7) Thread[id=176856, name=Connection evictor, state=TIMED_WAITING, group=TGRP-CdcrReplicationDistributedZkTest] at java.lang.Thread.sleep(Native Method) at org.apache.http.impl.client.IdleConnectionEvictor$1.run(IdleConnectionEvictor.java:66) at java.lang.Thread.run(Thread.java:745) 8) Thread[id=184949, name=Connection evictor, state=TIMED_WAITING, group=TGRP-CdcrReplicationDistributedZkTest] at java.lang.Thread.sleep(Native Method) at org.apache.http.impl.client.IdleConnectionEvictor$1.run(IdleConnectionEvictor.java:66) at java.lang.Thread.run(Thread.java:745) 9) Thread[id=177086, name=Connection evictor, state=TIMED_WAITING, group=TGRP-CdcrReplicationDistributedZkTest] at java.lang.Thread.sleep(Native Method) at org.apache.http.impl.client.IdleConnectionEvictor$1.run(IdleConnectionEvictor.java:66) at java.lang.Thread.run(Thread.java:745) 10) Thread[id=184950, name=Connection evictor, state=TIMED_WAITING, group=TGRP-CdcrReplicationDistributedZkTest] at java.lang.Thread.sleep(Native Method) at org.apache.http.impl.client.IdleConnectionEvictor$1.run(IdleConnectionEvictor.java:66) at java.lang.Thread.run(Thread.java:745) 11) Thread[id=186106, name=Connection evictor, state=TIMED_WAITING, group=TGRP-CdcrReplicationDistributedZkTest] at java.lang.Thread.sleep(Native Method) at org.apache.http.impl.client.IdleConnectionEvictor$1.run(IdleConnectionEvictor.java:66) at java.lang.Thread.run(Thread.java:745) 12) Thread[id=180092, name=Connection evictor, state=TIMED_WAITING, group=TGRP-CdcrReplicationDistributedZkTest] at java.lang.Thread.sleep(Native Method) at org.apache.http.impl.client.IdleConnectionEvictor$1.run(IdleConnectionEvictor.java:66) at java.lang.Thread.run(Thread.java:745) 13) Thread[id=176688, name=Connection evictor, state=TIMED_WAITING, group=TGRP-CdcrReplicationDistributedZkTest] at java.lang.Thread.sleep(Native Method) at org.apache.http.impl.client.IdleConnectionEvictor$1.run(IdleConnectionEvictor.java:66) at java.lang.Thread.run(Thread.java:745) 14) Thread[id=177088, name=Connection evictor, state=TIMED_WAITING, group=TGRP-CdcrReplicationDistributedZkTest] at java.lang.Thread.sleep(Native Method) at org.apache.http.impl.client.IdleConnectionEvictor$1.run(IdleConnectionEvictor.java:66) at java.lang.Thread.run(Thread.java:745) 15) Thread[id=180454, name=Connection evictor, state=TIMED_WAITING, group=TGRP-CdcrReplicationDistributedZkTest] at java.lang.Thread.sleep(Native Method) at org.apache.http.impl.client.IdleConnectionEvictor$1.run(IdleConnectionEvictor.java:66) at java.lang.Thread.run(Thread.java:745) 16) Thread[id=180222, name=Connection evictor, state=TIMED_WAITING, group=TGRP-CdcrReplicationDistributedZkTest] at java.lang.Thread.sleep(Native Method) at org.apache.http.impl.client.IdleConnectionEvictor$1.run(IdleConnectionEvictor.java:66) at java.lang.Thread.run(Thread.java:745) 17) Thread[id=180091, name=Connection evictor, state=TIMED_WAITING, group=TGRP-CdcrReplicationDistributedZkTest] at java.lang.Thread.sleep(Native Method) at org.apache.http.impl.client.IdleConnectionEvictor$1.run(IdleConnectionEvictor.java:66) at java.lang.Thread.run(Thread.java:745) 18) Thread[id=186562, name=Connection evictor, state=TIMED_WAITING, group=TGRP-CdcrReplicationDistributedZkTest] at java.lang.Thread.sleep(Native Method) at org.apache.http.impl.client.IdleConnectionEvictor$1.run(IdleConnectionEvictor.java:66) at java.lang.Thread.run(Thread.java:745) 19) Thread[id=180219, name=Connection evictor, state=TIMED_WAITING, group=TGRP-CdcrReplicationDistributedZkTest] at java.lang.Thread.sleep(Native Method) at org.apache.http.impl.client.IdleConnectionEvictor$1.run(IdleConnectionEvictor.java:66) at java.lang.Thread.run(Thread.java:745) 20) Thread[id=184947, name=Connection evictor, state=TIMED_WAITING, group=TGRP-CdcrReplicationDistributedZkTest] at java.lang.Thread.sleep(Native Method) at org.apache.http.impl.client.IdleConnectionEvictor$1.run(IdleConnectionEvictor.java:66) at java.lang.Thread.run(Thread.java:745) 21) Thread[id=179743, name=Connection evictor, state=TIMED_WAITING, group=TGRP-CdcrReplicationDistributedZkTest] at java.lang.Thread.sleep(Native Method) at org.apache.http.impl.client.IdleConnectionEvictor$1.run(IdleConnectionEvictor.java:66) at java.lang.Thread.run(Thread.java:745) 22) Thread[id=180088, name=Connection evictor, state=TIMED_WAITING, group=TGRP-CdcrReplicationDistributedZkTest] at java.lang.Thread.sleep(Native Method) at org.apache.http.impl.client.IdleConnectionEvictor$1.run(IdleConnectionEvictor.java:66) at java.lang.Thread.run(Thread.java:745) 23) Thread[id=177087, name=Connection evictor, state=TIMED_WAITING, group=TGRP-CdcrReplicationDistributedZkTest] at java.lang.Thread.sleep(Native Method) at org.apache.http.impl.client.IdleConnectionEvictor$1.run(IdleConnectionEvictor.java:66) at java.lang.Thread.run(Thread.java:745) 24) Thread[id=186564, name=Connection evictor, state=TIMED_WAITING, group=TGRP-CdcrReplicationDistributedZkTest] at java.lang.Thread.sleep(Native Method) at org.apache.http.impl.client.IdleConnectionEvictor$1.run(IdleConnectionEvictor.java:66) at java.lang.Thread.run(Thread.java:745) 25) Thread[id=176401, name=Connection evictor, state=TIMED_WAITING, group=TGRP-CdcrReplicationDistributedZkTest] at java.lang.Thread.sleep(Native Method) at org.apache.http.impl.client.IdleConnectionEvictor$1.run(IdleConnectionEvictor.java:66) at java.lang.Thread.run(Thread.java:745) 26) Thread[id=186105, name=Connection evictor, state=TIMED_WAITING, group=TGRP-CdcrReplicationDistributedZkTest] at java.lang.Thread.sleep(Native Method) at org.apache.http.impl.client.IdleConnectionEvictor$1.run(IdleConnectionEvictor.java:66) at java.lang.Thread.run(Thread.java:745) 27) Thread[id=176684, name=Connection evictor, state=TIMED_WAITING, group=TGRP-CdcrReplicationDistributedZkTest] at java.lang.Thread.sleep(Native Method) at org.apache.http.impl.client.IdleConnectionEvictor$1.run(IdleConnectionEvictor.java:66) at java.lang.Thread.run(Thread.java:745) 28) Thread[id=186104, name=Connection evictor, state=TIMED_WAITING, group=TGRP-CdcrReplicationDistributedZkTest] at java.lang.Thread.sleep(Native Method) at org.apache.http.impl.client.IdleConnectionEvictor$1.run(IdleConnectionEvictor.java:66) at java.lang.Thread.run(Thread.java:745) 29) Thread[id=186103, name=Connection evictor, state=TIMED_WAITING, group=TGRP-CdcrReplicationDistributedZkTest] at java.lang.Thread.sleep(Native Method) at org.apache.http.impl.client.IdleConnectionEvictor$1.run(IdleConnectionEvictor.java:66) at java.lang.Thread.run(Thread.java:745) 30) Thread[id=180452, name=Connection evictor, state=TIMED_WAITING, group=TGRP-CdcrReplicationDistributedZkTest] at java.lang.Thread.sleep(Native Method) at org.apache.http.impl.client.IdleConnectionEvictor$1.run(IdleConnectionEvictor.java:66) at java.lang.Thread.run(Thread.java:745) 31) Thread[id=186565, name=Connection evictor, state=TIMED_WAITING, group=TGRP-CdcrReplicationDistributedZkTest] at java.lang.Thread.sleep(Native Method) at org.apache.http.impl.client.IdleConnectionEvictor$1.run(IdleConnectionEvictor.java:66) at java.lang.Thread.run(Thread.java:745) 32) Thread[id=179742, name=Connection evictor, state=TIMED_WAITING, group=TGRP-CdcrReplicationDistributedZkTest] at java.lang.Thread.sleep(Native Method) at org.apache.http.impl.client.IdleConnectionEvictor$1.run(IdleConnectionEvictor.java:66) at java.lang.Thread.run(Thread.java:745) 33) Thread[id=180453, name=Connection evictor, state=TIMED_WAITING, group=TGRP-CdcrReplicationDistributedZkTest] at java.lang.Thread.sleep(Native Method) at org.apache.http.impl.client.IdleConnectionEvictor$1.run(IdleConnectionEvictor.java:66) at java.lang.Thread.run(Thread.java:745) 34) Thread[id=176399, name=Connection evictor, state=TIMED_WAITING, group=TGRP-CdcrReplicationDistributedZkTest] at java.lang.Thread.sleep(Native Method) at org.apache.http.impl.client.IdleConnectionEvictor$1.run(IdleConnectionEvictor.java:66) at java.lang.Thread.run(Thread.java:745) 35) Thread[id=176402, name=Connection evictor, state=TIMED_WAITING, group=TGRP-CdcrReplicationDistributedZkTest] at java.lang.Thread.sleep(Native Method) at org.apache.http.impl.client.IdleConnectionEvictor$1.run(IdleConnectionEvictor.java:66) at java.lang.Thread.run(Thread.java:745) 36) Thread[id=180221, name=Connection evictor, state=TIMED_WAITING, group=TGRP-CdcrReplicationDistributedZkTest] at java.lang.Thread.sleep(Native Method) at org.apache.http.impl.client.IdleConnectionEvictor$1.run(IdleConnectionEvictor.java:66) at java.lang.Thread.run(Thread.java:745) 37) Thread[id=180451, name=Connection evictor, state=TIMED_WAITING, group=TGRP-CdcrReplicationDistributedZkTest] at java.lang.Thread.sleep(Native Method) at org.apache.http.impl.client.IdleConnectionEvictor$1.run(IdleConnectionEvictor.java:66) at java.lang.Thread.run(Thread.java:745) 38) Thread[id=183499, name=Connection evictor, state=TIMED_WAITING, group=TGRP-CdcrReplicationDistributedZkTest] at java.lang.Thread.sleep(Native Method) at org.apache.http.impl.client.IdleConnectionEvictor$1.run(IdleConnectionEvictor.java:66) at java.lang.Thread.run(Thread.java:745) 39) Thread[id=177085, name=Connection evictor, state=TIMED_WAITING, group=TGRP-CdcrReplicationDistributedZkTest] at java.lang.Thread.sleep(Native Method) at org.apache.http.impl.client.IdleConnectionEvictor$1.run(IdleConnectionEvictor.java:66) at java.lang.Thread.run(Thread.java:745) 40) Thread[id=176855, name=Connection evictor, state=TIMED_WAITING, group=TGRP-CdcrReplicationDistributedZkTest] at java.lang.Thread.sleep(Native Method) at org.apache.http.impl.client.IdleConnectionEvictor$1.run(IdleConnectionEvictor.java:66) at java.lang.Thread.run(Thread.java:745) 41) Thread[id=183497, name=Connection evictor, state=TIMED_WAITING, group=TGRP-CdcrReplicationDistributedZkTest] at java.lang.Thread.sleep(Native Method) at org.apache.http.impl.client.IdleConnectionEvictor$1.run(IdleConnectionEvictor.java:66) at java.lang.Thread.run(Thread.java:745) 42) Thread[id=184948, name=Connection evictor, state=TIMED_WAITING, group=TGRP-CdcrReplicationDistributedZkTest] at java.lang.Thread.sleep(Native Method) at org.apache.http.impl.client.IdleConnectionEvictor$1.run(IdleConnectionEvictor.java:66) at java.lang.Thread.run(Thread.java:745) 43) Thread[id=186563, name=Connection evictor, state=TIMED_WAITING, group=TGRP-CdcrReplicationDistributedZkTest] at java.lang.Thread.sleep(Native Method) at org.apache.http.impl.client.IdleConnectionEvictor$1.run(IdleConnectionEvictor.java:66) at java.lang.Thread.run(Thread.java:745) 44) Thread[id=176685, name=Connection evictor, state=TIMED_WAITING, group=TGRP-CdcrReplicationDistributedZkTest] at java.lang.Thread.sleep(Native Method) at org.apache.http.impl.client.IdleConnectionEvictor$1.run(IdleConnectionEvictor.java:66) at java.lang.Thread.run(Thread.java:745) 45) Thread[id=179744, name=Connection evictor, state=TIMED_WAITING, group=TGRP-CdcrReplicationDistributedZkTest] at java.lang.Thread.sleep(Native Method) at org.apache.http.impl.client.IdleConnectionEvictor$1.run(IdleConnectionEvictor.java:66) at java.lang.Thread.run(Thread.java:745) 46) Thread[id=176858, name=Connection evictor, state=TIMED_WAITING, group=TGRP-CdcrReplicationDistributedZkTest] at java.lang.Thread.sleep(Native Method) at org.apache.http.impl.client.IdleConnectionEvictor$1.run(IdleConnectionEvictor.java:66) at java.lang.Thread.run(Thread.java:745) 47) Thread[id=183500, name=Connection evictor, state=TIMED_WAITING, group=TGRP-CdcrReplicationDistributedZkTest] at java.lang.Thread.sleep(Native Method) at org.apache.http.impl.client.IdleConnectionEvictor$1.run(IdleConnectionEvictor.java:66) at java.lang.Thread.run(Thread.java:745) 48) Thread[id=176400, name=Connection evictor, state=TIMED_WAITING, group=TGRP-CdcrReplicationDistributedZkTest] at java.lang.Thread.sleep(Native Method) at org.apache.http.impl.client.IdleConnectionEvictor$1.run(IdleConnectionEvictor.java:66) at java.lang.Thread.run(Thread.java:745)
Stack Trace:
com.carrotsearch.randomizedtesting.ThreadLeakError: 48 threads leaked from SUITE scope at org.apache.solr.cloud.CdcrReplicationDistributedZkTest:
1) Thread[id=179741, name=Connection evictor, state=TIMED_WAITING, group=TGRP-CdcrReplicationDistributedZkTest]
at java.lang.Thread.sleep(Native Method)
at org.apache.http.impl.client.IdleConnectionEvictor$1.run(IdleConnectionEvictor.java:66)
at java.lang.Thread.run(Thread.java:745)
2) Thread[id=180089, name=Connection evictor, state=TIMED_WAITING, group=TGRP-CdcrReplicationDistributedZkTest]
at java.lang.Thread.sleep(Native Method)
at org.apache.http.impl.client.IdleConnectionEvictor$1.run(IdleConnectionEvictor.java:66)
at java.lang.Thread.run(Thread.java:745)
3) Thread[id=176857, name=Connection evictor, state=TIMED_WAITING, group=TGRP-CdcrReplicationDistributedZkTest]
at java.lang.Thread.sleep(Native Method)
at org.apache.http.impl.client.IdleConnectionEvictor$1.run(IdleConnectionEvictor.java:66)
at java.lang.Thread.run(Thread.java:745)
4) Thread[id=180220, name=Connection evictor, state=TIMED_WAITING, group=TGRP-CdcrReplicationDistributedZkTest]
at java.lang.Thread.sleep(Native Method)
at org.apache.http.impl.client.IdleConnectionEvictor$1.run(IdleConnectionEvictor.java:66)
at java.lang.Thread.run(Thread.java:745)
5) Thread[id=183498, name=Connection evictor, state=TIMED_WAITING, group=TGRP-CdcrReplicationDistributedZkTest]
at java.lang.Thread.sleep(Native Method)
at org.apache.http.impl.client.IdleConnectionEvictor$1.run(IdleConnectionEvictor.java:66)
at java.lang.Thread.run(Thread.java:745)
6) Thread[id=176687, name=Connection evictor, state=TIMED_WAITING, group=TGRP-CdcrReplicationDistributedZkTest]
at java.lang.Thread.sleep(Native Method)
at org.apache.http.impl.client.IdleConnectionEvictor$1.run(IdleConnectionEvictor.java:66)
at java.lang.Thread.run(Thread.java:745)
7) Thread[id=176856, name=Connection evictor, state=TIMED_WAITING, group=TGRP-CdcrReplicationDistributedZkTest]
at java.lang.Thread.sleep(Native Method)
at org.apache.http.impl.client.IdleConnectionEvictor$1.run(IdleConnectionEvictor.java:66)
at java.lang.Thread.run(Thread.java:745)
8) Thread[id=184949, name=Connection evictor, state=TIMED_WAITING, group=TGRP-CdcrReplicationDistributedZkTest]
at java.lang.Thread.sleep(Native Method)
at org.apache.http.impl.client.IdleConnectionEvictor$1.run(IdleConnectionEvictor.java:66)
at java.lang.Thread.run(Thread.java:745)
9) Thread[id=177086, name=Connection evictor, state=TIMED_WAITING, group=TGRP-CdcrReplicationDistributedZkTest]
at java.lang.Thread.sleep(Native Method)
at org.apache.http.impl.client.IdleConnectionEvictor$1.run(IdleConnectionEvictor.java:66)
at java.lang.Thread.run(Thread.java:745)
10) Thread[id=184950, name=Connection evictor, state=TIMED_WAITING, group=TGRP-CdcrReplicationDistributedZkTest]
at java.lang.Thread.sleep(Native Method)
at org.apache.http.impl.client.IdleConnectionEvictor$1.run(IdleConnectionEvictor.java:66)
at java.lang.Thread.run(Thread.java:745)
11) Thread[id=186106, name=Connection evictor, state=TIMED_WAITING, group=TGRP-CdcrReplicationDistributedZkTest]
at java.lang.Thread.sleep(Native Method)
at org.apache.http.impl.client.IdleConnectionEvictor$1.run(IdleConnectionEvictor.java:66)
at java.lang.Thread.run(Thread.java:745)
12) Thread[id=180092, name=Connection evictor, state=TIMED_WAITING, group=TGRP-CdcrReplicationDistributedZkTest]
at java.lang.Thread.sleep(Native Method)
at org.apache.http.impl.client.IdleConnectionEvictor$1.run(IdleConnectionEvictor.java:66)
at java.lang.Thread.run(Thread.java:745)
13) Thread[id=176688, name=Connection evictor, state=TIMED_WAITING, group=TGRP-CdcrReplicationDistributedZkTest]
at java.lang.Thread.sleep(Native Method)
at org.apache.http.impl.client.IdleConnectionEvictor$1.run(IdleConnectionEvictor.java:66)
at java.lang.Thread.run(Thread.java:745)
14) Thread[id=177088, name=Connection evictor, state=TIMED_WAITING, group=TGRP-CdcrReplicationDistributedZkTest]
at java.lang.Thread.sleep(Native Method)
at org.apache.http.impl.client.IdleConnectionEvictor$1.run(IdleConnectionEvictor.java:66)
at java.lang.Thread.run(Thread.java:745)
15) Thread[id=180454, name=Connection evictor, state=TIMED_WAITING, group=TGRP-CdcrReplicationDistributedZkTest]
at java.lang.Thread.sleep(Native Method)
at org.apache.http.impl.client.IdleConnectionEvictor$1.run(IdleConnectionEvictor.java:66)
at java.lang.Thread.run(Thread.java:745)
16) Thread[id=180222, name=Connection evictor, state=TIMED_WAITING, group=TGRP-CdcrReplicationDistributedZkTest]
at java.lang.Thread.sleep(Native Method)
at org.apache.http.impl.client.IdleConnectionEvictor$1.run(IdleConnectionEvictor.java:66)
at java.lang.Thread.run(Thread.java:745)
17) Thread[id=180091, name=Connection evictor, state=TIMED_WAITING, group=TGRP-CdcrReplicationDistributedZkTest]
at java.lang.Thread.sleep(Native Method)
at org.apache.http.impl.client.IdleConnectionEvictor$1.run(IdleConnectionEvictor.java:66)
at java.lang.Thread.run(Thread.java:745)
18) Thread[id=186562, name=Connection evictor, state=TIMED_WAITING, group=TGRP-CdcrReplicationDistributedZkTest]
at java.lang.Thread.sleep(Native Method)
at org.apache.http.impl.client.IdleConnectionEvictor$1.run(IdleConnectionEvictor.java:66)
at java.lang.Thread.run(Thread.java:745)
19) Thread[id=180219, name=Connection evictor, state=TIMED_WAITING, group=TGRP-CdcrReplicationDistributedZkTest]
at java.lang.Thread.sleep(Native Method)
at org.apache.http.impl.client.IdleConnectionEvictor$1.run(IdleConnectionEvictor.java:66)
at java.lang.Thread.run(Thread.java:745)
20) Thread[id=184947, name=Connection evictor, state=TIMED_WAITING, group=TGRP-CdcrReplicationDistributedZkTest]
at java.lang.Thread.sleep(Native Method)
at org.apache.http.impl.client.IdleConnectionEvictor$1.run(IdleConnectionEvictor.java:66)
at java.lang.Thread.run(Thread.java:745)
21) Thread[id=179743, name=Connection evictor, state=TIMED_WAITING, group=TGRP-CdcrReplicationDistributedZkTest]
at java.lang.Thread.sleep(Native Method)
at org.apache.http.impl.client.IdleConnectionEvictor$1.run(IdleConnectionEvictor.java:66)
at java.lang.Thread.run(Thread.java:745)
22) Thread[id=180088, name=Connection evictor, state=TIMED_WAITING, group=TGRP-CdcrReplicationDistributedZkTest]
at java.lang.Thread.sleep(Native Method)
at org.apache.http.impl.client.IdleConnectionEvictor$1.run(IdleConnectionEvictor.java:66)
at java.lang.Thread.run(Thread.java:745)
23) Thread[id=177087, name=Connection evictor, state=TIMED_WAITING, group=TGRP-CdcrReplicationDistributedZkTest]
at java.lang.Thread.sleep(Native Method)
at org.apache.http.impl.client.IdleConnectionEvictor$1.run(IdleConnectionEvictor.java:66)
at java.lang.Thread.run(Thread.java:745)
24) Thread[id=186564, name=Connection evictor, state=TIMED_WAITING, group=TGRP-CdcrReplicationDistributedZkTest]
at java.lang.Thread.sleep(Native Method)
at org.apache.http.impl.client.IdleConnectionEvictor$1.run(IdleConnectionEvictor.java:66)
at java.lang.Thread.run(Thread.java:745)
25) Thread[id=176401, name=Connection evictor, state=TIMED_WAITING, group=TGRP-CdcrReplicationDistributedZkTest]
at java.lang.Thread.sleep(Native Method)
at org.apache.http.impl.client.IdleConnectionEvictor$1.run(IdleConnectionEvictor.java:66)
at java.lang.Thread.run(Thread.java:745)
26) Thread[id=186105, name=Connection evictor, state=TIMED_WAITING, group=TGRP-CdcrReplicationDistributedZkTest]
at java.lang.Thread.sleep(Native Method)
at org.apache.http.impl.client.IdleConnectionEvictor$1.run(IdleConnectionEvictor.java:66)
at java.lang.Thread.run(Thread.java:745)
27) Thread[id=176684, name=Connection evictor, state=TIMED_WAITING, group=TGRP-CdcrReplicationDistributedZkTest]
at java.lang.Thread.sleep(Native Method)
at org.apache.http.impl.client.IdleConnectionEvictor$1.run(IdleConnectionEvictor.java:66)
at java.lang.Thread.run(Thread.java:745)
28) Thread[id=186104, name=Connection evictor, state=TIMED_WAITING, group=TGRP-CdcrReplicationDistributedZkTest]
at java.lang.Thread.sleep(Native Method)
at org.apache.http.impl.client.IdleConnectionEvictor$1.run(IdleConnectionEvictor.java:66)
at java.lang.Thread.run(Thread.java:745)
29) Thread[id=186103, name=Connection evictor, state=TIMED_WAITING, group=TGRP-CdcrReplicationDistributedZkTest]
at java.lang.Thread.sleep(Native Method)
at org.apache.http.impl.client.IdleConnectionEvictor$1.run(IdleConnectionEvictor.java:66)
at java.lang.Thread.run(Thread.java:745)
30) Thread[id=180452, name=Connection evictor, state=TIMED_WAITING, group=TGRP-CdcrReplicationDistributedZkTest]
at java.lang.Thread.sleep(Native Method)
at org.apache.http.impl.client.IdleConnectionEvictor$1.run(IdleConnectionEvictor.java:66)
at java.lang.Thread.run(Thread.java:745)
31) Thread[id=186565, name=Connection evictor, state=TIMED_WAITING, group=TGRP-CdcrReplicationDistributedZkTest]
at java.lang.Thread.sleep(Native Method)
at org.apache.http.impl.client.IdleConnectionEvictor$1.run(IdleConnectionEvictor.java:66)
at java.lang.Thread.run(Thread.java:745)
32) Thread[id=179742, name=Connection evictor, state=TIMED_WAITING, group=TGRP-CdcrReplicationDistributedZkTest]
at java.lang.Thread.sleep(Native Method)
at org.apache.http.impl.client.IdleConnectionEvictor$1.run(IdleConnectionEvictor.java:66)
at java.lang.Thread.run(Thread.java:745)
33) Thread[id=180453, name=Connection evictor, state=TIMED_WAITING, group=TGRP-CdcrReplicationDistributedZkTest]
at java.lang.Thread.sleep(Native Method)
at org.apache.http.impl.client.IdleConnectionEvictor$1.run(IdleConnectionEvictor.java:66)
at java.lang.Thread.run(Thread.java:745)
34) Thread[id=176399, name=Connection evictor, state=TIMED_WAITING, group=TGRP-CdcrReplicationDistributedZkTest]
at java.lang.Thread.sleep(Native Method)
at org.apache.http.impl.client.IdleConnectionEvictor$1.run(IdleConnectionEvictor.java:66)
at java.lang.Thread.run(Thread.java:745)
35) Thread[id=176402, name=Connection evictor, state=TIMED_WAITING, group=TGRP-CdcrReplicationDistributedZkTest]
at java.lang.Thread.sleep(Native Method)
at org.apache.http.impl.client.IdleConnectionEvictor$1.run(IdleConnectionEvictor.java:66)
at java.lang.Thread.run(Thread.java:745)
36) Thread[id=180221, name=Connection evictor, state=TIMED_WAITING, group=TGRP-CdcrReplicationDistributedZkTest]
at java.lang.Thread.sleep(Native Method)
at org.apache.http.impl.client.IdleConnectionEvictor$1.run(IdleConnectionEvictor.java:66)
at java.lang.Thread.run(Thread.java:745)
37) Thread[id=180451, name=Connection evictor, state=TIMED_WAITING, group=TGRP-CdcrReplicationDistributedZkTest]
at java.lang.Thread.sleep(Native Method)
at org.apache.http.impl.client.IdleConnectionEvictor$1.run(IdleConnectionEvictor.java:66)
at java.lang.Thread.run(Thread.java:745)
38) Thread[id=183499, name=Connection evictor, state=TIMED_WAITING, group=TGRP-CdcrReplicationDistributedZkTest]
at java.lang.Thread.sleep(Native Method)
at org.apache.http.impl.client.IdleConnectionEvictor$1.run(IdleConnectionEvictor.java:66)
at java.lang.Thread.run(Thread.java:745)
39) Thread[id=177085, name=Connection evictor, state=TIMED_WAITING, group=TGRP-CdcrReplicationDistributedZkTest]
at java.lang.Thread.sleep(Native Method)
at org.apache.http.impl.client.IdleConnectionEvictor$1.run(IdleConnectionEvictor.java:66)
at java.lang.Thread.run(Thread.java:745)
40) Thread[id=176855, name=Connection evictor, state=TIMED_WAITING, group=TGRP-CdcrReplicationDistributedZkTest]
at java.lang.Thread.sleep(Native Method)
at org.apache.http.impl.client.IdleConnectionEvictor$1.run(IdleConnectionEvictor.java:66)
at java.lang.Thread.run(Thread.java:745)
41) Thread[id=183497, name=Connection evictor, state=TIMED_WAITING, group=TGRP-CdcrReplicationDistributedZkTest]
at java.lang.Thread.sleep(Native Method)
at org.apache.http.impl.client.IdleConnectionEvictor$1.run(IdleConnectionEvictor.java:66)
at java.lang.Thread.run(Thread.java:745)
42) Thread[id=184948, name=Connection evictor, state=TIMED_WAITING, group=TGRP-CdcrReplicationDistributedZkTest]
at java.lang.Thread.sleep(Native Method)
at org.apache.http.impl.client.IdleConnectionEvictor$1.run(IdleConnectionEvictor.java:66)
at java.lang.Thread.run(Thread.java:745)
43) Thread[id=186563, name=Connection evictor, state=TIMED_WAITING, group=TGRP-CdcrReplicationDistributedZkTest]
at java.lang.Thread.sleep(Native Method)
at org.apache.http.impl.client.IdleConnectionEvictor$1.run(IdleConnectionEvictor.java:66)
at java.lang.Thread.run(Thread.java:745)
44) Thread[id=176685, name=Connection evictor, state=TIMED_WAITING, group=TGRP-CdcrReplicationDistributedZkTest]
at java.lang.Thread.sleep(Native Method)
at org.apache.http.impl.client.IdleConnectionEvictor$1.run(IdleConnectionEvictor.java:66)
at java.lang.Thread.run(Thread.java:745)
45) Thread[id=179744, name=Connection evictor, state=TIMED_WAITING, group=TGRP-CdcrReplicationDistributedZkTest]
at java.lang.Thread.sleep(Native Method)
at org.apache.http.impl.client.IdleConnectionEvictor$1.run(IdleConnectionEvictor.java:66)
at java.lang.Thread.run(Thread.java:745)
46) Thread[id=176858, name=Connection evictor, state=TIMED_WAITING, group=TGRP-CdcrReplicationDistributedZkTest]
at java.lang.Thread.sleep(Native Method)
at org.apache.http.impl.client.IdleConnectionEvictor$1.run(IdleConnectionEvictor.java:66)
at java.lang.Thread.run(Thread.java:745)
47) Thread[id=183500, name=Connection evictor, state=TIMED_WAITING, group=TGRP-CdcrReplicationDistributedZkTest]
at java.lang.Thread.sleep(Native Method)
at org.apache.http.impl.client.IdleConnectionEvictor$1.run(IdleConnectionEvictor.java:66)
at java.lang.Thread.run(Thread.java:745)
48) Thread[id=176400, name=Connection evictor, state=TIMED_WAITING, group=TGRP-CdcrReplicationDistributedZkTest]
at java.lang.Thread.sleep(Native Method)
at org.apache.http.impl.client.IdleConnectionEvictor$1.run(IdleConnectionEvictor.java:66)
at java.lang.Thread.run(Thread.java:745)
at __randomizedtesting.SeedInfo.seed([7FF2899D3F00B9D7]:0)
FAILED: junit.framework.TestSuite.org.apache.solr.cloud.CdcrRequestHandlerTest
Error Message:
ObjectTracker found 8 object(s) that were not released!!! [InternalHttpClient, InternalHttpClient, InternalHttpClient, InternalHttpClient, InternalHttpClient, InternalHttpClient, InternalHttpClient, InternalHttpClient]
Stack Trace:
java.lang.AssertionError: ObjectTracker found 8 object(s) that were not released!!! [InternalHttpClient, InternalHttpClient, InternalHttpClient, InternalHttpClient, InternalHttpClient, InternalHttpClient, InternalHttpClient, InternalHttpClient]
at __randomizedtesting.SeedInfo.seed([7FF2899D3F00B9D7]:0)
at org.junit.Assert.fail(Assert.java:93)
at org.junit.Assert.assertTrue(Assert.java:43)
at org.junit.Assert.assertNull(Assert.java:551)
at org.apache.solr.SolrTestCaseJ4.afterClass(SolrTestCaseJ4.java:255)
at sun.reflect.NativeMethodAccessorImpl.invoke0(Native Method)
at sun.reflect.NativeMethodAccessorImpl.invoke(NativeMethodAccessorImpl.java:62)
at sun.reflect.DelegatingMethodAccessorImpl.invoke(DelegatingMethodAccessorImpl.java:43)
at java.lang.reflect.Method.invoke(Method.java:498)
at com.carrotsearch.randomizedtesting.RandomizedRunner.invoke(RandomizedRunner.java:1764)
at com.carrotsearch.randomizedtesting.RandomizedRunner$7.evaluate(RandomizedRunner.java:834)
at com.carrotsearch.randomizedtesting.rules.StatementAdapter.evaluate(StatementAdapter.java:36)
at com.carrotsearch.randomizedtesting.rules.SystemPropertiesRestoreRule$1.evaluate(SystemPropertiesRestoreRule.java:57)
at org.apache.lucene.util.AbstractBeforeAfterRule$1.evaluate(AbstractBeforeAfterRule.java:45)
at com.carrotsearch.randomizedtesting.rules.StatementAdapter.evaluate(StatementAdapter.java:36)
at org.apache.lucene.util.TestRuleStoreClassName$1.evaluate(TestRuleStoreClassName.java:41)
at com.carrotsearch.randomizedtesting.rules.NoShadowingOrOverridesOnMethodsRule$1.evaluate(NoShadowingOrOverridesOnMethodsRule.java:40)
at com.carrotsearch.randomizedtesting.rules.NoShadowingOrOverridesOnMethodsRule$1.evaluate(NoShadowingOrOverridesOnMethodsRule.java:40)
at com.carrotsearch.randomizedtesting.rules.StatementAdapter.evaluate(StatementAdapter.java:36)
at com.carrotsearch.randomizedtesting.rules.StatementAdapter.evaluate(StatementAdapter.java:36)
at com.carrotsearch.randomizedtesting.rules.StatementAdapter.evaluate(StatementAdapter.java:36)
at org.apache.lucene.util.TestRuleAssertionsRequired$1.evaluate(TestRuleAssertionsRequired.java:53)
at org.apache.lucene.util.TestRuleMarkFailure$1.evaluate(TestRuleMarkFailure.java:47)
at org.apache.lucene.util.TestRuleIgnoreAfterMaxFailures$1.evaluate(TestRuleIgnoreAfterMaxFailures.java:64)
at org.apache.lucene.util.TestRuleIgnoreTestSuites$1.evaluate(TestRuleIgnoreTestSuites.java:54)
at com.carrotsearch.randomizedtesting.rules.StatementAdapter.evaluate(StatementAdapter.java:36)
at com.carrotsearch.randomizedtesting.ThreadLeakControl$StatementRunner.run(ThreadLeakControl.java:367)
at java.lang.Thread.run(Thread.java:745)
FAILED: junit.framework.TestSuite.org.apache.solr.cloud.CdcrRequestHandlerTest
Error Message:
8 threads leaked from SUITE scope at org.apache.solr.cloud.CdcrRequestHandlerTest: 1) Thread[id=69678, name=Connection evictor, state=TIMED_WAITING, group=TGRP-CdcrRequestHandlerTest] at java.lang.Thread.sleep(Native Method) at org.apache.http.impl.client.IdleConnectionEvictor$1.run(IdleConnectionEvictor.java:66) at java.lang.Thread.run(Thread.java:745) 2) Thread[id=69314, name=Connection evictor, state=TIMED_WAITING, group=TGRP-CdcrRequestHandlerTest] at java.lang.Thread.sleep(Native Method) at org.apache.http.impl.client.IdleConnectionEvictor$1.run(IdleConnectionEvictor.java:66) at java.lang.Thread.run(Thread.java:745) 3) Thread[id=69676, name=Connection evictor, state=TIMED_WAITING, group=TGRP-CdcrRequestHandlerTest] at java.lang.Thread.sleep(Native Method) at org.apache.http.impl.client.IdleConnectionEvictor$1.run(IdleConnectionEvictor.java:66) at java.lang.Thread.run(Thread.java:745) 4) Thread[id=69679, name=Connection evictor, state=TIMED_WAITING, group=TGRP-CdcrRequestHandlerTest] at java.lang.Thread.sleep(Native Method) at org.apache.http.impl.client.IdleConnectionEvictor$1.run(IdleConnectionEvictor.java:66) at java.lang.Thread.run(Thread.java:745) 5) Thread[id=69316, name=Connection evictor, state=TIMED_WAITING, group=TGRP-CdcrRequestHandlerTest] at java.lang.Thread.sleep(Native Method) at org.apache.http.impl.client.IdleConnectionEvictor$1.run(IdleConnectionEvictor.java:66) at java.lang.Thread.run(Thread.java:745) 6) Thread[id=69313, name=Connection evictor, state=TIMED_WAITING, group=TGRP-CdcrRequestHandlerTest] at java.lang.Thread.sleep(Native Method) at org.apache.http.impl.client.IdleConnectionEvictor$1.run(IdleConnectionEvictor.java:66) at java.lang.Thread.run(Thread.java:745) 7) Thread[id=69315, name=Connection evictor, state=TIMED_WAITING, group=TGRP-CdcrRequestHandlerTest] at java.lang.Thread.sleep(Native Method) at org.apache.http.impl.client.IdleConnectionEvictor$1.run(IdleConnectionEvictor.java:66) at java.lang.Thread.run(Thread.java:745) 8) Thread[id=69677, name=Connection evictor, state=TIMED_WAITING, group=TGRP-CdcrRequestHandlerTest] at java.lang.Thread.sleep(Native Method) at org.apache.http.impl.client.IdleConnectionEvictor$1.run(IdleConnectionEvictor.java:66) at java.lang.Thread.run(Thread.java:745)
Stack Trace:
com.carrotsearch.randomizedtesting.ThreadLeakError: 8 threads leaked from SUITE scope at org.apache.solr.cloud.CdcrRequestHandlerTest:
1) Thread[id=69678, name=Connection evictor, state=TIMED_WAITING, group=TGRP-CdcrRequestHandlerTest]
at java.lang.Thread.sleep(Native Method)
at org.apache.http.impl.client.IdleConnectionEvictor$1.run(IdleConnectionEvictor.java:66)
at java.lang.Thread.run(Thread.java:745)
2) Thread[id=69314, name=Connection evictor, state=TIMED_WAITING, group=TGRP-CdcrRequestHandlerTest]
at java.lang.Thread.sleep(Native Method)
at org.apache.http.impl.client.IdleConnectionEvictor$1.run(IdleConnectionEvictor.java:66)
at java.lang.Thread.run(Thread.java:745)
3) Thread[id=69676, name=Connection evictor, state=TIMED_WAITING, group=TGRP-CdcrRequestHandlerTest]
at java.lang.Thread.sleep(Native Method)
at org.apache.http.impl.client.IdleConnectionEvictor$1.run(IdleConnectionEvictor.java:66)
at java.lang.Thread.run(Thread.java:745)
4) Thread[id=69679, name=Connection evictor, state=TIMED_WAITING, group=TGRP-CdcrRequestHandlerTest]
at java.lang.Thread.sleep(Native Method)
at org.apache.http.impl.client.IdleConnectionEvictor$1.run(IdleConnectionEvictor.java:66)
at java.lang.Thread.run(Thread.java:745)
5) Thread[id=69316, name=Connection evictor, state=TIMED_WAITING, group=TGRP-CdcrRequestHandlerTest]
at java.lang.Thread.sleep(Native Method)
at org.apache.http.impl.client.IdleConnectionEvictor$1.run(IdleConnectionEvictor.java:66)
at java.lang.Thread.run(Thread.java:745)
6) Thread[id=69313, name=Connection evictor, state=TIMED_WAITING, group=TGRP-CdcrRequestHandlerTest]
at java.lang.Thread.sleep(Native Method)
at org.apache.http.impl.client.IdleConnectionEvictor$1.run(IdleConnectionEvictor.java:66)
at java.lang.Thread.run(Thread.java:745)
7) Thread[id=69315, name=Connection evictor, state=TIMED_WAITING, group=TGRP-CdcrRequestHandlerTest]
at java.lang.Thread.sleep(Native Method)
at org.apache.http.impl.client.IdleConnectionEvictor$1.run(IdleConnectionEvictor.java:66)
at java.lang.Thread.run(Thread.java:745)
8) Thread[id=69677, name=Connection evictor, state=TIMED_WAITING, group=TGRP-CdcrRequestHandlerTest]
at java.lang.Thread.sleep(Native Method)
at org.apache.http.impl.client.IdleConnectionEvictor$1.run(IdleConnectionEvictor.java:66)
at java.lang.Thread.run(Thread.java:745)
at __randomizedtesting.SeedInfo.seed([7FF2899D3F00B9D7]:0)
FAILED: junit.framework.TestSuite.org.apache.solr.cloud.ConcurrentDeleteAndCreateCollectionTest
Error Message:
ObjectTracker found 10 object(s) that were not released!!! [InternalHttpClient, InternalHttpClient, InternalHttpClient, InternalHttpClient, InternalHttpClient, InternalHttpClient, InternalHttpClient, InternalHttpClient, InternalHttpClient, InternalHttpClient]
Stack Trace:
java.lang.AssertionError: ObjectTracker found 10 object(s) that were not released!!! [InternalHttpClient, InternalHttpClient, InternalHttpClient, InternalHttpClient, InternalHttpClient, InternalHttpClient, InternalHttpClient, InternalHttpClient, InternalHttpClient, InternalHttpClient]
at __randomizedtesting.SeedInfo.seed([7FF2899D3F00B9D7]:0)
at org.junit.Assert.fail(Assert.java:93)
at org.junit.Assert.assertTrue(Assert.java:43)
at org.junit.Assert.assertNull(Assert.java:551)
at org.apache.solr.SolrTestCaseJ4.afterClass(SolrTestCaseJ4.java:255)
at sun.reflect.GeneratedMethodAccessor98.invoke(Unknown Source)
at sun.reflect.DelegatingMethodAccessorImpl.invoke(DelegatingMethodAccessorImpl.java:43)
at java.lang.reflect.Method.invoke(Method.java:498)
at com.carrotsearch.randomizedtesting.RandomizedRunner.invoke(RandomizedRunner.java:1764)
at com.carrotsearch.randomizedtesting.RandomizedRunner$7.evaluate(RandomizedRunner.java:834)
at com.carrotsearch.randomizedtesting.rules.StatementAdapter.evaluate(StatementAdapter.java:36)
at com.carrotsearch.randomizedtesting.rules.SystemPropertiesRestoreRule$1.evaluate(SystemPropertiesRestoreRule.java:57)
at org.apache.lucene.util.AbstractBeforeAfterRule$1.evaluate(AbstractBeforeAfterRule.java:45)
at com.carrotsearch.randomizedtesting.rules.StatementAdapter.evaluate(StatementAdapter.java:36)
at org.apache.lucene.util.TestRuleStoreClassName$1.evaluate(TestRuleStoreClassName.java:41)
at com.carrotsearch.randomizedtesting.rules.NoShadowingOrOverridesOnMethodsRule$1.evaluate(NoShadowingOrOverridesOnMethodsRule.java:40)
at com.carrotsearch.randomizedtesting.rules.NoShadowingOrOverridesOnMethodsRule$1.evaluate(NoShadowingOrOverridesOnMethodsRule.java:40)
at com.carrotsearch.randomizedtesting.rules.StatementAdapter.evaluate(StatementAdapter.java:36)
at com.carrotsearch.randomizedtesting.rules.StatementAdapter.evaluate(StatementAdapter.java:36)
at com.carrotsearch.randomizedtesting.rules.StatementAdapter.evaluate(StatementAdapter.java:36)
at org.apache.lucene.util.TestRuleAssertionsRequired$1.evaluate(TestRuleAssertionsRequired.java:53)
at org.apache.lucene.util.TestRuleMarkFailure$1.evaluate(TestRuleMarkFailure.java:47)
at org.apache.lucene.util.TestRuleIgnoreAfterMaxFailures$1.evaluate(TestRuleIgnoreAfterMaxFailures.java:64)
at org.apache.lucene.util.TestRuleIgnoreTestSuites$1.evaluate(TestRuleIgnoreTestSuites.java:54)
at com.carrotsearch.randomizedtesting.rules.StatementAdapter.evaluate(StatementAdapter.java:36)
at com.carrotsearch.randomizedtesting.ThreadLeakControl$StatementRunner.run(ThreadLeakControl.java:367)
at java.lang.Thread.run(Thread.java:745)
FAILED: junit.framework.TestSuite.org.apache.solr.cloud.ConcurrentDeleteAndCreateCollectionTest
Error Message:
10 threads leaked from SUITE scope at org.apache.solr.cloud.ConcurrentDeleteAndCreateCollectionTest: 1) Thread[id=76708, name=Connection evictor, state=TIMED_WAITING, group=TGRP-ConcurrentDeleteAndCreateCollectionTest] at java.lang.Thread.sleep(Native Method) at org.apache.http.impl.client.IdleConnectionEvictor$1.run(IdleConnectionEvictor.java:66) at java.lang.Thread.run(Thread.java:745) 2) Thread[id=76688, name=Connection evictor, state=TIMED_WAITING, group=TGRP-ConcurrentDeleteAndCreateCollectionTest] at java.lang.Thread.sleep(Native Method) at org.apache.http.impl.client.IdleConnectionEvictor$1.run(IdleConnectionEvictor.java:66) at java.lang.Thread.run(Thread.java:745) 3) Thread[id=76693, name=Connection evictor, state=TIMED_WAITING, group=TGRP-ConcurrentDeleteAndCreateCollectionTest] at java.lang.Thread.sleep(Native Method) at org.apache.http.impl.client.IdleConnectionEvictor$1.run(IdleConnectionEvictor.java:66) at java.lang.Thread.run(Thread.java:745) 4) Thread[id=76663, name=Connection evictor, state=TIMED_WAITING, group=TGRP-ConcurrentDeleteAndCreateCollectionTest] at java.lang.Thread.sleep(Native Method) at org.apache.http.impl.client.IdleConnectionEvictor$1.run(IdleConnectionEvictor.java:66) at java.lang.Thread.run(Thread.java:745) 5) Thread[id=76703, name=Connection evictor, state=TIMED_WAITING, group=TGRP-ConcurrentDeleteAndCreateCollectionTest] at java.lang.Thread.sleep(Native Method) at org.apache.http.impl.client.IdleConnectionEvictor$1.run(IdleConnectionEvictor.java:66) at java.lang.Thread.run(Thread.java:745) 6) Thread[id=76678, name=Connection evictor, state=TIMED_WAITING, group=TGRP-ConcurrentDeleteAndCreateCollectionTest] at java.lang.Thread.sleep(Native Method) at org.apache.http.impl.client.IdleConnectionEvictor$1.run(IdleConnectionEvictor.java:66) at java.lang.Thread.run(Thread.java:745) 7) Thread[id=76683, name=Connection evictor, state=TIMED_WAITING, group=TGRP-ConcurrentDeleteAndCreateCollectionTest] at java.lang.Thread.sleep(Native Method) at org.apache.http.impl.client.IdleConnectionEvictor$1.run(IdleConnectionEvictor.java:66) at java.lang.Thread.run(Thread.java:745) 8) Thread[id=76668, name=Connection evictor, state=TIMED_WAITING, group=TGRP-ConcurrentDeleteAndCreateCollectionTest] at java.lang.Thread.sleep(Native Method) at org.apache.http.impl.client.IdleConnectionEvictor$1.run(IdleConnectionEvictor.java:66) at java.lang.Thread.run(Thread.java:745) 9) Thread[id=76673, name=Connection evictor, state=TIMED_WAITING, group=TGRP-ConcurrentDeleteAndCreateCollectionTest] at java.lang.Thread.sleep(Native Method) at org.apache.http.impl.client.IdleConnectionEvictor$1.run(IdleConnectionEvictor.java:66) at java.lang.Thread.run(Thread.java:745) 10) Thread[id=76698, name=Connection evictor, state=TIMED_WAITING, group=TGRP-ConcurrentDeleteAndCreateCollectionTest] at java.lang.Thread.sleep(Native Method) at org.apache.http.impl.client.IdleConnectionEvictor$1.run(IdleConnectionEvictor.java:66) at java.lang.Thread.run(Thread.java:745)
Stack Trace:
com.carrotsearch.randomizedtesting.ThreadLeakError: 10 threads leaked from SUITE scope at org.apache.solr.cloud.ConcurrentDeleteAndCreateCollectionTest:
1) Thread[id=76708, name=Connection evictor, state=TIMED_WAITING, group=TGRP-ConcurrentDeleteAndCreateCollectionTest]
at java.lang.Thread.sleep(Native Method)
at org.apache.http.impl.client.IdleConnectionEvictor$1.run(IdleConnectionEvictor.java:66)
at java.lang.Thread.run(Thread.java:745)
2) Thread[id=76688, name=Connection evictor, state=TIMED_WAITING, group=TGRP-ConcurrentDeleteAndCreateCollectionTest]
at java.lang.Thread.sleep(Native Method)
at org.apache.http.impl.client.IdleConnectionEvictor$1.run(IdleConnectionEvictor.java:66)
at java.lang.Thread.run(Thread.java:745)
3) Thread[id=76693, name=Connection evictor, state=TIMED_WAITING, group=TGRP-ConcurrentDeleteAndCreateCollectionTest]
at java.lang.Thread.sleep(Native Method)
at org.apache.http.impl.client.IdleConnectionEvictor$1.run(IdleConnectionEvictor.java:66)
at java.lang.Thread.run(Thread.java:745)
4) Thread[id=76663, name=Connection evictor, state=TIMED_WAITING, group=TGRP-ConcurrentDeleteAndCreateCollectionTest]
at java.lang.Thread.sleep(Native Method)
at org.apache.http.impl.client.IdleConnectionEvictor$1.run(IdleConnectionEvictor.java:66)
at java.lang.Thread.run(Thread.java:745)
5) Thread[id=76703, name=Connection evictor, state=TIMED_WAITING, group=TGRP-ConcurrentDeleteAndCreateCollectionTest]
at java.lang.Thread.sleep(Native Method)
at org.apache.http.impl.client.IdleConnectionEvictor$1.run(IdleConnectionEvictor.java:66)
at java.lang.Thread.run(Thread.java:745)
6) Thread[id=76678, name=Connection evictor, state=TIMED_WAITING, group=TGRP-ConcurrentDeleteAndCreateCollectionTest]
at java.lang.Thread.sleep(Native Method)
at org.apache.http.impl.client.IdleConnectionEvictor$1.run(IdleConnectionEvictor.java:66)
at java.lang.Thread.run(Thread.java:745)
7) Thread[id=76683, name=Connection evictor, state=TIMED_WAITING, group=TGRP-ConcurrentDeleteAndCreateCollectionTest]
at java.lang.Thread.sleep(Native Method)
at org.apache.http.impl.client.IdleConnectionEvictor$1.run(IdleConnectionEvictor.java:66)
at java.lang.Thread.run(Thread.java:745)
8) Thread[id=76668, name=Connection evictor, state=TIMED_WAITING, group=TGRP-ConcurrentDeleteAndCreateCollectionTest]
at java.lang.Thread.sleep(Native Method)
at org.apache.http.impl.client.IdleConnectionEvictor$1.run(IdleConnectionEvictor.java:66)
at java.lang.Thread.run(Thread.java:745)
9) Thread[id=76673, name=Connection evictor, state=TIMED_WAITING, group=TGRP-ConcurrentDeleteAndCreateCollectionTest]
at java.lang.Thread.sleep(Native Method)
at org.apache.http.impl.client.IdleConnectionEvictor$1.run(IdleConnectionEvictor.java:66)
at java.lang.Thread.run(Thread.java:745)
10) Thread[id=76698, name=Connection evictor, state=TIMED_WAITING, group=TGRP-ConcurrentDeleteAndCreateCollectionTest]
at java.lang.Thread.sleep(Native Method)
at org.apache.http.impl.client.IdleConnectionEvictor$1.run(IdleConnectionEvictor.java:66)
at java.lang.Thread.run(Thread.java:745)
at __randomizedtesting.SeedInfo.seed([7FF2899D3F00B9D7]:0)
Build Log:
[...truncated 11017 lines...]
[junit4] Suite: org.apache.solr.cloud.CdcrReplicationHandlerTest
[junit4] 2> Creating dataDir: /x1/jenkins/jenkins-slave/workspace/Lucene-Solr-NightlyTests-master/solr/build/solr-core/test/J1/temp/solr.cloud.CdcrReplicationHandlerTest_7FF2899D3F00B9D7-001/init-core-data-001
[junit4] 2> 14196 INFO (SUITE-CdcrReplicationHandlerTest-seed#[7FF2899D3F00B9D7]-worker) [ ] o.a.s.SolrTestCaseJ4 Randomized ssl (false) and clientAuth (false)
[junit4] 2> 14196 INFO (SUITE-CdcrReplicationHandlerTest-seed#[7FF2899D3F00B9D7]-worker) [ ] o.a.s.BaseDistributedSearchTestCase Setting hostContext system property: /w_ru/
[junit4] 2> 14200 INFO (TEST-CdcrReplicationHandlerTest.testReplicationWithBufferedUpdates-seed#[7FF2899D3F00B9D7]) [ ] o.a.s.c.ZkTestServer STARTING ZK TEST SERVER
[junit4] 2> 14201 INFO (Thread-24) [ ] o.a.s.c.ZkTestServer client port:0.0.0.0/0.0.0.0:0
[junit4] 2> 14201 INFO (Thread-24) [ ] o.a.s.c.ZkTestServer Starting server
[junit4] 2> 14301 INFO (TEST-CdcrReplicationHandlerTest.testReplicationWithBufferedUpdates-seed#[7FF2899D3F00B9D7]) [ ] o.a.s.c.ZkTestServer start zk server on port:46587
[junit4] 2> 14302 INFO (TEST-CdcrReplicationHandlerTest.testReplicationWithBufferedUpdates-seed#[7FF2899D3F00B9D7]) [ ] o.a.s.c.c.SolrZkClient Using default ZkCredentialsProvider
[junit4] 2> 14302 INFO (TEST-CdcrReplicationHandlerTest.testReplicationWithBufferedUpdates-seed#[7FF2899D3F00B9D7]) [ ] o.a.s.c.c.ConnectionManager Waiting for client to connect to ZooKeeper
[junit4] 2> 14304 INFO (zkCallback-48-thread-1) [ ] o.a.s.c.c.ConnectionManager Watcher org.apache.solr.common.cloud.ConnectionManager@3f1c5b6 name:ZooKeeperConnection Watcher:127.0.0.1:46587 got event WatchedEvent state:SyncConnected type:None path:null path:null type:None
[junit4] 2> 14304 INFO (TEST-CdcrReplicationHandlerTest.testReplicationWithBufferedUpdates-seed#[7FF2899D3F00B9D7]) [ ] o.a.s.c.c.ConnectionManager Client is connected to ZooKeeper
[junit4] 2> 14305 INFO (TEST-CdcrReplicationHandlerTest.testReplicationWithBufferedUpdates-seed#[7FF2899D3F00B9D7]) [ ] o.a.s.c.c.SolrZkClient Using default ZkACLProvider
[junit4] 2> 14305 INFO (TEST-CdcrReplicationHandlerTest.testReplicationWithBufferedUpdates-seed#[7FF2899D3F00B9D7]) [ ] o.a.s.c.c.SolrZkClient makePath: /solr
[junit4] 2> 14307 INFO (TEST-CdcrReplicationHandlerTest.testReplicationWithBufferedUpdates-seed#[7FF2899D3F00B9D7]) [ ] o.a.s.c.c.SolrZkClient Using default ZkCredentialsProvider
[junit4] 2> 14307 INFO (TEST-CdcrReplicationHandlerTest.testReplicationWithBufferedUpdates-seed#[7FF2899D3F00B9D7]) [ ] o.a.s.c.c.ConnectionManager Waiting for client to connect to ZooKeeper
[junit4] 2> 14309 INFO (zkCallback-49-thread-1) [ ] o.a.s.c.c.ConnectionManager Watcher org.apache.solr.common.cloud.ConnectionManager@5d689b06 name:ZooKeeperConnection Watcher:127.0.0.1:46587/solr got event WatchedEvent state:SyncConnected type:None path:null path:null type:None
[junit4] 2> 14309 INFO (TEST-CdcrReplicationHandlerTest.testReplicationWithBufferedUpdates-seed#[7FF2899D3F00B9D7]) [ ] o.a.s.c.c.ConnectionManager Client is connected to ZooKeeper
[junit4] 2> 14310 INFO (TEST-CdcrReplicationHandlerTest.testReplicationWithBufferedUpdates-seed#[7FF2899D3F00B9D7]) [ ] o.a.s.c.c.SolrZkClient Using default ZkACLProvider
[junit4] 2> 14310 INFO (TEST-CdcrReplicationHandlerTest.testReplicationWithBufferedUpdates-seed#[7FF2899D3F00B9D7]) [ ] o.a.s.c.c.SolrZkClient makePath: /collections/collection1
[junit4] 2> 14312 INFO (TEST-CdcrReplicationHandlerTest.testReplicationWithBufferedUpdates-seed#[7FF2899D3F00B9D7]) [ ] o.a.s.c.c.SolrZkClient makePath: /collections/collection1/shards
[junit4] 2> 14313 INFO (TEST-CdcrReplicationHandlerTest.testReplicationWithBufferedUpdates-seed#[7FF2899D3F00B9D7]) [ ] o.a.s.c.c.SolrZkClient makePath: /collections/control_collection
[junit4] 2> 14314 INFO (TEST-CdcrReplicationHandlerTest.testReplicationWithBufferedUpdates-seed#[7FF2899D3F00B9D7]) [ ] o.a.s.c.c.SolrZkClient makePath: /collections/control_collection/shards
[junit4] 2> 14315 INFO (TEST-CdcrReplicationHandlerTest.testReplicationWithBufferedUpdates-seed#[7FF2899D3F00B9D7]) [ ] o.a.s.c.AbstractZkTestCase put /x1/jenkins/jenkins-slave/workspace/Lucene-Solr-NightlyTests-master/solr/core/src/test-files/solr/collection1/conf/solrconfig-cdcr.xml to /configs/conf1/solrconfig.xml
[junit4] 2> 14315 INFO (TEST-CdcrReplicationHandlerTest.testReplicationWithBufferedUpdates-seed#[7FF2899D3F00B9D7]) [ ] o.a.s.c.c.SolrZkClient makePath: /configs/conf1/solrconfig.xml
[junit4] 2> 14319 INFO (TEST-CdcrReplicationHandlerTest.testReplicationWithBufferedUpdates-seed#[7FF2899D3F00B9D7]) [ ] o.a.s.c.AbstractZkTestCase put /x1/jenkins/jenkins-slave/workspace/Lucene-Solr-NightlyTests-master/solr/core/src/test-files/solr/collection1/conf/schema15.xml to /configs/conf1/schema.xml
[junit4] 2> 14320 INFO (TEST-CdcrReplicationHandlerTest.testReplicationWithBufferedUpdates-seed#[7FF2899D3F00B9D7]) [ ] o.a.s.c.c.SolrZkClient makePath: /configs/conf1/schema.xml
[junit4] 2> 14321 INFO (TEST-CdcrReplicationHandlerTest.testReplicationWithBufferedUpdates-seed#[7FF2899D3F00B9D7]) [ ] o.a.s.c.AbstractZkTestCase put /x1/jenkins/jenkins-slave/workspace/Lucene-Solr-NightlyTests-master/solr/core/src/test-files/solr/collection1/conf/solrconfig.snippet.randomindexconfig.xml to /configs/conf1/solrconfig.snippet.randomindexconfig.xml
[junit4] 2> 14321 INFO (TEST-CdcrReplicationHandlerTest.testReplicationWithBufferedUpdates-seed#[7FF2899D3F00B9D7]) [ ] o.a.s.c.c.SolrZkClient makePath: /configs/conf1/solrconfig.snippet.randomindexconfig.xml
[junit4] 2> 14323 INFO (TEST-CdcrReplicationHandlerTest.testReplicationWithBufferedUpdates-seed#[7FF2899D3F00B9D7]) [ ] o.a.s.c.AbstractZkTestCase put /x1/jenkins/jenkins-slave/workspace/Lucene-Solr-NightlyTests-master/solr/core/src/test-files/solr/collection1/conf/stopwords.txt to /configs/conf1/stopwords.txt
[junit4] 2> 14323 INFO (TEST-CdcrReplicationHandlerTest.testReplicationWithBufferedUpdates-seed#[7FF2899D3F00B9D7]) [ ] o.a.s.c.c.SolrZkClient makePath: /configs/conf1/stopwords.txt
[junit4] 2> 14324 INFO (TEST-CdcrReplicationHandlerTest.testReplicationWithBufferedUpdates-seed#[7FF2899D3F00B9D7]) [ ] o.a.s.c.AbstractZkTestCase put /x1/jenkins/jenkins-slave/workspace/Lucene-Solr-NightlyTests-master/solr/core/src/test-files/solr/collection1/conf/protwords.txt to /configs/conf1/protwords.txt
[junit4] 2> 14324 INFO (TEST-CdcrReplicationHandlerTest.testReplicationWithBufferedUpdates-seed#[7FF2899D3F00B9D7]) [ ] o.a.s.c.c.SolrZkClient makePath: /configs/conf1/protwords.txt
[junit4] 2> 14325 INFO (TEST-CdcrReplicationHandlerTest.testReplicationWithBufferedUpdates-seed#[7FF2899D3F00B9D7]) [ ] o.a.s.c.AbstractZkTestCase put /x1/jenkins/jenkins-slave/workspace/Lucene-Solr-NightlyTests-master/solr/core/src/test-files/solr/collection1/conf/currency.xml to /configs/con
[...truncated too long message...]
> at java.lang.Thread.sleep(Native Method)
[junit4] > at org.apache.http.impl.client.IdleConnectionEvictor$1.run(IdleConnectionEvictor.java:66)
[junit4] > at java.lang.Thread.run(Thread.java:745)
[junit4] > 29) Thread[id=186103, name=Connection evictor, state=TIMED_WAITING, group=TGRP-CdcrReplicationDistributedZkTest]
[junit4] > at java.lang.Thread.sleep(Native Method)
[junit4] > at org.apache.http.impl.client.IdleConnectionEvictor$1.run(IdleConnectionEvictor.java:66)
[junit4] > at java.lang.Thread.run(Thread.java:745)
[junit4] > 30) Thread[id=180452, name=Connection evictor, state=TIMED_WAITING, group=TGRP-CdcrReplicationDistributedZkTest]
[junit4] > at java.lang.Thread.sleep(Native Method)
[junit4] > at org.apache.http.impl.client.IdleConnectionEvictor$1.run(IdleConnectionEvictor.java:66)
[junit4] > at java.lang.Thread.run(Thread.java:745)
[junit4] > 31) Thread[id=186565, name=Connection evictor, state=TIMED_WAITING, group=TGRP-CdcrReplicationDistributedZkTest]
[junit4] > at java.lang.Thread.sleep(Native Method)
[junit4] > at org.apache.http.impl.client.IdleConnectionEvictor$1.run(IdleConnectionEvictor.java:66)
[junit4] > at java.lang.Thread.run(Thread.java:745)
[junit4] > 32) Thread[id=179742, name=Connection evictor, state=TIMED_WAITING, group=TGRP-CdcrReplicationDistributedZkTest]
[junit4] > at java.lang.Thread.sleep(Native Method)
[junit4] > at org.apache.http.impl.client.IdleConnectionEvictor$1.run(IdleConnectionEvictor.java:66)
[junit4] > at java.lang.Thread.run(Thread.java:745)
[junit4] > 33) Thread[id=180453, name=Connection evictor, state=TIMED_WAITING, group=TGRP-CdcrReplicationDistributedZkTest]
[junit4] > at java.lang.Thread.sleep(Native Method)
[junit4] > at org.apache.http.impl.client.IdleConnectionEvictor$1.run(IdleConnectionEvictor.java:66)
[junit4] > at java.lang.Thread.run(Thread.java:745)
[junit4] > 34) Thread[id=176399, name=Connection evictor, state=TIMED_WAITING, group=TGRP-CdcrReplicationDistributedZkTest]
[junit4] > at java.lang.Thread.sleep(Native Method)
[junit4] > at org.apache.http.impl.client.IdleConnectionEvictor$1.run(IdleConnectionEvictor.java:66)
[junit4] > at java.lang.Thread.run(Thread.java:745)
[junit4] > 35) Thread[id=176402, name=Connection evictor, state=TIMED_WAITING, group=TGRP-CdcrReplicationDistributedZkTest]
[junit4] > at java.lang.Thread.sleep(Native Method)
[junit4] > at org.apache.http.impl.client.IdleConnectionEvictor$1.run(IdleConnectionEvictor.java:66)
[junit4] > at java.lang.Thread.run(Thread.java:745)
[junit4] > 36) Thread[id=180221, name=Connection evictor, state=TIMED_WAITING, group=TGRP-CdcrReplicationDistributedZkTest]
[junit4] > at java.lang.Thread.sleep(Native Method)
[junit4] > at org.apache.http.impl.client.IdleConnectionEvictor$1.run(IdleConnectionEvictor.java:66)
[junit4] > at java.lang.Thread.run(Thread.java:745)
[junit4] > 37) Thread[id=180451, name=Connection evictor, state=TIMED_WAITING, group=TGRP-CdcrReplicationDistributedZkTest]
[junit4] > at java.lang.Thread.sleep(Native Method)
[junit4] > at org.apache.http.impl.client.IdleConnectionEvictor$1.run(IdleConnectionEvictor.java:66)
[junit4] > at java.lang.Thread.run(Thread.java:745)
[junit4] > 38) Thread[id=183499, name=Connection evictor, state=TIMED_WAITING, group=TGRP-CdcrReplicationDistributedZkTest]
[junit4] > at java.lang.Thread.sleep(Native Method)
[junit4] > at org.apache.http.impl.client.IdleConnectionEvictor$1.run(IdleConnectionEvictor.java:66)
[junit4] > at java.lang.Thread.run(Thread.java:745)
[junit4] > 39) Thread[id=177085, name=Connection evictor, state=TIMED_WAITING, group=TGRP-CdcrReplicationDistributedZkTest]
[junit4] > at java.lang.Thread.sleep(Native Method)
[junit4] > at org.apache.http.impl.client.IdleConnectionEvictor$1.run(IdleConnectionEvictor.java:66)
[junit4] > at java.lang.Thread.run(Thread.java:745)
[junit4] > 40) Thread[id=176855, name=Connection evictor, state=TIMED_WAITING, group=TGRP-CdcrReplicationDistributedZkTest]
[junit4] > at java.lang.Thread.sleep(Native Method)
[junit4] > at org.apache.http.impl.client.IdleConnectionEvictor$1.run(IdleConnectionEvictor.java:66)
[junit4] > at java.lang.Thread.run(Thread.java:745)
[junit4] > 41) Thread[id=183497, name=Connection evictor, state=TIMED_WAITING, group=TGRP-CdcrReplicationDistributedZkTest]
[junit4] > at java.lang.Thread.sleep(Native Method)
[junit4] > at org.apache.http.impl.client.IdleConnectionEvictor$1.run(IdleConnectionEvictor.java:66)
[junit4] > at java.lang.Thread.run(Thread.java:745)
[junit4] > 42) Thread[id=184948, name=Connection evictor, state=TIMED_WAITING, group=TGRP-CdcrReplicationDistributedZkTest]
[junit4] > at java.lang.Thread.sleep(Native Method)
[junit4] > at org.apache.http.impl.client.IdleConnectionEvictor$1.run(IdleConnectionEvictor.java:66)
[junit4] > at java.lang.Thread.run(Thread.java:745)
[junit4] > 43) Thread[id=186563, name=Connection evictor, state=TIMED_WAITING, group=TGRP-CdcrReplicationDistributedZkTest]
[junit4] > at java.lang.Thread.sleep(Native Method)
[junit4] > at org.apache.http.impl.client.IdleConnectionEvictor$1.run(IdleConnectionEvictor.java:66)
[junit4] > at java.lang.Thread.run(Thread.java:745)
[junit4] > 44) Thread[id=176685, name=Connection evictor, state=TIMED_WAITING, group=TGRP-CdcrReplicationDistributedZkTest]
[junit4] > at java.lang.Thread.sleep(Native Method)
[junit4] > at org.apache.http.impl.client.IdleConnectionEvictor$1.run(IdleConnectionEvictor.java:66)
[junit4] > at java.lang.Thread.run(Thread.java:745)
[junit4] > 45) Thread[id=179744, name=Connection evictor, state=TIMED_WAITING, group=TGRP-CdcrReplicationDistributedZkTest]
[junit4] > at java.lang.Thread.sleep(Native Method)
[junit4] > at org.apache.http.impl.client.IdleConnectionEvictor$1.run(IdleConnectionEvictor.java:66)
[junit4] > at java.lang.Thread.run(Thread.java:745)
[junit4] > 46) Thread[id=176858, name=Connection evictor, state=TIMED_WAITING, group=TGRP-CdcrReplicationDistributedZkTest]
[junit4] > at java.lang.Thread.sleep(Native Method)
[junit4] > at org.apache.http.impl.client.IdleConnectionEvictor$1.run(IdleConnectionEvictor.java:66)
[junit4] > at java.lang.Thread.run(Thread.java:745)
[junit4] > 47) Thread[id=183500, name=Connection evictor, state=TIMED_WAITING, group=TGRP-CdcrReplicationDistributedZkTest]
[junit4] > at java.lang.Thread.sleep(Native Method)
[junit4] > at org.apache.http.impl.client.IdleConnectionEvictor$1.run(IdleConnectionEvictor.java:66)
[junit4] > at java.lang.Thread.run(Thread.java:745)
[junit4] > 48) Thread[id=176400, name=Connection evictor, state=TIMED_WAITING, group=TGRP-CdcrReplicationDistributedZkTest]
[junit4] > at java.lang.Thread.sleep(Native Method)
[junit4] > at org.apache.http.impl.client.IdleConnectionEvictor$1.run(IdleConnectionEvictor.java:66)
[junit4] > at java.lang.Thread.run(Thread.java:745)
[junit4] > at __randomizedtesting.SeedInfo.seed([7FF2899D3F00B9D7]:0)
[junit4] Completed [471/594 (7!)] on J1 in 891.16s, 11 tests, 1 failure, 1 error <<< FAILURES!
[...truncated 381 lines...]
[junit4] JVM J2: stdout was not empty, see: /x1/jenkins/jenkins-slave/workspace/Lucene-Solr-NightlyTests-master/solr/build/solr-core/test/temp/junit4-J2-20160506_164030_842.sysout
[junit4] >>> JVM J2 emitted unexpected output (verbatim) ----
[junit4] java.lang.OutOfMemoryError: Java heap space
[junit4] Dumping heap to /x1/jenkins/jenkins-slave/workspace/Lucene-Solr-NightlyTests-master/heapdumps/java_pid2707.hprof ...
[junit4] Heap dump file created [711888534 bytes in 8.907 secs]
[junit4] <<< JVM J2: EOF ----
[...truncated 16 lines...]
BUILD FAILED
/x1/jenkins/jenkins-slave/workspace/Lucene-Solr-NightlyTests-master/build.xml:747: The following error occurred while executing this line:
/x1/jenkins/jenkins-slave/workspace/Lucene-Solr-NightlyTests-master/build.xml:684: The following error occurred while executing this line:
/x1/jenkins/jenkins-slave/workspace/Lucene-Solr-NightlyTests-master/build.xml:59: The following error occurred while executing this line:
/x1/jenkins/jenkins-slave/workspace/Lucene-Solr-NightlyTests-master/solr/build.xml:233: The following error occurred while executing this line:
/x1/jenkins/jenkins-slave/workspace/Lucene-Solr-NightlyTests-master/solr/common-build.xml:529: The following error occurred while executing this line:
/x1/jenkins/jenkins-slave/workspace/Lucene-Solr-NightlyTests-master/lucene/common-build.xml:1457: The following error occurred while executing this line:
/x1/jenkins/jenkins-slave/workspace/Lucene-Solr-NightlyTests-master/lucene/common-build.xml:1014: There were test failures: 594 suites (10 ignored), 2397 tests, 8 suite-level errors, 2 errors, 1 failure, 32 ignored (17 assumptions) [seed: 7FF2899D3F00B9D7]
Total time: 228 minutes 37 seconds
Build step 'Invoke Ant' marked build as failure
Archiving artifacts
No prior successful build to compare, so performing full copy of artifacts
Recording test results
Email was triggered for: Failure - Any
Sending email for trigger: Failure - Any
[JENKINS] Lucene-Solr-NightlyTests-master - Build # 1008 - Still
Failing
Posted by Apache Jenkins Server <je...@builds.apache.org>.
Build: https://builds.apache.org/job/Lucene-Solr-NightlyTests-master/1008/
9 tests failed.
FAILED: org.apache.solr.cloud.CollectionsAPIDistributedZkTest.test
Error Message:
Timeout occured while waiting response from server at: http://127.0.0.1:55354/_nq
Stack Trace:
org.apache.solr.client.solrj.SolrServerException: Timeout occured while waiting response from server at: http://127.0.0.1:55354/_nq
at org.apache.solr.client.solrj.impl.HttpSolrClient.executeMethod(HttpSolrClient.java:617)
at org.apache.solr.client.solrj.impl.HttpSolrClient.request(HttpSolrClient.java:259)
at org.apache.solr.client.solrj.impl.HttpSolrClient.request(HttpSolrClient.java:248)
at org.apache.solr.client.solrj.SolrClient.request(SolrClient.java:1219)
at org.apache.solr.cloud.CollectionsAPIDistributedZkTest.makeRequest(CollectionsAPIDistributedZkTest.java:400)
at org.apache.solr.cloud.CollectionsAPIDistributedZkTest.testErrorHandling(CollectionsAPIDistributedZkTest.java:417)
at org.apache.solr.cloud.CollectionsAPIDistributedZkTest.test(CollectionsAPIDistributedZkTest.java:180)
at sun.reflect.NativeMethodAccessorImpl.invoke0(Native Method)
at sun.reflect.NativeMethodAccessorImpl.invoke(NativeMethodAccessorImpl.java:62)
at sun.reflect.DelegatingMethodAccessorImpl.invoke(DelegatingMethodAccessorImpl.java:43)
at java.lang.reflect.Method.invoke(Method.java:498)
at com.carrotsearch.randomizedtesting.RandomizedRunner.invoke(RandomizedRunner.java:1764)
at com.carrotsearch.randomizedtesting.RandomizedRunner$8.evaluate(RandomizedRunner.java:871)
at com.carrotsearch.randomizedtesting.RandomizedRunner$9.evaluate(RandomizedRunner.java:907)
at com.carrotsearch.randomizedtesting.RandomizedRunner$10.evaluate(RandomizedRunner.java:921)
at org.apache.solr.BaseDistributedSearchTestCase$ShardsRepeatRule$ShardsFixedStatement.callStatement(BaseDistributedSearchTestCase.java:985)
at org.apache.solr.BaseDistributedSearchTestCase$ShardsRepeatRule$ShardsStatement.evaluate(BaseDistributedSearchTestCase.java:960)
at com.carrotsearch.randomizedtesting.rules.SystemPropertiesRestoreRule$1.evaluate(SystemPropertiesRestoreRule.java:57)
at org.apache.lucene.util.TestRuleSetupTeardownChained$1.evaluate(TestRuleSetupTeardownChained.java:49)
at org.apache.lucene.util.AbstractBeforeAfterRule$1.evaluate(AbstractBeforeAfterRule.java:45)
at org.apache.lucene.util.TestRuleThreadAndTestName$1.evaluate(TestRuleThreadAndTestName.java:48)
at org.apache.lucene.util.TestRuleIgnoreAfterMaxFailures$1.evaluate(TestRuleIgnoreAfterMaxFailures.java:64)
at org.apache.lucene.util.TestRuleMarkFailure$1.evaluate(TestRuleMarkFailure.java:47)
at com.carrotsearch.randomizedtesting.rules.StatementAdapter.evaluate(StatementAdapter.java:36)
at com.carrotsearch.randomizedtesting.ThreadLeakControl$StatementRunner.run(ThreadLeakControl.java:367)
at com.carrotsearch.randomizedtesting.ThreadLeakControl.forkTimeoutingTask(ThreadLeakControl.java:809)
at com.carrotsearch.randomizedtesting.ThreadLeakControl$3.evaluate(ThreadLeakControl.java:460)
at com.carrotsearch.randomizedtesting.RandomizedRunner.runSingleTest(RandomizedRunner.java:880)
at com.carrotsearch.randomizedtesting.RandomizedRunner$5.evaluate(RandomizedRunner.java:781)
at com.carrotsearch.randomizedtesting.RandomizedRunner$6.evaluate(RandomizedRunner.java:816)
at com.carrotsearch.randomizedtesting.RandomizedRunner$7.evaluate(RandomizedRunner.java:827)
at com.carrotsearch.randomizedtesting.rules.StatementAdapter.evaluate(StatementAdapter.java:36)
at com.carrotsearch.randomizedtesting.rules.SystemPropertiesRestoreRule$1.evaluate(SystemPropertiesRestoreRule.java:57)
at org.apache.lucene.util.AbstractBeforeAfterRule$1.evaluate(AbstractBeforeAfterRule.java:45)
at com.carrotsearch.randomizedtesting.rules.StatementAdapter.evaluate(StatementAdapter.java:36)
at org.apache.lucene.util.TestRuleStoreClassName$1.evaluate(TestRuleStoreClassName.java:41)
at com.carrotsearch.randomizedtesting.rules.NoShadowingOrOverridesOnMethodsRule$1.evaluate(NoShadowingOrOverridesOnMethodsRule.java:40)
at com.carrotsearch.randomizedtesting.rules.NoShadowingOrOverridesOnMethodsRule$1.evaluate(NoShadowingOrOverridesOnMethodsRule.java:40)
at com.carrotsearch.randomizedtesting.rules.StatementAdapter.evaluate(StatementAdapter.java:36)
at com.carrotsearch.randomizedtesting.rules.StatementAdapter.evaluate(StatementAdapter.java:36)
at com.carrotsearch.randomizedtesting.rules.StatementAdapter.evaluate(StatementAdapter.java:36)
at org.apache.lucene.util.TestRuleAssertionsRequired$1.evaluate(TestRuleAssertionsRequired.java:53)
at org.apache.lucene.util.TestRuleMarkFailure$1.evaluate(TestRuleMarkFailure.java:47)
at org.apache.lucene.util.TestRuleIgnoreAfterMaxFailures$1.evaluate(TestRuleIgnoreAfterMaxFailures.java:64)
at org.apache.lucene.util.TestRuleIgnoreTestSuites$1.evaluate(TestRuleIgnoreTestSuites.java:54)
at com.carrotsearch.randomizedtesting.rules.StatementAdapter.evaluate(StatementAdapter.java:36)
at com.carrotsearch.randomizedtesting.ThreadLeakControl$StatementRunner.run(ThreadLeakControl.java:367)
at java.lang.Thread.run(Thread.java:745)
Caused by: java.net.SocketTimeoutException: Read timed out
at java.net.SocketInputStream.socketRead0(Native Method)
at java.net.SocketInputStream.socketRead(SocketInputStream.java:116)
at java.net.SocketInputStream.read(SocketInputStream.java:170)
at java.net.SocketInputStream.read(SocketInputStream.java:141)
at org.apache.http.impl.io.SessionInputBufferImpl.streamRead(SessionInputBufferImpl.java:139)
at org.apache.http.impl.io.SessionInputBufferImpl.fillBuffer(SessionInputBufferImpl.java:155)
at org.apache.http.impl.io.SessionInputBufferImpl.readLine(SessionInputBufferImpl.java:284)
at org.apache.http.impl.conn.DefaultHttpResponseParser.parseHead(DefaultHttpResponseParser.java:140)
at org.apache.http.impl.conn.DefaultHttpResponseParser.parseHead(DefaultHttpResponseParser.java:57)
at org.apache.http.impl.io.AbstractMessageParser.parse(AbstractMessageParser.java:261)
at org.apache.http.impl.DefaultBHttpClientConnection.receiveResponseHeader(DefaultBHttpClientConnection.java:165)
at org.apache.http.impl.conn.CPoolProxy.receiveResponseHeader(CPoolProxy.java:167)
at org.apache.http.protocol.HttpRequestExecutor.doReceiveResponse(HttpRequestExecutor.java:272)
at org.apache.http.protocol.HttpRequestExecutor.execute(HttpRequestExecutor.java:124)
at org.apache.http.impl.execchain.MainClientExec.execute(MainClientExec.java:271)
at org.apache.http.impl.execchain.ProtocolExec.execute(ProtocolExec.java:184)
at org.apache.http.impl.execchain.RetryExec.execute(RetryExec.java:88)
at org.apache.http.impl.execchain.RedirectExec.execute(RedirectExec.java:110)
at org.apache.http.impl.client.InternalHttpClient.doExecute(InternalHttpClient.java:184)
at org.apache.http.impl.client.CloseableHttpClient.execute(CloseableHttpClient.java:82)
at org.apache.http.impl.client.CloseableHttpClient.execute(CloseableHttpClient.java:55)
at org.apache.solr.client.solrj.impl.HttpSolrClient.executeMethod(HttpSolrClient.java:511)
... 47 more
FAILED: junit.framework.TestSuite.org.apache.solr.cloud.CdcrReplicationHandlerTest
Error Message:
ObjectTracker found 12 object(s) that were not released!!! [InternalHttpClient, InternalHttpClient, InternalHttpClient, InternalHttpClient, InternalHttpClient, InternalHttpClient, InternalHttpClient, InternalHttpClient, InternalHttpClient, InternalHttpClient, InternalHttpClient, InternalHttpClient]
Stack Trace:
java.lang.AssertionError: ObjectTracker found 12 object(s) that were not released!!! [InternalHttpClient, InternalHttpClient, InternalHttpClient, InternalHttpClient, InternalHttpClient, InternalHttpClient, InternalHttpClient, InternalHttpClient, InternalHttpClient, InternalHttpClient, InternalHttpClient, InternalHttpClient]
at __randomizedtesting.SeedInfo.seed([B9FEBBEA9674803A]:0)
at org.junit.Assert.fail(Assert.java:93)
at org.junit.Assert.assertTrue(Assert.java:43)
at org.junit.Assert.assertNull(Assert.java:551)
at org.apache.solr.SolrTestCaseJ4.afterClass(SolrTestCaseJ4.java:255)
at sun.reflect.GeneratedMethodAccessor105.invoke(Unknown Source)
at sun.reflect.DelegatingMethodAccessorImpl.invoke(DelegatingMethodAccessorImpl.java:43)
at java.lang.reflect.Method.invoke(Method.java:498)
at com.carrotsearch.randomizedtesting.RandomizedRunner.invoke(RandomizedRunner.java:1764)
at com.carrotsearch.randomizedtesting.RandomizedRunner$7.evaluate(RandomizedRunner.java:834)
at com.carrotsearch.randomizedtesting.rules.StatementAdapter.evaluate(StatementAdapter.java:36)
at com.carrotsearch.randomizedtesting.rules.SystemPropertiesRestoreRule$1.evaluate(SystemPropertiesRestoreRule.java:57)
at org.apache.lucene.util.AbstractBeforeAfterRule$1.evaluate(AbstractBeforeAfterRule.java:45)
at com.carrotsearch.randomizedtesting.rules.StatementAdapter.evaluate(StatementAdapter.java:36)
at org.apache.lucene.util.TestRuleStoreClassName$1.evaluate(TestRuleStoreClassName.java:41)
at com.carrotsearch.randomizedtesting.rules.NoShadowingOrOverridesOnMethodsRule$1.evaluate(NoShadowingOrOverridesOnMethodsRule.java:40)
at com.carrotsearch.randomizedtesting.rules.NoShadowingOrOverridesOnMethodsRule$1.evaluate(NoShadowingOrOverridesOnMethodsRule.java:40)
at com.carrotsearch.randomizedtesting.rules.StatementAdapter.evaluate(StatementAdapter.java:36)
at com.carrotsearch.randomizedtesting.rules.StatementAdapter.evaluate(StatementAdapter.java:36)
at com.carrotsearch.randomizedtesting.rules.StatementAdapter.evaluate(StatementAdapter.java:36)
at org.apache.lucene.util.TestRuleAssertionsRequired$1.evaluate(TestRuleAssertionsRequired.java:53)
at org.apache.lucene.util.TestRuleMarkFailure$1.evaluate(TestRuleMarkFailure.java:47)
at org.apache.lucene.util.TestRuleIgnoreAfterMaxFailures$1.evaluate(TestRuleIgnoreAfterMaxFailures.java:64)
at org.apache.lucene.util.TestRuleIgnoreTestSuites$1.evaluate(TestRuleIgnoreTestSuites.java:54)
at com.carrotsearch.randomizedtesting.rules.StatementAdapter.evaluate(StatementAdapter.java:36)
at com.carrotsearch.randomizedtesting.ThreadLeakControl$StatementRunner.run(ThreadLeakControl.java:367)
at java.lang.Thread.run(Thread.java:745)
FAILED: junit.framework.TestSuite.org.apache.solr.cloud.CdcrReplicationHandlerTest
Error Message:
12 threads leaked from SUITE scope at org.apache.solr.cloud.CdcrReplicationHandlerTest: 1) Thread[id=153950, name=Connection evictor, state=TIMED_WAITING, group=TGRP-CdcrReplicationHandlerTest] at java.lang.Thread.sleep(Native Method) at org.apache.http.impl.client.IdleConnectionEvictor$1.run(IdleConnectionEvictor.java:66) at java.lang.Thread.run(Thread.java:745) 2) Thread[id=154488, name=Connection evictor, state=TIMED_WAITING, group=TGRP-CdcrReplicationHandlerTest] at java.lang.Thread.sleep(Native Method) at org.apache.http.impl.client.IdleConnectionEvictor$1.run(IdleConnectionEvictor.java:66) at java.lang.Thread.run(Thread.java:745) 3) Thread[id=154489, name=Connection evictor, state=TIMED_WAITING, group=TGRP-CdcrReplicationHandlerTest] at java.lang.Thread.sleep(Native Method) at org.apache.http.impl.client.IdleConnectionEvictor$1.run(IdleConnectionEvictor.java:66) at java.lang.Thread.run(Thread.java:745) 4) Thread[id=153029, name=Connection evictor, state=TIMED_WAITING, group=TGRP-CdcrReplicationHandlerTest] at java.lang.Thread.sleep(Native Method) at org.apache.http.impl.client.IdleConnectionEvictor$1.run(IdleConnectionEvictor.java:66) at java.lang.Thread.run(Thread.java:745) 5) Thread[id=154218, name=Connection evictor, state=TIMED_WAITING, group=TGRP-CdcrReplicationHandlerTest] at java.lang.Thread.sleep(Native Method) at org.apache.http.impl.client.IdleConnectionEvictor$1.run(IdleConnectionEvictor.java:66) at java.lang.Thread.run(Thread.java:745) 6) Thread[id=154608, name=Connection evictor, state=TIMED_WAITING, group=TGRP-CdcrReplicationHandlerTest] at java.lang.Thread.sleep(Native Method) at org.apache.http.impl.client.IdleConnectionEvictor$1.run(IdleConnectionEvictor.java:66) at java.lang.Thread.run(Thread.java:745) 7) Thread[id=153949, name=Connection evictor, state=TIMED_WAITING, group=TGRP-CdcrReplicationHandlerTest] at java.lang.Thread.sleep(Native Method) at org.apache.http.impl.client.IdleConnectionEvictor$1.run(IdleConnectionEvictor.java:66) at java.lang.Thread.run(Thread.java:745) 8) Thread[id=153687, name=Connection evictor, state=TIMED_WAITING, group=TGRP-CdcrReplicationHandlerTest] at java.lang.Thread.sleep(Native Method) at org.apache.http.impl.client.IdleConnectionEvictor$1.run(IdleConnectionEvictor.java:66) at java.lang.Thread.run(Thread.java:745) 9) Thread[id=154220, name=Connection evictor, state=TIMED_WAITING, group=TGRP-CdcrReplicationHandlerTest] at java.lang.Thread.sleep(Native Method) at org.apache.http.impl.client.IdleConnectionEvictor$1.run(IdleConnectionEvictor.java:66) at java.lang.Thread.run(Thread.java:745) 10) Thread[id=153030, name=Connection evictor, state=TIMED_WAITING, group=TGRP-CdcrReplicationHandlerTest] at java.lang.Thread.sleep(Native Method) at org.apache.http.impl.client.IdleConnectionEvictor$1.run(IdleConnectionEvictor.java:66) at java.lang.Thread.run(Thread.java:745) 11) Thread[id=153688, name=Connection evictor, state=TIMED_WAITING, group=TGRP-CdcrReplicationHandlerTest] at java.lang.Thread.sleep(Native Method) at org.apache.http.impl.client.IdleConnectionEvictor$1.run(IdleConnectionEvictor.java:66) at java.lang.Thread.run(Thread.java:745) 12) Thread[id=154607, name=Connection evictor, state=TIMED_WAITING, group=TGRP-CdcrReplicationHandlerTest] at java.lang.Thread.sleep(Native Method) at org.apache.http.impl.client.IdleConnectionEvictor$1.run(IdleConnectionEvictor.java:66) at java.lang.Thread.run(Thread.java:745)
Stack Trace:
com.carrotsearch.randomizedtesting.ThreadLeakError: 12 threads leaked from SUITE scope at org.apache.solr.cloud.CdcrReplicationHandlerTest:
1) Thread[id=153950, name=Connection evictor, state=TIMED_WAITING, group=TGRP-CdcrReplicationHandlerTest]
at java.lang.Thread.sleep(Native Method)
at org.apache.http.impl.client.IdleConnectionEvictor$1.run(IdleConnectionEvictor.java:66)
at java.lang.Thread.run(Thread.java:745)
2) Thread[id=154488, name=Connection evictor, state=TIMED_WAITING, group=TGRP-CdcrReplicationHandlerTest]
at java.lang.Thread.sleep(Native Method)
at org.apache.http.impl.client.IdleConnectionEvictor$1.run(IdleConnectionEvictor.java:66)
at java.lang.Thread.run(Thread.java:745)
3) Thread[id=154489, name=Connection evictor, state=TIMED_WAITING, group=TGRP-CdcrReplicationHandlerTest]
at java.lang.Thread.sleep(Native Method)
at org.apache.http.impl.client.IdleConnectionEvictor$1.run(IdleConnectionEvictor.java:66)
at java.lang.Thread.run(Thread.java:745)
4) Thread[id=153029, name=Connection evictor, state=TIMED_WAITING, group=TGRP-CdcrReplicationHandlerTest]
at java.lang.Thread.sleep(Native Method)
at org.apache.http.impl.client.IdleConnectionEvictor$1.run(IdleConnectionEvictor.java:66)
at java.lang.Thread.run(Thread.java:745)
5) Thread[id=154218, name=Connection evictor, state=TIMED_WAITING, group=TGRP-CdcrReplicationHandlerTest]
at java.lang.Thread.sleep(Native Method)
at org.apache.http.impl.client.IdleConnectionEvictor$1.run(IdleConnectionEvictor.java:66)
at java.lang.Thread.run(Thread.java:745)
6) Thread[id=154608, name=Connection evictor, state=TIMED_WAITING, group=TGRP-CdcrReplicationHandlerTest]
at java.lang.Thread.sleep(Native Method)
at org.apache.http.impl.client.IdleConnectionEvictor$1.run(IdleConnectionEvictor.java:66)
at java.lang.Thread.run(Thread.java:745)
7) Thread[id=153949, name=Connection evictor, state=TIMED_WAITING, group=TGRP-CdcrReplicationHandlerTest]
at java.lang.Thread.sleep(Native Method)
at org.apache.http.impl.client.IdleConnectionEvictor$1.run(IdleConnectionEvictor.java:66)
at java.lang.Thread.run(Thread.java:745)
8) Thread[id=153687, name=Connection evictor, state=TIMED_WAITING, group=TGRP-CdcrReplicationHandlerTest]
at java.lang.Thread.sleep(Native Method)
at org.apache.http.impl.client.IdleConnectionEvictor$1.run(IdleConnectionEvictor.java:66)
at java.lang.Thread.run(Thread.java:745)
9) Thread[id=154220, name=Connection evictor, state=TIMED_WAITING, group=TGRP-CdcrReplicationHandlerTest]
at java.lang.Thread.sleep(Native Method)
at org.apache.http.impl.client.IdleConnectionEvictor$1.run(IdleConnectionEvictor.java:66)
at java.lang.Thread.run(Thread.java:745)
10) Thread[id=153030, name=Connection evictor, state=TIMED_WAITING, group=TGRP-CdcrReplicationHandlerTest]
at java.lang.Thread.sleep(Native Method)
at org.apache.http.impl.client.IdleConnectionEvictor$1.run(IdleConnectionEvictor.java:66)
at java.lang.Thread.run(Thread.java:745)
11) Thread[id=153688, name=Connection evictor, state=TIMED_WAITING, group=TGRP-CdcrReplicationHandlerTest]
at java.lang.Thread.sleep(Native Method)
at org.apache.http.impl.client.IdleConnectionEvictor$1.run(IdleConnectionEvictor.java:66)
at java.lang.Thread.run(Thread.java:745)
12) Thread[id=154607, name=Connection evictor, state=TIMED_WAITING, group=TGRP-CdcrReplicationHandlerTest]
at java.lang.Thread.sleep(Native Method)
at org.apache.http.impl.client.IdleConnectionEvictor$1.run(IdleConnectionEvictor.java:66)
at java.lang.Thread.run(Thread.java:745)
at __randomizedtesting.SeedInfo.seed([B9FEBBEA9674803A]:0)
FAILED: junit.framework.TestSuite.org.apache.solr.cloud.CdcrReplicationDistributedZkTest
Error Message:
ObjectTracker found 48 object(s) that were not released!!! [InternalHttpClient, InternalHttpClient, InternalHttpClient, InternalHttpClient, InternalHttpClient, InternalHttpClient, InternalHttpClient, InternalHttpClient, InternalHttpClient, InternalHttpClient, InternalHttpClient, InternalHttpClient, InternalHttpClient, InternalHttpClient, InternalHttpClient, InternalHttpClient, InternalHttpClient, InternalHttpClient, InternalHttpClient, InternalHttpClient, InternalHttpClient, InternalHttpClient, InternalHttpClient, InternalHttpClient, InternalHttpClient, InternalHttpClient, InternalHttpClient, InternalHttpClient, InternalHttpClient, InternalHttpClient, InternalHttpClient, InternalHttpClient, InternalHttpClient, InternalHttpClient, InternalHttpClient, InternalHttpClient, InternalHttpClient, InternalHttpClient, InternalHttpClient, InternalHttpClient, InternalHttpClient, InternalHttpClient, InternalHttpClient, InternalHttpClient, InternalHttpClient, InternalHttpClient, InternalHttpClient, InternalHttpClient]
Stack Trace:
java.lang.AssertionError: ObjectTracker found 48 object(s) that were not released!!! [InternalHttpClient, InternalHttpClient, InternalHttpClient, InternalHttpClient, InternalHttpClient, InternalHttpClient, InternalHttpClient, InternalHttpClient, InternalHttpClient, InternalHttpClient, InternalHttpClient, InternalHttpClient, InternalHttpClient, InternalHttpClient, InternalHttpClient, InternalHttpClient, InternalHttpClient, InternalHttpClient, InternalHttpClient, InternalHttpClient, InternalHttpClient, InternalHttpClient, InternalHttpClient, InternalHttpClient, InternalHttpClient, InternalHttpClient, InternalHttpClient, InternalHttpClient, InternalHttpClient, InternalHttpClient, InternalHttpClient, InternalHttpClient, InternalHttpClient, InternalHttpClient, InternalHttpClient, InternalHttpClient, InternalHttpClient, InternalHttpClient, InternalHttpClient, InternalHttpClient, InternalHttpClient, InternalHttpClient, InternalHttpClient, InternalHttpClient, InternalHttpClient, InternalHttpClient, InternalHttpClient, InternalHttpClient]
at __randomizedtesting.SeedInfo.seed([B9FEBBEA9674803A]:0)
at org.junit.Assert.fail(Assert.java:93)
at org.junit.Assert.assertTrue(Assert.java:43)
at org.junit.Assert.assertNull(Assert.java:551)
at org.apache.solr.SolrTestCaseJ4.afterClass(SolrTestCaseJ4.java:255)
at sun.reflect.GeneratedMethodAccessor42.invoke(Unknown Source)
at sun.reflect.DelegatingMethodAccessorImpl.invoke(DelegatingMethodAccessorImpl.java:43)
at java.lang.reflect.Method.invoke(Method.java:498)
at com.carrotsearch.randomizedtesting.RandomizedRunner.invoke(RandomizedRunner.java:1764)
at com.carrotsearch.randomizedtesting.RandomizedRunner$7.evaluate(RandomizedRunner.java:834)
at com.carrotsearch.randomizedtesting.rules.StatementAdapter.evaluate(StatementAdapter.java:36)
at com.carrotsearch.randomizedtesting.rules.SystemPropertiesRestoreRule$1.evaluate(SystemPropertiesRestoreRule.java:57)
at org.apache.lucene.util.AbstractBeforeAfterRule$1.evaluate(AbstractBeforeAfterRule.java:45)
at com.carrotsearch.randomizedtesting.rules.StatementAdapter.evaluate(StatementAdapter.java:36)
at org.apache.lucene.util.TestRuleStoreClassName$1.evaluate(TestRuleStoreClassName.java:41)
at com.carrotsearch.randomizedtesting.rules.NoShadowingOrOverridesOnMethodsRule$1.evaluate(NoShadowingOrOverridesOnMethodsRule.java:40)
at com.carrotsearch.randomizedtesting.rules.NoShadowingOrOverridesOnMethodsRule$1.evaluate(NoShadowingOrOverridesOnMethodsRule.java:40)
at com.carrotsearch.randomizedtesting.rules.StatementAdapter.evaluate(StatementAdapter.java:36)
at com.carrotsearch.randomizedtesting.rules.StatementAdapter.evaluate(StatementAdapter.java:36)
at com.carrotsearch.randomizedtesting.rules.StatementAdapter.evaluate(StatementAdapter.java:36)
at org.apache.lucene.util.TestRuleAssertionsRequired$1.evaluate(TestRuleAssertionsRequired.java:53)
at org.apache.lucene.util.TestRuleMarkFailure$1.evaluate(TestRuleMarkFailure.java:47)
at org.apache.lucene.util.TestRuleIgnoreAfterMaxFailures$1.evaluate(TestRuleIgnoreAfterMaxFailures.java:64)
at org.apache.lucene.util.TestRuleIgnoreTestSuites$1.evaluate(TestRuleIgnoreTestSuites.java:54)
at com.carrotsearch.randomizedtesting.rules.StatementAdapter.evaluate(StatementAdapter.java:36)
at com.carrotsearch.randomizedtesting.ThreadLeakControl$StatementRunner.run(ThreadLeakControl.java:367)
at java.lang.Thread.run(Thread.java:745)
FAILED: junit.framework.TestSuite.org.apache.solr.cloud.CdcrReplicationDistributedZkTest
Error Message:
48 threads leaked from SUITE scope at org.apache.solr.cloud.CdcrReplicationDistributedZkTest: 1) Thread[id=80800, name=Connection evictor, state=TIMED_WAITING, group=TGRP-CdcrReplicationDistributedZkTest] at java.lang.Thread.sleep(Native Method) at org.apache.http.impl.client.IdleConnectionEvictor$1.run(IdleConnectionEvictor.java:66) at java.lang.Thread.run(Thread.java:745) 2) Thread[id=78807, name=Connection evictor, state=TIMED_WAITING, group=TGRP-CdcrReplicationDistributedZkTest] at java.lang.Thread.sleep(Native Method) at org.apache.http.impl.client.IdleConnectionEvictor$1.run(IdleConnectionEvictor.java:66) at java.lang.Thread.run(Thread.java:745) 3) Thread[id=75819, name=Connection evictor, state=TIMED_WAITING, group=TGRP-CdcrReplicationDistributedZkTest] at java.lang.Thread.sleep(Native Method) at org.apache.http.impl.client.IdleConnectionEvictor$1.run(IdleConnectionEvictor.java:66) at java.lang.Thread.run(Thread.java:745) 4) Thread[id=81916, name=Connection evictor, state=TIMED_WAITING, group=TGRP-CdcrReplicationDistributedZkTest] at java.lang.Thread.sleep(Native Method) at org.apache.http.impl.client.IdleConnectionEvictor$1.run(IdleConnectionEvictor.java:66) at java.lang.Thread.run(Thread.java:745) 5) Thread[id=80798, name=Connection evictor, state=TIMED_WAITING, group=TGRP-CdcrReplicationDistributedZkTest] at java.lang.Thread.sleep(Native Method) at org.apache.http.impl.client.IdleConnectionEvictor$1.run(IdleConnectionEvictor.java:66) at java.lang.Thread.run(Thread.java:745) 6) Thread[id=82317, name=Connection evictor, state=TIMED_WAITING, group=TGRP-CdcrReplicationDistributedZkTest] at java.lang.Thread.sleep(Native Method) at org.apache.http.impl.client.IdleConnectionEvictor$1.run(IdleConnectionEvictor.java:66) at java.lang.Thread.run(Thread.java:745) 7) Thread[id=78352, name=Connection evictor, state=TIMED_WAITING, group=TGRP-CdcrReplicationDistributedZkTest] at java.lang.Thread.sleep(Native Method) at org.apache.http.impl.client.IdleConnectionEvictor$1.run(IdleConnectionEvictor.java:66) at java.lang.Thread.run(Thread.java:745) 8) Thread[id=78806, name=Connection evictor, state=TIMED_WAITING, group=TGRP-CdcrReplicationDistributedZkTest] at java.lang.Thread.sleep(Native Method) at org.apache.http.impl.client.IdleConnectionEvictor$1.run(IdleConnectionEvictor.java:66) at java.lang.Thread.run(Thread.java:745) 9) Thread[id=81207, name=Connection evictor, state=TIMED_WAITING, group=TGRP-CdcrReplicationDistributedZkTest] at java.lang.Thread.sleep(Native Method) at org.apache.http.impl.client.IdleConnectionEvictor$1.run(IdleConnectionEvictor.java:66) at java.lang.Thread.run(Thread.java:745) 10) Thread[id=82316, name=Connection evictor, state=TIMED_WAITING, group=TGRP-CdcrReplicationDistributedZkTest] at java.lang.Thread.sleep(Native Method) at org.apache.http.impl.client.IdleConnectionEvictor$1.run(IdleConnectionEvictor.java:66) at java.lang.Thread.run(Thread.java:745) 11) Thread[id=81632, name=Connection evictor, state=TIMED_WAITING, group=TGRP-CdcrReplicationDistributedZkTest] at java.lang.Thread.sleep(Native Method) at org.apache.http.impl.client.IdleConnectionEvictor$1.run(IdleConnectionEvictor.java:66) at java.lang.Thread.run(Thread.java:745) 12) Thread[id=82095, name=Connection evictor, state=TIMED_WAITING, group=TGRP-CdcrReplicationDistributedZkTest] at java.lang.Thread.sleep(Native Method) at org.apache.http.impl.client.IdleConnectionEvictor$1.run(IdleConnectionEvictor.java:66) at java.lang.Thread.run(Thread.java:745) 13) Thread[id=80372, name=Connection evictor, state=TIMED_WAITING, group=TGRP-CdcrReplicationDistributedZkTest] at java.lang.Thread.sleep(Native Method) at org.apache.http.impl.client.IdleConnectionEvictor$1.run(IdleConnectionEvictor.java:66) at java.lang.Thread.run(Thread.java:745) 14) Thread[id=80375, name=Connection evictor, state=TIMED_WAITING, group=TGRP-CdcrReplicationDistributedZkTest] at java.lang.Thread.sleep(Native Method) at org.apache.http.impl.client.IdleConnectionEvictor$1.run(IdleConnectionEvictor.java:66) at java.lang.Thread.run(Thread.java:745) 15) Thread[id=81204, name=Connection evictor, state=TIMED_WAITING, group=TGRP-CdcrReplicationDistributedZkTest] at java.lang.Thread.sleep(Native Method) at org.apache.http.impl.client.IdleConnectionEvictor$1.run(IdleConnectionEvictor.java:66) at java.lang.Thread.run(Thread.java:745) 16) Thread[id=82094, name=Connection evictor, state=TIMED_WAITING, group=TGRP-CdcrReplicationDistributedZkTest] at java.lang.Thread.sleep(Native Method) at org.apache.http.impl.client.IdleConnectionEvictor$1.run(IdleConnectionEvictor.java:66) at java.lang.Thread.run(Thread.java:745) 17) Thread[id=81205, name=Connection evictor, state=TIMED_WAITING, group=TGRP-CdcrReplicationDistributedZkTest] at java.lang.Thread.sleep(Native Method) at org.apache.http.impl.client.IdleConnectionEvictor$1.run(IdleConnectionEvictor.java:66) at java.lang.Thread.run(Thread.java:745) 18) Thread[id=74422, name=Connection evictor, state=TIMED_WAITING, group=TGRP-CdcrReplicationDistributedZkTest] at java.lang.Thread.sleep(Native Method) at org.apache.http.impl.client.IdleConnectionEvictor$1.run(IdleConnectionEvictor.java:66) at java.lang.Thread.run(Thread.java:745) 19) Thread[id=80664, name=Connection evictor, state=TIMED_WAITING, group=TGRP-CdcrReplicationDistributedZkTest] at java.lang.Thread.sleep(Native Method) at org.apache.http.impl.client.IdleConnectionEvictor$1.run(IdleConnectionEvictor.java:66) at java.lang.Thread.run(Thread.java:745) 20) Thread[id=81914, name=Connection evictor, state=TIMED_WAITING, group=TGRP-CdcrReplicationDistributedZkTest] at java.lang.Thread.sleep(Native Method) at org.apache.http.impl.client.IdleConnectionEvictor$1.run(IdleConnectionEvictor.java:66) at java.lang.Thread.run(Thread.java:745) 21) Thread[id=80801, name=Connection evictor, state=TIMED_WAITING, group=TGRP-CdcrReplicationDistributedZkTest] at java.lang.Thread.sleep(Native Method) at org.apache.http.impl.client.IdleConnectionEvictor$1.run(IdleConnectionEvictor.java:66) at java.lang.Thread.run(Thread.java:745) 22) Thread[id=81915, name=Connection evictor, state=TIMED_WAITING, group=TGRP-CdcrReplicationDistributedZkTest] at java.lang.Thread.sleep(Native Method) at org.apache.http.impl.client.IdleConnectionEvictor$1.run(IdleConnectionEvictor.java:66) at java.lang.Thread.run(Thread.java:745) 23) Thread[id=81206, name=Connection evictor, state=TIMED_WAITING, group=TGRP-CdcrReplicationDistributedZkTest] at java.lang.Thread.sleep(Native Method) at org.apache.http.impl.client.IdleConnectionEvictor$1.run(IdleConnectionEvictor.java:66) at java.lang.Thread.run(Thread.java:745) 24) Thread[id=78351, name=Connection evictor, state=TIMED_WAITING, group=TGRP-CdcrReplicationDistributedZkTest] at java.lang.Thread.sleep(Native Method) at org.apache.http.impl.client.IdleConnectionEvictor$1.run(IdleConnectionEvictor.java:66) at java.lang.Thread.run(Thread.java:745) 25) Thread[id=78808, name=Connection evictor, state=TIMED_WAITING, group=TGRP-CdcrReplicationDistributedZkTest] at java.lang.Thread.sleep(Native Method) at org.apache.http.impl.client.IdleConnectionEvictor$1.run(IdleConnectionEvictor.java:66) at java.lang.Thread.run(Thread.java:745) 26) Thread[id=74419, name=Connection evictor, state=TIMED_WAITING, group=TGRP-CdcrReplicationDistributedZkTest] at java.lang.Thread.sleep(Native Method) at org.apache.http.impl.client.IdleConnectionEvictor$1.run(IdleConnectionEvictor.java:66) at java.lang.Thread.run(Thread.java:745) 27) Thread[id=81631, name=Connection evictor, state=TIMED_WAITING, group=TGRP-CdcrReplicationDistributedZkTest] at java.lang.Thread.sleep(Native Method) at org.apache.http.impl.client.IdleConnectionEvictor$1.run(IdleConnectionEvictor.java:66) at java.lang.Thread.run(Thread.java:745) 28) Thread[id=82093, name=Connection evictor, state=TIMED_WAITING, group=TGRP-CdcrReplicationDistributedZkTest] at java.lang.Thread.sleep(Native Method) at org.apache.http.impl.client.IdleConnectionEvictor$1.run(IdleConnectionEvictor.java:66) at java.lang.Thread.run(Thread.java:745) 29) Thread[id=80663, name=Connection evictor, state=TIMED_WAITING, group=TGRP-CdcrReplicationDistributedZkTest] at java.lang.Thread.sleep(Native Method) at org.apache.http.impl.client.IdleConnectionEvictor$1.run(IdleConnectionEvictor.java:66) at java.lang.Thread.run(Thread.java:745) 30) Thread[id=74421, name=Connection evictor, state=TIMED_WAITING, group=TGRP-CdcrReplicationDistributedZkTest] at java.lang.Thread.sleep(Native Method) at org.apache.http.impl.client.IdleConnectionEvictor$1.run(IdleConnectionEvictor.java:66) at java.lang.Thread.run(Thread.java:745) 31) Thread[id=80661, name=Connection evictor, state=TIMED_WAITING, group=TGRP-CdcrReplicationDistributedZkTest] at java.lang.Thread.sleep(Native Method) at org.apache.http.impl.client.IdleConnectionEvictor$1.run(IdleConnectionEvictor.java:66) at java.lang.Thread.run(Thread.java:745) 32) Thread[id=82318, name=Connection evictor, state=TIMED_WAITING, group=TGRP-CdcrReplicationDistributedZkTest] at java.lang.Thread.sleep(Native Method) at org.apache.http.impl.client.IdleConnectionEvictor$1.run(IdleConnectionEvictor.java:66) at java.lang.Thread.run(Thread.java:745) 33) Thread[id=78809, name=Connection evictor, state=TIMED_WAITING, group=TGRP-CdcrReplicationDistributedZkTest] at java.lang.Thread.sleep(Native Method) at org.apache.http.impl.client.IdleConnectionEvictor$1.run(IdleConnectionEvictor.java:66) at java.lang.Thread.run(Thread.java:745) 34) Thread[id=75818, name=Connection evictor, state=TIMED_WAITING, group=TGRP-CdcrReplicationDistributedZkTest] at java.lang.Thread.sleep(Native Method) at org.apache.http.impl.client.IdleConnectionEvictor$1.run(IdleConnectionEvictor.java:66) at java.lang.Thread.run(Thread.java:745) 35) Thread[id=80662, name=Connection evictor, state=TIMED_WAITING, group=TGRP-CdcrReplicationDistributedZkTest] at java.lang.Thread.sleep(Native Method) at org.apache.http.impl.client.IdleConnectionEvictor$1.run(IdleConnectionEvictor.java:66) at java.lang.Thread.run(Thread.java:745) 36) Thread[id=81913, name=Connection evictor, state=TIMED_WAITING, group=TGRP-CdcrReplicationDistributedZkTest] at java.lang.Thread.sleep(Native Method) at org.apache.http.impl.client.IdleConnectionEvictor$1.run(IdleConnectionEvictor.java:66) at java.lang.Thread.run(Thread.java:745) 37) Thread[id=82315, name=Connection evictor, state=TIMED_WAITING, group=TGRP-CdcrReplicationDistributedZkTest] at java.lang.Thread.sleep(Native Method) at org.apache.http.impl.client.IdleConnectionEvictor$1.run(IdleConnectionEvictor.java:66) at java.lang.Thread.run(Thread.java:745) 38) Thread[id=80373, name=Connection evictor, state=TIMED_WAITING, group=TGRP-CdcrReplicationDistributedZkTest] at java.lang.Thread.sleep(Native Method) at org.apache.http.impl.client.IdleConnectionEvictor$1.run(IdleConnectionEvictor.java:66) at java.lang.Thread.run(Thread.java:745) 39) Thread[id=80374, name=Connection evictor, state=TIMED_WAITING, group=TGRP-CdcrReplicationDistributedZkTest] at java.lang.Thread.sleep(Native Method) at org.apache.http.impl.client.IdleConnectionEvictor$1.run(IdleConnectionEvictor.java:66) at java.lang.Thread.run(Thread.java:745) 40) Thread[id=81630, name=Connection evictor, state=TIMED_WAITING, group=TGRP-CdcrReplicationDistributedZkTest] at java.lang.Thread.sleep(Native Method) at org.apache.http.impl.client.IdleConnectionEvictor$1.run(IdleConnectionEvictor.java:66) at java.lang.Thread.run(Thread.java:745) 41) Thread[id=75820, name=Connection evictor, state=TIMED_WAITING, group=TGRP-CdcrReplicationDistributedZkTest] at java.lang.Thread.sleep(Native Method) at org.apache.http.impl.client.IdleConnectionEvictor$1.run(IdleConnectionEvictor.java:66) at java.lang.Thread.run(Thread.java:745) 42) Thread[id=78353, name=Connection evictor, state=TIMED_WAITING, group=TGRP-CdcrReplicationDistributedZkTest] at java.lang.Thread.sleep(Native Method) at org.apache.http.impl.client.IdleConnectionEvictor$1.run(IdleConnectionEvictor.java:66) at java.lang.Thread.run(Thread.java:745) 43) Thread[id=82096, name=Connection evictor, state=TIMED_WAITING, group=TGRP-CdcrReplicationDistributedZkTest] at java.lang.Thread.sleep(Native Method) at org.apache.http.impl.client.IdleConnectionEvictor$1.run(IdleConnectionEvictor.java:66) at java.lang.Thread.run(Thread.java:745) 44) Thread[id=81633, name=Connection evictor, state=TIMED_WAITING, group=TGRP-CdcrReplicationDistributedZkTest] at java.lang.Thread.sleep(Native Method) at org.apache.http.impl.client.IdleConnectionEvictor$1.run(IdleConnectionEvictor.java:66) at java.lang.Thread.run(Thread.java:745) 45) Thread[id=74420, name=Connection evictor, state=TIMED_WAITING, group=TGRP-CdcrReplicationDistributedZkTest] at java.lang.Thread.sleep(Native Method) at org.apache.http.impl.client.IdleConnectionEvictor$1.run(IdleConnectionEvictor.java:66) at java.lang.Thread.run(Thread.java:745) 46) Thread[id=80799, name=Connection evictor, state=TIMED_WAITING, group=TGRP-CdcrReplicationDistributedZkTest] at java.lang.Thread.sleep(Native Method) at org.apache.http.impl.client.IdleConnectionEvictor$1.run(IdleConnectionEvictor.java:66) at java.lang.Thread.run(Thread.java:745) 47) Thread[id=75821, name=Connection evictor, state=TIMED_WAITING, group=TGRP-CdcrReplicationDistributedZkTest] at java.lang.Thread.sleep(Native Method) at org.apache.http.impl.client.IdleConnectionEvictor$1.run(IdleConnectionEvictor.java:66) at java.lang.Thread.run(Thread.java:745) 48) Thread[id=78350, name=Connection evictor, state=TIMED_WAITING, group=TGRP-CdcrReplicationDistributedZkTest] at java.lang.Thread.sleep(Native Method) at org.apache.http.impl.client.IdleConnectionEvictor$1.run(IdleConnectionEvictor.java:66) at java.lang.Thread.run(Thread.java:745)
Stack Trace:
com.carrotsearch.randomizedtesting.ThreadLeakError: 48 threads leaked from SUITE scope at org.apache.solr.cloud.CdcrReplicationDistributedZkTest:
1) Thread[id=80800, name=Connection evictor, state=TIMED_WAITING, group=TGRP-CdcrReplicationDistributedZkTest]
at java.lang.Thread.sleep(Native Method)
at org.apache.http.impl.client.IdleConnectionEvictor$1.run(IdleConnectionEvictor.java:66)
at java.lang.Thread.run(Thread.java:745)
2) Thread[id=78807, name=Connection evictor, state=TIMED_WAITING, group=TGRP-CdcrReplicationDistributedZkTest]
at java.lang.Thread.sleep(Native Method)
at org.apache.http.impl.client.IdleConnectionEvictor$1.run(IdleConnectionEvictor.java:66)
at java.lang.Thread.run(Thread.java:745)
3) Thread[id=75819, name=Connection evictor, state=TIMED_WAITING, group=TGRP-CdcrReplicationDistributedZkTest]
at java.lang.Thread.sleep(Native Method)
at org.apache.http.impl.client.IdleConnectionEvictor$1.run(IdleConnectionEvictor.java:66)
at java.lang.Thread.run(Thread.java:745)
4) Thread[id=81916, name=Connection evictor, state=TIMED_WAITING, group=TGRP-CdcrReplicationDistributedZkTest]
at java.lang.Thread.sleep(Native Method)
at org.apache.http.impl.client.IdleConnectionEvictor$1.run(IdleConnectionEvictor.java:66)
at java.lang.Thread.run(Thread.java:745)
5) Thread[id=80798, name=Connection evictor, state=TIMED_WAITING, group=TGRP-CdcrReplicationDistributedZkTest]
at java.lang.Thread.sleep(Native Method)
at org.apache.http.impl.client.IdleConnectionEvictor$1.run(IdleConnectionEvictor.java:66)
at java.lang.Thread.run(Thread.java:745)
6) Thread[id=82317, name=Connection evictor, state=TIMED_WAITING, group=TGRP-CdcrReplicationDistributedZkTest]
at java.lang.Thread.sleep(Native Method)
at org.apache.http.impl.client.IdleConnectionEvictor$1.run(IdleConnectionEvictor.java:66)
at java.lang.Thread.run(Thread.java:745)
7) Thread[id=78352, name=Connection evictor, state=TIMED_WAITING, group=TGRP-CdcrReplicationDistributedZkTest]
at java.lang.Thread.sleep(Native Method)
at org.apache.http.impl.client.IdleConnectionEvictor$1.run(IdleConnectionEvictor.java:66)
at java.lang.Thread.run(Thread.java:745)
8) Thread[id=78806, name=Connection evictor, state=TIMED_WAITING, group=TGRP-CdcrReplicationDistributedZkTest]
at java.lang.Thread.sleep(Native Method)
at org.apache.http.impl.client.IdleConnectionEvictor$1.run(IdleConnectionEvictor.java:66)
at java.lang.Thread.run(Thread.java:745)
9) Thread[id=81207, name=Connection evictor, state=TIMED_WAITING, group=TGRP-CdcrReplicationDistributedZkTest]
at java.lang.Thread.sleep(Native Method)
at org.apache.http.impl.client.IdleConnectionEvictor$1.run(IdleConnectionEvictor.java:66)
at java.lang.Thread.run(Thread.java:745)
10) Thread[id=82316, name=Connection evictor, state=TIMED_WAITING, group=TGRP-CdcrReplicationDistributedZkTest]
at java.lang.Thread.sleep(Native Method)
at org.apache.http.impl.client.IdleConnectionEvictor$1.run(IdleConnectionEvictor.java:66)
at java.lang.Thread.run(Thread.java:745)
11) Thread[id=81632, name=Connection evictor, state=TIMED_WAITING, group=TGRP-CdcrReplicationDistributedZkTest]
at java.lang.Thread.sleep(Native Method)
at org.apache.http.impl.client.IdleConnectionEvictor$1.run(IdleConnectionEvictor.java:66)
at java.lang.Thread.run(Thread.java:745)
12) Thread[id=82095, name=Connection evictor, state=TIMED_WAITING, group=TGRP-CdcrReplicationDistributedZkTest]
at java.lang.Thread.sleep(Native Method)
at org.apache.http.impl.client.IdleConnectionEvictor$1.run(IdleConnectionEvictor.java:66)
at java.lang.Thread.run(Thread.java:745)
13) Thread[id=80372, name=Connection evictor, state=TIMED_WAITING, group=TGRP-CdcrReplicationDistributedZkTest]
at java.lang.Thread.sleep(Native Method)
at org.apache.http.impl.client.IdleConnectionEvictor$1.run(IdleConnectionEvictor.java:66)
at java.lang.Thread.run(Thread.java:745)
14) Thread[id=80375, name=Connection evictor, state=TIMED_WAITING, group=TGRP-CdcrReplicationDistributedZkTest]
at java.lang.Thread.sleep(Native Method)
at org.apache.http.impl.client.IdleConnectionEvictor$1.run(IdleConnectionEvictor.java:66)
at java.lang.Thread.run(Thread.java:745)
15) Thread[id=81204, name=Connection evictor, state=TIMED_WAITING, group=TGRP-CdcrReplicationDistributedZkTest]
at java.lang.Thread.sleep(Native Method)
at org.apache.http.impl.client.IdleConnectionEvictor$1.run(IdleConnectionEvictor.java:66)
at java.lang.Thread.run(Thread.java:745)
16) Thread[id=82094, name=Connection evictor, state=TIMED_WAITING, group=TGRP-CdcrReplicationDistributedZkTest]
at java.lang.Thread.sleep(Native Method)
at org.apache.http.impl.client.IdleConnectionEvictor$1.run(IdleConnectionEvictor.java:66)
at java.lang.Thread.run(Thread.java:745)
17) Thread[id=81205, name=Connection evictor, state=TIMED_WAITING, group=TGRP-CdcrReplicationDistributedZkTest]
at java.lang.Thread.sleep(Native Method)
at org.apache.http.impl.client.IdleConnectionEvictor$1.run(IdleConnectionEvictor.java:66)
at java.lang.Thread.run(Thread.java:745)
18) Thread[id=74422, name=Connection evictor, state=TIMED_WAITING, group=TGRP-CdcrReplicationDistributedZkTest]
at java.lang.Thread.sleep(Native Method)
at org.apache.http.impl.client.IdleConnectionEvictor$1.run(IdleConnectionEvictor.java:66)
at java.lang.Thread.run(Thread.java:745)
19) Thread[id=80664, name=Connection evictor, state=TIMED_WAITING, group=TGRP-CdcrReplicationDistributedZkTest]
at java.lang.Thread.sleep(Native Method)
at org.apache.http.impl.client.IdleConnectionEvictor$1.run(IdleConnectionEvictor.java:66)
at java.lang.Thread.run(Thread.java:745)
20) Thread[id=81914, name=Connection evictor, state=TIMED_WAITING, group=TGRP-CdcrReplicationDistributedZkTest]
at java.lang.Thread.sleep(Native Method)
at org.apache.http.impl.client.IdleConnectionEvictor$1.run(IdleConnectionEvictor.java:66)
at java.lang.Thread.run(Thread.java:745)
21) Thread[id=80801, name=Connection evictor, state=TIMED_WAITING, group=TGRP-CdcrReplicationDistributedZkTest]
at java.lang.Thread.sleep(Native Method)
at org.apache.http.impl.client.IdleConnectionEvictor$1.run(IdleConnectionEvictor.java:66)
at java.lang.Thread.run(Thread.java:745)
22) Thread[id=81915, name=Connection evictor, state=TIMED_WAITING, group=TGRP-CdcrReplicationDistributedZkTest]
at java.lang.Thread.sleep(Native Method)
at org.apache.http.impl.client.IdleConnectionEvictor$1.run(IdleConnectionEvictor.java:66)
at java.lang.Thread.run(Thread.java:745)
23) Thread[id=81206, name=Connection evictor, state=TIMED_WAITING, group=TGRP-CdcrReplicationDistributedZkTest]
at java.lang.Thread.sleep(Native Method)
at org.apache.http.impl.client.IdleConnectionEvictor$1.run(IdleConnectionEvictor.java:66)
at java.lang.Thread.run(Thread.java:745)
24) Thread[id=78351, name=Connection evictor, state=TIMED_WAITING, group=TGRP-CdcrReplicationDistributedZkTest]
at java.lang.Thread.sleep(Native Method)
at org.apache.http.impl.client.IdleConnectionEvictor$1.run(IdleConnectionEvictor.java:66)
at java.lang.Thread.run(Thread.java:745)
25) Thread[id=78808, name=Connection evictor, state=TIMED_WAITING, group=TGRP-CdcrReplicationDistributedZkTest]
at java.lang.Thread.sleep(Native Method)
at org.apache.http.impl.client.IdleConnectionEvictor$1.run(IdleConnectionEvictor.java:66)
at java.lang.Thread.run(Thread.java:745)
26) Thread[id=74419, name=Connection evictor, state=TIMED_WAITING, group=TGRP-CdcrReplicationDistributedZkTest]
at java.lang.Thread.sleep(Native Method)
at org.apache.http.impl.client.IdleConnectionEvictor$1.run(IdleConnectionEvictor.java:66)
at java.lang.Thread.run(Thread.java:745)
27) Thread[id=81631, name=Connection evictor, state=TIMED_WAITING, group=TGRP-CdcrReplicationDistributedZkTest]
at java.lang.Thread.sleep(Native Method)
at org.apache.http.impl.client.IdleConnectionEvictor$1.run(IdleConnectionEvictor.java:66)
at java.lang.Thread.run(Thread.java:745)
28) Thread[id=82093, name=Connection evictor, state=TIMED_WAITING, group=TGRP-CdcrReplicationDistributedZkTest]
at java.lang.Thread.sleep(Native Method)
at org.apache.http.impl.client.IdleConnectionEvictor$1.run(IdleConnectionEvictor.java:66)
at java.lang.Thread.run(Thread.java:745)
29) Thread[id=80663, name=Connection evictor, state=TIMED_WAITING, group=TGRP-CdcrReplicationDistributedZkTest]
at java.lang.Thread.sleep(Native Method)
at org.apache.http.impl.client.IdleConnectionEvictor$1.run(IdleConnectionEvictor.java:66)
at java.lang.Thread.run(Thread.java:745)
30) Thread[id=74421, name=Connection evictor, state=TIMED_WAITING, group=TGRP-CdcrReplicationDistributedZkTest]
at java.lang.Thread.sleep(Native Method)
at org.apache.http.impl.client.IdleConnectionEvictor$1.run(IdleConnectionEvictor.java:66)
at java.lang.Thread.run(Thread.java:745)
31) Thread[id=80661, name=Connection evictor, state=TIMED_WAITING, group=TGRP-CdcrReplicationDistributedZkTest]
at java.lang.Thread.sleep(Native Method)
at org.apache.http.impl.client.IdleConnectionEvictor$1.run(IdleConnectionEvictor.java:66)
at java.lang.Thread.run(Thread.java:745)
32) Thread[id=82318, name=Connection evictor, state=TIMED_WAITING, group=TGRP-CdcrReplicationDistributedZkTest]
at java.lang.Thread.sleep(Native Method)
at org.apache.http.impl.client.IdleConnectionEvictor$1.run(IdleConnectionEvictor.java:66)
at java.lang.Thread.run(Thread.java:745)
33) Thread[id=78809, name=Connection evictor, state=TIMED_WAITING, group=TGRP-CdcrReplicationDistributedZkTest]
at java.lang.Thread.sleep(Native Method)
at org.apache.http.impl.client.IdleConnectionEvictor$1.run(IdleConnectionEvictor.java:66)
at java.lang.Thread.run(Thread.java:745)
34) Thread[id=75818, name=Connection evictor, state=TIMED_WAITING, group=TGRP-CdcrReplicationDistributedZkTest]
at java.lang.Thread.sleep(Native Method)
at org.apache.http.impl.client.IdleConnectionEvictor$1.run(IdleConnectionEvictor.java:66)
at java.lang.Thread.run(Thread.java:745)
35) Thread[id=80662, name=Connection evictor, state=TIMED_WAITING, group=TGRP-CdcrReplicationDistributedZkTest]
at java.lang.Thread.sleep(Native Method)
at org.apache.http.impl.client.IdleConnectionEvictor$1.run(IdleConnectionEvictor.java:66)
at java.lang.Thread.run(Thread.java:745)
36) Thread[id=81913, name=Connection evictor, state=TIMED_WAITING, group=TGRP-CdcrReplicationDistributedZkTest]
at java.lang.Thread.sleep(Native Method)
at org.apache.http.impl.client.IdleConnectionEvictor$1.run(IdleConnectionEvictor.java:66)
at java.lang.Thread.run(Thread.java:745)
37) Thread[id=82315, name=Connection evictor, state=TIMED_WAITING, group=TGRP-CdcrReplicationDistributedZkTest]
at java.lang.Thread.sleep(Native Method)
at org.apache.http.impl.client.IdleConnectionEvictor$1.run(IdleConnectionEvictor.java:66)
at java.lang.Thread.run(Thread.java:745)
38) Thread[id=80373, name=Connection evictor, state=TIMED_WAITING, group=TGRP-CdcrReplicationDistributedZkTest]
at java.lang.Thread.sleep(Native Method)
at org.apache.http.impl.client.IdleConnectionEvictor$1.run(IdleConnectionEvictor.java:66)
at java.lang.Thread.run(Thread.java:745)
39) Thread[id=80374, name=Connection evictor, state=TIMED_WAITING, group=TGRP-CdcrReplicationDistributedZkTest]
at java.lang.Thread.sleep(Native Method)
at org.apache.http.impl.client.IdleConnectionEvictor$1.run(IdleConnectionEvictor.java:66)
at java.lang.Thread.run(Thread.java:745)
40) Thread[id=81630, name=Connection evictor, state=TIMED_WAITING, group=TGRP-CdcrReplicationDistributedZkTest]
at java.lang.Thread.sleep(Native Method)
at org.apache.http.impl.client.IdleConnectionEvictor$1.run(IdleConnectionEvictor.java:66)
at java.lang.Thread.run(Thread.java:745)
41) Thread[id=75820, name=Connection evictor, state=TIMED_WAITING, group=TGRP-CdcrReplicationDistributedZkTest]
at java.lang.Thread.sleep(Native Method)
at org.apache.http.impl.client.IdleConnectionEvictor$1.run(IdleConnectionEvictor.java:66)
at java.lang.Thread.run(Thread.java:745)
42) Thread[id=78353, name=Connection evictor, state=TIMED_WAITING, group=TGRP-CdcrReplicationDistributedZkTest]
at java.lang.Thread.sleep(Native Method)
at org.apache.http.impl.client.IdleConnectionEvictor$1.run(IdleConnectionEvictor.java:66)
at java.lang.Thread.run(Thread.java:745)
43) Thread[id=82096, name=Connection evictor, state=TIMED_WAITING, group=TGRP-CdcrReplicationDistributedZkTest]
at java.lang.Thread.sleep(Native Method)
at org.apache.http.impl.client.IdleConnectionEvictor$1.run(IdleConnectionEvictor.java:66)
at java.lang.Thread.run(Thread.java:745)
44) Thread[id=81633, name=Connection evictor, state=TIMED_WAITING, group=TGRP-CdcrReplicationDistributedZkTest]
at java.lang.Thread.sleep(Native Method)
at org.apache.http.impl.client.IdleConnectionEvictor$1.run(IdleConnectionEvictor.java:66)
at java.lang.Thread.run(Thread.java:745)
45) Thread[id=74420, name=Connection evictor, state=TIMED_WAITING, group=TGRP-CdcrReplicationDistributedZkTest]
at java.lang.Thread.sleep(Native Method)
at org.apache.http.impl.client.IdleConnectionEvictor$1.run(IdleConnectionEvictor.java:66)
at java.lang.Thread.run(Thread.java:745)
46) Thread[id=80799, name=Connection evictor, state=TIMED_WAITING, group=TGRP-CdcrReplicationDistributedZkTest]
at java.lang.Thread.sleep(Native Method)
at org.apache.http.impl.client.IdleConnectionEvictor$1.run(IdleConnectionEvictor.java:66)
at java.lang.Thread.run(Thread.java:745)
47) Thread[id=75821, name=Connection evictor, state=TIMED_WAITING, group=TGRP-CdcrReplicationDistributedZkTest]
at java.lang.Thread.sleep(Native Method)
at org.apache.http.impl.client.IdleConnectionEvictor$1.run(IdleConnectionEvictor.java:66)
at java.lang.Thread.run(Thread.java:745)
48) Thread[id=78350, name=Connection evictor, state=TIMED_WAITING, group=TGRP-CdcrReplicationDistributedZkTest]
at java.lang.Thread.sleep(Native Method)
at org.apache.http.impl.client.IdleConnectionEvictor$1.run(IdleConnectionEvictor.java:66)
at java.lang.Thread.run(Thread.java:745)
at __randomizedtesting.SeedInfo.seed([B9FEBBEA9674803A]:0)
FAILED: junit.framework.TestSuite.org.apache.solr.cloud.CdcrRequestHandlerTest
Error Message:
ObjectTracker found 8 object(s) that were not released!!! [InternalHttpClient, InternalHttpClient, InternalHttpClient, InternalHttpClient, InternalHttpClient, InternalHttpClient, InternalHttpClient, InternalHttpClient]
Stack Trace:
java.lang.AssertionError: ObjectTracker found 8 object(s) that were not released!!! [InternalHttpClient, InternalHttpClient, InternalHttpClient, InternalHttpClient, InternalHttpClient, InternalHttpClient, InternalHttpClient, InternalHttpClient]
at __randomizedtesting.SeedInfo.seed([B9FEBBEA9674803A]:0)
at org.junit.Assert.fail(Assert.java:93)
at org.junit.Assert.assertTrue(Assert.java:43)
at org.junit.Assert.assertNull(Assert.java:551)
at org.apache.solr.SolrTestCaseJ4.afterClass(SolrTestCaseJ4.java:255)
at sun.reflect.GeneratedMethodAccessor105.invoke(Unknown Source)
at sun.reflect.DelegatingMethodAccessorImpl.invoke(DelegatingMethodAccessorImpl.java:43)
at java.lang.reflect.Method.invoke(Method.java:498)
at com.carrotsearch.randomizedtesting.RandomizedRunner.invoke(RandomizedRunner.java:1764)
at com.carrotsearch.randomizedtesting.RandomizedRunner$7.evaluate(RandomizedRunner.java:834)
at com.carrotsearch.randomizedtesting.rules.StatementAdapter.evaluate(StatementAdapter.java:36)
at com.carrotsearch.randomizedtesting.rules.SystemPropertiesRestoreRule$1.evaluate(SystemPropertiesRestoreRule.java:57)
at org.apache.lucene.util.AbstractBeforeAfterRule$1.evaluate(AbstractBeforeAfterRule.java:45)
at com.carrotsearch.randomizedtesting.rules.StatementAdapter.evaluate(StatementAdapter.java:36)
at org.apache.lucene.util.TestRuleStoreClassName$1.evaluate(TestRuleStoreClassName.java:41)
at com.carrotsearch.randomizedtesting.rules.NoShadowingOrOverridesOnMethodsRule$1.evaluate(NoShadowingOrOverridesOnMethodsRule.java:40)
at com.carrotsearch.randomizedtesting.rules.NoShadowingOrOverridesOnMethodsRule$1.evaluate(NoShadowingOrOverridesOnMethodsRule.java:40)
at com.carrotsearch.randomizedtesting.rules.StatementAdapter.evaluate(StatementAdapter.java:36)
at com.carrotsearch.randomizedtesting.rules.StatementAdapter.evaluate(StatementAdapter.java:36)
at com.carrotsearch.randomizedtesting.rules.StatementAdapter.evaluate(StatementAdapter.java:36)
at org.apache.lucene.util.TestRuleAssertionsRequired$1.evaluate(TestRuleAssertionsRequired.java:53)
at org.apache.lucene.util.TestRuleMarkFailure$1.evaluate(TestRuleMarkFailure.java:47)
at org.apache.lucene.util.TestRuleIgnoreAfterMaxFailures$1.evaluate(TestRuleIgnoreAfterMaxFailures.java:64)
at org.apache.lucene.util.TestRuleIgnoreTestSuites$1.evaluate(TestRuleIgnoreTestSuites.java:54)
at com.carrotsearch.randomizedtesting.rules.StatementAdapter.evaluate(StatementAdapter.java:36)
at com.carrotsearch.randomizedtesting.ThreadLeakControl$StatementRunner.run(ThreadLeakControl.java:367)
at java.lang.Thread.run(Thread.java:745)
FAILED: junit.framework.TestSuite.org.apache.solr.cloud.CdcrRequestHandlerTest
Error Message:
8 threads leaked from SUITE scope at org.apache.solr.cloud.CdcrRequestHandlerTest: 1) Thread[id=155690, name=Connection evictor, state=TIMED_WAITING, group=TGRP-CdcrRequestHandlerTest] at java.lang.Thread.sleep(Native Method) at org.apache.http.impl.client.IdleConnectionEvictor$1.run(IdleConnectionEvictor.java:66) at java.lang.Thread.run(Thread.java:745) 2) Thread[id=155344, name=Connection evictor, state=TIMED_WAITING, group=TGRP-CdcrRequestHandlerTest] at java.lang.Thread.sleep(Native Method) at org.apache.http.impl.client.IdleConnectionEvictor$1.run(IdleConnectionEvictor.java:66) at java.lang.Thread.run(Thread.java:745) 3) Thread[id=155692, name=Connection evictor, state=TIMED_WAITING, group=TGRP-CdcrRequestHandlerTest] at java.lang.Thread.sleep(Native Method) at org.apache.http.impl.client.IdleConnectionEvictor$1.run(IdleConnectionEvictor.java:66) at java.lang.Thread.run(Thread.java:745) 4) Thread[id=155346, name=Connection evictor, state=TIMED_WAITING, group=TGRP-CdcrRequestHandlerTest] at java.lang.Thread.sleep(Native Method) at org.apache.http.impl.client.IdleConnectionEvictor$1.run(IdleConnectionEvictor.java:66) at java.lang.Thread.run(Thread.java:745) 5) Thread[id=155345, name=Connection evictor, state=TIMED_WAITING, group=TGRP-CdcrRequestHandlerTest] at java.lang.Thread.sleep(Native Method) at org.apache.http.impl.client.IdleConnectionEvictor$1.run(IdleConnectionEvictor.java:66) at java.lang.Thread.run(Thread.java:745) 6) Thread[id=155347, name=Connection evictor, state=TIMED_WAITING, group=TGRP-CdcrRequestHandlerTest] at java.lang.Thread.sleep(Native Method) at org.apache.http.impl.client.IdleConnectionEvictor$1.run(IdleConnectionEvictor.java:66) at java.lang.Thread.run(Thread.java:745) 7) Thread[id=155689, name=Connection evictor, state=TIMED_WAITING, group=TGRP-CdcrRequestHandlerTest] at java.lang.Thread.sleep(Native Method) at org.apache.http.impl.client.IdleConnectionEvictor$1.run(IdleConnectionEvictor.java:66) at java.lang.Thread.run(Thread.java:745) 8) Thread[id=155691, name=Connection evictor, state=TIMED_WAITING, group=TGRP-CdcrRequestHandlerTest] at java.lang.Thread.sleep(Native Method) at org.apache.http.impl.client.IdleConnectionEvictor$1.run(IdleConnectionEvictor.java:66) at java.lang.Thread.run(Thread.java:745)
Stack Trace:
com.carrotsearch.randomizedtesting.ThreadLeakError: 8 threads leaked from SUITE scope at org.apache.solr.cloud.CdcrRequestHandlerTest:
1) Thread[id=155690, name=Connection evictor, state=TIMED_WAITING, group=TGRP-CdcrRequestHandlerTest]
at java.lang.Thread.sleep(Native Method)
at org.apache.http.impl.client.IdleConnectionEvictor$1.run(IdleConnectionEvictor.java:66)
at java.lang.Thread.run(Thread.java:745)
2) Thread[id=155344, name=Connection evictor, state=TIMED_WAITING, group=TGRP-CdcrRequestHandlerTest]
at java.lang.Thread.sleep(Native Method)
at org.apache.http.impl.client.IdleConnectionEvictor$1.run(IdleConnectionEvictor.java:66)
at java.lang.Thread.run(Thread.java:745)
3) Thread[id=155692, name=Connection evictor, state=TIMED_WAITING, group=TGRP-CdcrRequestHandlerTest]
at java.lang.Thread.sleep(Native Method)
at org.apache.http.impl.client.IdleConnectionEvictor$1.run(IdleConnectionEvictor.java:66)
at java.lang.Thread.run(Thread.java:745)
4) Thread[id=155346, name=Connection evictor, state=TIMED_WAITING, group=TGRP-CdcrRequestHandlerTest]
at java.lang.Thread.sleep(Native Method)
at org.apache.http.impl.client.IdleConnectionEvictor$1.run(IdleConnectionEvictor.java:66)
at java.lang.Thread.run(Thread.java:745)
5) Thread[id=155345, name=Connection evictor, state=TIMED_WAITING, group=TGRP-CdcrRequestHandlerTest]
at java.lang.Thread.sleep(Native Method)
at org.apache.http.impl.client.IdleConnectionEvictor$1.run(IdleConnectionEvictor.java:66)
at java.lang.Thread.run(Thread.java:745)
6) Thread[id=155347, name=Connection evictor, state=TIMED_WAITING, group=TGRP-CdcrRequestHandlerTest]
at java.lang.Thread.sleep(Native Method)
at org.apache.http.impl.client.IdleConnectionEvictor$1.run(IdleConnectionEvictor.java:66)
at java.lang.Thread.run(Thread.java:745)
7) Thread[id=155689, name=Connection evictor, state=TIMED_WAITING, group=TGRP-CdcrRequestHandlerTest]
at java.lang.Thread.sleep(Native Method)
at org.apache.http.impl.client.IdleConnectionEvictor$1.run(IdleConnectionEvictor.java:66)
at java.lang.Thread.run(Thread.java:745)
8) Thread[id=155691, name=Connection evictor, state=TIMED_WAITING, group=TGRP-CdcrRequestHandlerTest]
at java.lang.Thread.sleep(Native Method)
at org.apache.http.impl.client.IdleConnectionEvictor$1.run(IdleConnectionEvictor.java:66)
at java.lang.Thread.run(Thread.java:745)
at __randomizedtesting.SeedInfo.seed([B9FEBBEA9674803A]:0)
FAILED: junit.framework.TestSuite.org.apache.solr.cloud.ConcurrentDeleteAndCreateCollectionTest
Error Message:
ObjectTracker found 10 object(s) that were not released!!! [InternalHttpClient, InternalHttpClient, InternalHttpClient, InternalHttpClient, InternalHttpClient, InternalHttpClient, InternalHttpClient, InternalHttpClient, InternalHttpClient, InternalHttpClient]
Stack Trace:
java.lang.AssertionError: ObjectTracker found 10 object(s) that were not released!!! [InternalHttpClient, InternalHttpClient, InternalHttpClient, InternalHttpClient, InternalHttpClient, InternalHttpClient, InternalHttpClient, InternalHttpClient, InternalHttpClient, InternalHttpClient]
at __randomizedtesting.SeedInfo.seed([B9FEBBEA9674803A]:0)
at org.junit.Assert.fail(Assert.java:93)
at org.junit.Assert.assertTrue(Assert.java:43)
at org.junit.Assert.assertNull(Assert.java:551)
at org.apache.solr.SolrTestCaseJ4.afterClass(SolrTestCaseJ4.java:255)
at sun.reflect.GeneratedMethodAccessor105.invoke(Unknown Source)
at sun.reflect.DelegatingMethodAccessorImpl.invoke(DelegatingMethodAccessorImpl.java:43)
at java.lang.reflect.Method.invoke(Method.java:498)
at com.carrotsearch.randomizedtesting.RandomizedRunner.invoke(RandomizedRunner.java:1764)
at com.carrotsearch.randomizedtesting.RandomizedRunner$7.evaluate(RandomizedRunner.java:834)
at com.carrotsearch.randomizedtesting.rules.StatementAdapter.evaluate(StatementAdapter.java:36)
at com.carrotsearch.randomizedtesting.rules.SystemPropertiesRestoreRule$1.evaluate(SystemPropertiesRestoreRule.java:57)
at org.apache.lucene.util.AbstractBeforeAfterRule$1.evaluate(AbstractBeforeAfterRule.java:45)
at com.carrotsearch.randomizedtesting.rules.StatementAdapter.evaluate(StatementAdapter.java:36)
at org.apache.lucene.util.TestRuleStoreClassName$1.evaluate(TestRuleStoreClassName.java:41)
at com.carrotsearch.randomizedtesting.rules.NoShadowingOrOverridesOnMethodsRule$1.evaluate(NoShadowingOrOverridesOnMethodsRule.java:40)
at com.carrotsearch.randomizedtesting.rules.NoShadowingOrOverridesOnMethodsRule$1.evaluate(NoShadowingOrOverridesOnMethodsRule.java:40)
at com.carrotsearch.randomizedtesting.rules.StatementAdapter.evaluate(StatementAdapter.java:36)
at com.carrotsearch.randomizedtesting.rules.StatementAdapter.evaluate(StatementAdapter.java:36)
at com.carrotsearch.randomizedtesting.rules.StatementAdapter.evaluate(StatementAdapter.java:36)
at org.apache.lucene.util.TestRuleAssertionsRequired$1.evaluate(TestRuleAssertionsRequired.java:53)
at org.apache.lucene.util.TestRuleMarkFailure$1.evaluate(TestRuleMarkFailure.java:47)
at org.apache.lucene.util.TestRuleIgnoreAfterMaxFailures$1.evaluate(TestRuleIgnoreAfterMaxFailures.java:64)
at org.apache.lucene.util.TestRuleIgnoreTestSuites$1.evaluate(TestRuleIgnoreTestSuites.java:54)
at com.carrotsearch.randomizedtesting.rules.StatementAdapter.evaluate(StatementAdapter.java:36)
at com.carrotsearch.randomizedtesting.ThreadLeakControl$StatementRunner.run(ThreadLeakControl.java:367)
at java.lang.Thread.run(Thread.java:745)
FAILED: junit.framework.TestSuite.org.apache.solr.cloud.ConcurrentDeleteAndCreateCollectionTest
Error Message:
10 threads leaked from SUITE scope at org.apache.solr.cloud.ConcurrentDeleteAndCreateCollectionTest: 1) Thread[id=157099, name=Connection evictor, state=TIMED_WAITING, group=TGRP-ConcurrentDeleteAndCreateCollectionTest] at java.lang.Thread.sleep(Native Method) at org.apache.http.impl.client.IdleConnectionEvictor$1.run(IdleConnectionEvictor.java:66) at java.lang.Thread.run(Thread.java:745) 2) Thread[id=157119, name=Connection evictor, state=TIMED_WAITING, group=TGRP-ConcurrentDeleteAndCreateCollectionTest] at java.lang.Thread.sleep(Native Method) at org.apache.http.impl.client.IdleConnectionEvictor$1.run(IdleConnectionEvictor.java:66) at java.lang.Thread.run(Thread.java:745) 3) Thread[id=157124, name=Connection evictor, state=TIMED_WAITING, group=TGRP-ConcurrentDeleteAndCreateCollectionTest] at java.lang.Thread.sleep(Native Method) at org.apache.http.impl.client.IdleConnectionEvictor$1.run(IdleConnectionEvictor.java:66) at java.lang.Thread.run(Thread.java:745) 4) Thread[id=157109, name=Connection evictor, state=TIMED_WAITING, group=TGRP-ConcurrentDeleteAndCreateCollectionTest] at java.lang.Thread.sleep(Native Method) at org.apache.http.impl.client.IdleConnectionEvictor$1.run(IdleConnectionEvictor.java:66) at java.lang.Thread.run(Thread.java:745) 5) Thread[id=157104, name=Connection evictor, state=TIMED_WAITING, group=TGRP-ConcurrentDeleteAndCreateCollectionTest] at java.lang.Thread.sleep(Native Method) at org.apache.http.impl.client.IdleConnectionEvictor$1.run(IdleConnectionEvictor.java:66) at java.lang.Thread.run(Thread.java:745) 6) Thread[id=157114, name=Connection evictor, state=TIMED_WAITING, group=TGRP-ConcurrentDeleteAndCreateCollectionTest] at java.lang.Thread.sleep(Native Method) at org.apache.http.impl.client.IdleConnectionEvictor$1.run(IdleConnectionEvictor.java:66) at java.lang.Thread.run(Thread.java:745) 7) Thread[id=157129, name=Connection evictor, state=TIMED_WAITING, group=TGRP-ConcurrentDeleteAndCreateCollectionTest] at java.lang.Thread.sleep(Native Method) at org.apache.http.impl.client.IdleConnectionEvictor$1.run(IdleConnectionEvictor.java:66) at java.lang.Thread.run(Thread.java:745) 8) Thread[id=157134, name=Connection evictor, state=TIMED_WAITING, group=TGRP-ConcurrentDeleteAndCreateCollectionTest] at java.lang.Thread.sleep(Native Method) at org.apache.http.impl.client.IdleConnectionEvictor$1.run(IdleConnectionEvictor.java:66) at java.lang.Thread.run(Thread.java:745) 9) Thread[id=157094, name=Connection evictor, state=TIMED_WAITING, group=TGRP-ConcurrentDeleteAndCreateCollectionTest] at java.lang.Thread.sleep(Native Method) at org.apache.http.impl.client.IdleConnectionEvictor$1.run(IdleConnectionEvictor.java:66) at java.lang.Thread.run(Thread.java:745) 10) Thread[id=157139, name=Connection evictor, state=TIMED_WAITING, group=TGRP-ConcurrentDeleteAndCreateCollectionTest] at java.lang.Thread.sleep(Native Method) at org.apache.http.impl.client.IdleConnectionEvictor$1.run(IdleConnectionEvictor.java:66) at java.lang.Thread.run(Thread.java:745)
Stack Trace:
com.carrotsearch.randomizedtesting.ThreadLeakError: 10 threads leaked from SUITE scope at org.apache.solr.cloud.ConcurrentDeleteAndCreateCollectionTest:
1) Thread[id=157099, name=Connection evictor, state=TIMED_WAITING, group=TGRP-ConcurrentDeleteAndCreateCollectionTest]
at java.lang.Thread.sleep(Native Method)
at org.apache.http.impl.client.IdleConnectionEvictor$1.run(IdleConnectionEvictor.java:66)
at java.lang.Thread.run(Thread.java:745)
2) Thread[id=157119, name=Connection evictor, state=TIMED_WAITING, group=TGRP-ConcurrentDeleteAndCreateCollectionTest]
at java.lang.Thread.sleep(Native Method)
at org.apache.http.impl.client.IdleConnectionEvictor$1.run(IdleConnectionEvictor.java:66)
at java.lang.Thread.run(Thread.java:745)
3) Thread[id=157124, name=Connection evictor, state=TIMED_WAITING, group=TGRP-ConcurrentDeleteAndCreateCollectionTest]
at java.lang.Thread.sleep(Native Method)
at org.apache.http.impl.client.IdleConnectionEvictor$1.run(IdleConnectionEvictor.java:66)
at java.lang.Thread.run(Thread.java:745)
4) Thread[id=157109, name=Connection evictor, state=TIMED_WAITING, group=TGRP-ConcurrentDeleteAndCreateCollectionTest]
at java.lang.Thread.sleep(Native Method)
at org.apache.http.impl.client.IdleConnectionEvictor$1.run(IdleConnectionEvictor.java:66)
at java.lang.Thread.run(Thread.java:745)
5) Thread[id=157104, name=Connection evictor, state=TIMED_WAITING, group=TGRP-ConcurrentDeleteAndCreateCollectionTest]
at java.lang.Thread.sleep(Native Method)
at org.apache.http.impl.client.IdleConnectionEvictor$1.run(IdleConnectionEvictor.java:66)
at java.lang.Thread.run(Thread.java:745)
6) Thread[id=157114, name=Connection evictor, state=TIMED_WAITING, group=TGRP-ConcurrentDeleteAndCreateCollectionTest]
at java.lang.Thread.sleep(Native Method)
at org.apache.http.impl.client.IdleConnectionEvictor$1.run(IdleConnectionEvictor.java:66)
at java.lang.Thread.run(Thread.java:745)
7) Thread[id=157129, name=Connection evictor, state=TIMED_WAITING, group=TGRP-ConcurrentDeleteAndCreateCollectionTest]
at java.lang.Thread.sleep(Native Method)
at org.apache.http.impl.client.IdleConnectionEvictor$1.run(IdleConnectionEvictor.java:66)
at java.lang.Thread.run(Thread.java:745)
8) Thread[id=157134, name=Connection evictor, state=TIMED_WAITING, group=TGRP-ConcurrentDeleteAndCreateCollectionTest]
at java.lang.Thread.sleep(Native Method)
at org.apache.http.impl.client.IdleConnectionEvictor$1.run(IdleConnectionEvictor.java:66)
at java.lang.Thread.run(Thread.java:745)
9) Thread[id=157094, name=Connection evictor, state=TIMED_WAITING, group=TGRP-ConcurrentDeleteAndCreateCollectionTest]
at java.lang.Thread.sleep(Native Method)
at org.apache.http.impl.client.IdleConnectionEvictor$1.run(IdleConnectionEvictor.java:66)
at java.lang.Thread.run(Thread.java:745)
10) Thread[id=157139, name=Connection evictor, state=TIMED_WAITING, group=TGRP-ConcurrentDeleteAndCreateCollectionTest]
at java.lang.Thread.sleep(Native Method)
at org.apache.http.impl.client.IdleConnectionEvictor$1.run(IdleConnectionEvictor.java:66)
at java.lang.Thread.run(Thread.java:745)
at __randomizedtesting.SeedInfo.seed([B9FEBBEA9674803A]:0)
Build Log:
[...truncated 12379 lines...]
[junit4] Suite: org.apache.solr.cloud.CdcrReplicationHandlerTest
[junit4] 2> Creating dataDir: /x1/jenkins/jenkins-slave/workspace/Lucene-Solr-NightlyTests-master/solr/build/solr-core/test/J2/temp/solr.cloud.CdcrReplicationHandlerTest_B9FEBBEA9674803A-001/init-core-data-001
[junit4] 2> 3237657 INFO (SUITE-CdcrReplicationHandlerTest-seed#[B9FEBBEA9674803A]-worker) [ ] o.a.s.SolrTestCaseJ4 Randomized ssl (true) and clientAuth (false)
[junit4] 2> 3237657 INFO (SUITE-CdcrReplicationHandlerTest-seed#[B9FEBBEA9674803A]-worker) [ ] o.a.s.BaseDistributedSearchTestCase Setting hostContext system property: /
[junit4] 2> 3237669 INFO (TEST-CdcrReplicationHandlerTest.testReplicationWithBufferedUpdates-seed#[B9FEBBEA9674803A]) [ ] o.a.s.c.ZkTestServer STARTING ZK TEST SERVER
[junit4] 2> 3237684 INFO (Thread-143104) [ ] o.a.s.c.ZkTestServer client port:0.0.0.0/0.0.0.0:0
[junit4] 2> 3237684 INFO (Thread-143104) [ ] o.a.s.c.ZkTestServer Starting server
[junit4] 2> 3237776 INFO (TEST-CdcrReplicationHandlerTest.testReplicationWithBufferedUpdates-seed#[B9FEBBEA9674803A]) [ ] o.a.s.c.ZkTestServer start zk server on port:48341
[junit4] 2> 3237776 INFO (TEST-CdcrReplicationHandlerTest.testReplicationWithBufferedUpdates-seed#[B9FEBBEA9674803A]) [ ] o.a.s.c.c.SolrZkClient Using default ZkCredentialsProvider
[junit4] 2> 3237777 INFO (TEST-CdcrReplicationHandlerTest.testReplicationWithBufferedUpdates-seed#[B9FEBBEA9674803A]) [ ] o.a.s.c.c.ConnectionManager Waiting for client to connect to ZooKeeper
[junit4] 2> 3237780 INFO (zkCallback-1816-thread-1) [ ] o.a.s.c.c.ConnectionManager Watcher org.apache.solr.common.cloud.ConnectionManager@73cc45ff name:ZooKeeperConnection Watcher:127.0.0.1:48341 got event WatchedEvent state:SyncConnected type:None path:null path:null type:None
[junit4] 2> 3237780 INFO (TEST-CdcrReplicationHandlerTest.testReplicationWithBufferedUpdates-seed#[B9FEBBEA9674803A]) [ ] o.a.s.c.c.ConnectionManager Client is connected to ZooKeeper
[junit4] 2> 3237780 INFO (TEST-CdcrReplicationHandlerTest.testReplicationWithBufferedUpdates-seed#[B9FEBBEA9674803A]) [ ] o.a.s.c.c.SolrZkClient Using default ZkACLProvider
[junit4] 2> 3237780 INFO (TEST-CdcrReplicationHandlerTest.testReplicationWithBufferedUpdates-seed#[B9FEBBEA9674803A]) [ ] o.a.s.c.c.SolrZkClient makePath: /solr
[junit4] 2> 3237783 INFO (TEST-CdcrReplicationHandlerTest.testReplicationWithBufferedUpdates-seed#[B9FEBBEA9674803A]) [ ] o.a.s.c.c.SolrZkClient Using default ZkCredentialsProvider
[junit4] 2> 3237784 INFO (TEST-CdcrReplicationHandlerTest.testReplicationWithBufferedUpdates-seed#[B9FEBBEA9674803A]) [ ] o.a.s.c.c.ConnectionManager Waiting for client to connect to ZooKeeper
[junit4] 2> 3237785 INFO (zkCallback-1817-thread-1) [ ] o.a.s.c.c.ConnectionManager Watcher org.apache.solr.common.cloud.ConnectionManager@74cacc31 name:ZooKeeperConnection Watcher:127.0.0.1:48341/solr got event WatchedEvent state:SyncConnected type:None path:null path:null type:None
[junit4] 2> 3237785 INFO (TEST-CdcrReplicationHandlerTest.testReplicationWithBufferedUpdates-seed#[B9FEBBEA9674803A]) [ ] o.a.s.c.c.ConnectionManager Client is connected to ZooKeeper
[junit4] 2> 3237785 INFO (TEST-CdcrReplicationHandlerTest.testReplicationWithBufferedUpdates-seed#[B9FEBBEA9674803A]) [ ] o.a.s.c.c.SolrZkClient Using default ZkACLProvider
[junit4] 2> 3237785 INFO (TEST-CdcrReplicationHandlerTest.testReplicationWithBufferedUpdates-seed#[B9FEBBEA9674803A]) [ ] o.a.s.c.c.SolrZkClient makePath: /collections/collection1
[junit4] 2> 3237787 INFO (TEST-CdcrReplicationHandlerTest.testReplicationWithBufferedUpdates-seed#[B9FEBBEA9674803A]) [ ] o.a.s.c.c.SolrZkClient makePath: /collections/collection1/shards
[junit4] 2> 3237788 INFO (TEST-CdcrReplicationHandlerTest.testReplicationWithBufferedUpdates-seed#[B9FEBBEA9674803A]) [ ] o.a.s.c.c.SolrZkClient makePath: /collections/control_collection
[junit4] 2> 3237789 INFO (TEST-CdcrReplicationHandlerTest.testReplicationWithBufferedUpdates-seed#[B9FEBBEA9674803A]) [ ] o.a.s.c.c.SolrZkClient makePath: /collections/control_collection/shards
[junit4] 2> 3237790 INFO (TEST-CdcrReplicationHandlerTest.testReplicationWithBufferedUpdates-seed#[B9FEBBEA9674803A]) [ ] o.a.s.c.AbstractZkTestCase put /x1/jenkins/jenkins-slave/workspace/Lucene-Solr-NightlyTests-master/solr/core/src/test-files/solr/collection1/conf/solrconfig-cdcr.xml to /configs/conf1/solrconfig.xml
[junit4] 2> 3237791 INFO (TEST-CdcrReplicationHandlerTest.testReplicationWithBufferedUpdates-seed#[B9FEBBEA9674803A]) [ ] o.a.s.c.c.SolrZkClient makePath: /configs/conf1/solrconfig.xml
[junit4] 2> 3237793 INFO (TEST-CdcrReplicationHandlerTest.testReplicationWithBufferedUpdates-seed#[B9FEBBEA9674803A]) [ ] o.a.s.c.AbstractZkTestCase put /x1/jenkins/jenkins-slave/workspace/Lucene-Solr-NightlyTests-master/solr/core/src/test-files/solr/collection1/conf/schema15.xml to /configs/conf1/schema.xml
[junit4] 2> 3237793 INFO (TEST-CdcrReplicationHandlerTest.testReplicationWithBufferedUpdates-seed#[B9FEBBEA9674803A]) [ ] o.a.s.c.c.SolrZkClient makePath: /configs/conf1/schema.xml
[junit4] 2> 3237795 INFO (TEST-CdcrReplicationHandlerTest.testReplicationWithBufferedUpdates-seed#[B9FEBBEA9674803A]) [ ] o.a.s.c.AbstractZkTestCase put /x1/jenkins/jenkins-slave/workspace/Lucene-Solr-NightlyTests-master/solr/core/src/test-files/solr/collection1/conf/solrconfig.snippet.randomindexconfig.xml to /configs/conf1/solrconfig.snippet.randomindexconfig.xml
[junit4] 2> 3237795 INFO (TEST-CdcrReplicationHandlerTest.testReplicationWithBufferedUpdates-seed#[B9FEBBEA9674803A]) [ ] o.a.s.c.c.SolrZkClient makePath: /configs/conf1/solrconfig.snippet.randomindexconfig.xml
[junit4] 2> 3237796 INFO (TEST-CdcrReplicationHandlerTest.testReplicationWithBufferedUpdates-seed#[B9FEBBEA9674803A]) [ ] o.a.s.c.AbstractZkTestCase put /x1/jenkins/jenkins-slave/workspace/Lucene-Solr-NightlyTests-master/solr/core/src/test-files/solr/collection1/conf/stopwords.txt to /configs/conf1/stopwords.txt
[junit4] 2> 3237796 INFO (TEST-CdcrReplicationHandlerTest.testReplicationWithBufferedUpdates-seed#[B9FEBBEA9674803A]) [ ] o.a.s.c.c.SolrZkClient makePath: /configs/conf1/stopwords.txt
[junit4] 2> 3237797 INFO (TEST-CdcrReplicationHandlerTest.testReplicationWithBufferedUpdates-seed#[B9FEBBEA9674803A]) [ ] o.a.s.c.AbstractZkTestCase put /x1/jenkins/jenkins-slave/workspace/Lucene-Solr-NightlyTests-master/solr/core/src/test-files/solr/collection1/conf/protwords.txt to /configs/conf1/protwords.txt
[junit4] 2> 3237798 INFO (TEST-CdcrReplicationHandlerTest.testReplicationWithBufferedUpdates-seed#[B9FEBBEA9674803A]) [ ] o.a.s.c.c.SolrZkClient makePath: /configs/conf1/protwords.txt
[junit4] 2> 3237799 INFO (TEST-CdcrReplicationHandlerTest.testReplicationWithBufferedUpdates-seed#[B9FEBBEA9674803A]) [ ] o.a.s.c.AbstractZkTestCase put /x1/jenkins/jenkins-slave/workspace/Lucene-Solr-NightlyTests-master/solr/core/src/test-files/solr/collection1/conf/currency.xml to /configs/conf1/currency.xml
[junit4] 2> 3237799 INFO (TEST-CdcrReplicationHandlerTest.testReplicationWithBufferedUpdates-seed#[B9FEBBEA9674803A]) [ ] o.a.s.c.c.SolrZkClient makePath: /configs/conf1/currency.xml
[junit4] 2> 3237800 INFO (TEST-CdcrReplicationHandlerTest.testReplicationWithBufferedUpdates-seed#[B9FEBBEA9674803A]) [ ] o.a.s.c.AbstractZkTestCase put /x1/jenkins/jenkins-slave/workspace/Lucene-Solr-NightlyTests-master/solr/core/src/test-files/solr/collection1/conf/enumsConfig.xml to /configs/conf1/enumsConfig.xml
[junit4] 2> 3237800 INFO (TEST-CdcrReplicationHandlerTest.testReplicationWithBufferedUpdates-seed#[B9FEBBEA9674803A]) [ ] o.a.s.c.c.SolrZkClient makePath: /configs/conf1/enumsConfig.xml
[junit4] 2> 3237801 INFO (TEST-CdcrReplicationHandlerTest.testReplicationWithBufferedUpdates-seed#[B9FEBBEA9674803A]) [ ] o.a.s.c.AbstractZkTestCase put /x1/jenkins/jenkins-slave/workspace/Lucene-Solr-NightlyTests-master/solr/core/src/test-files/solr/collection1/conf/open-exchange-rates.json to /configs/conf1/open-exchange-rates.json
[junit4] 2> 3237801 INFO (TEST-CdcrReplicationHandlerTest.testReplicationWithBufferedUpdates-seed#[B9FEBBEA9674803A]) [ ] o.a.s.c.c.SolrZkClient makePath: /configs/conf1/open-exchange-rates.json
[junit4] 2> 3237802 INFO (TEST-CdcrReplicationHandlerTest.testReplicationWithBufferedUpdates-seed#[B9FEBBEA9674803A]) [ ] o.a.s.c.AbstractZkTestCase put /x1/jenkins/jenkins-slave/workspace/Lucene-Solr-NightlyTests-master/solr/core/src/test-files/solr/collection1/conf/mapping-ISOLatin1Accent.txt to /configs/conf1/mapping-ISOLatin1Accent.txt
[junit4] 2> 3237802 INFO (TEST-CdcrReplicationHandlerTest.testReplicationWithBufferedUpdates-seed#[B9FEBBEA9674803A]) [ ] o.a.s.c.c.SolrZkClient makePath: /configs/conf1/mapping-ISOLatin1Accent.txt
[junit4] 2> 3237803 INFO (TEST-CdcrReplicationHandlerTest.testReplicationWithBufferedUpdates-seed#[B9FEBBEA9674803A]) [ ] o.a.s.c.AbstractZkTestCase put /x1/jenkins/jenkins-slave/workspace/Lucene-Solr-NightlyTests-master/solr/core/src/test-files/solr/collection1/conf/old_synonyms.txt to /configs/conf1/old_synonyms.txt
[junit4] 2> 3237804 INFO (TEST-CdcrReplicationHandlerTest.testReplicationWithBufferedUpdates-seed#[B9FEBBEA9674803A]) [ ] o.a.s.c.c.SolrZkClient makePath: /configs/conf1/old_synonyms.txt
[junit4] 2> 3237805 INFO (TEST-CdcrReplicationHandlerTest.testReplicationWithBufferedUpdates-seed#[B9FEBBEA9674803A]) [ ] o.a.s.c.AbstractZkTestCase put /x1/jenkins/jenkins-slave/workspace/Lucene-Solr-NightlyTests-master/solr/core/src/test-files/solr/collection1/conf/synonyms.txt to /configs/conf1/synonyms.txt
[junit4] 2> 3237805 INFO (TEST-CdcrReplicationHandlerTest.testReplicationWithBufferedUpdates-seed#[B9FEBBEA9674803A]) [ ] o.a.s.c.c.SolrZkClient makePath: /configs/conf1/synonyms.txt
[junit4] 2> 3237806 INFO (TEST-CdcrReplicationHandlerTest.testReplicationWithBufferedUpdates-seed#[B9FEBBEA9674803A]) [ ] o.a.s.c.c.SolrZkClient Using default ZkCredentialsProvider
[junit4] 2> 3237807 INFO (TEST-CdcrReplicationHandlerTest.testReplicationWithBufferedUpdates-seed#[B9FEBBEA9674803A]) [ ] o.a.s.c.c.ConnectionManager Waiting for client to connect to ZooKeeper
[junit4] 2> 3237807 INFO (zkCallback-1818-thread-1) [ ] o.a.s.c.c.ConnectionManager Watcher org.apache.solr.common.cloud.ConnectionManager@33939104 name:ZooKeeperConnection Watcher:127.0.0.1:48341/solr got event WatchedEvent state:SyncConnected type:None path:null path:null type:None
[junit4] 2> 3237807 INFO (TEST-CdcrReplicationHandlerTest.testReplicationWithBufferedUpdates-seed#[B9FEBBEA9674803A]) [ ] o.a.s.c.c.ConnectionManager Client is connected to ZooKeeper
[junit4] 2> 3237808 INFO (TEST-CdcrReplicationHandlerTest.testReplicationWithBufferedUpdates-seed#[B9FEBBEA9674803A]) [ ] o.a.s.c.c.SolrZkClient Using default ZkACLProvider
[junit4] 2> 3237809 INFO (TEST-CdcrReplicationHandlerTest.testReplicationWithBufferedUpdates-seed#[B9FEBBEA9674803A]) [ ] o.a.s.SolrTestCaseJ4 ###Starting testReplicationWithBufferedUpdates
[junit4] 2> 3237866 INFO (TEST-CdcrReplicationHandlerTest.testReplicationWithBufferedUpdates-seed#[B9FEBBEA9674803A]) [ ] o.a.s.SolrTestCaseJ4 Writing core.properties file to /x1/jenkins/jenkins-slave/workspace/Lucene-Solr-NightlyTests-master/solr/build/solr-core/test/J2/temp/solr.cloud.CdcrReplicationHandlerTest_B9FEBBEA9674803A-001/jetty-001/cores/collection1
[junit4] 2> 3237868 INFO (TEST-CdcrReplicationHandlerTest.testReplicationWithBufferedUpdates-seed#[B9FEBBEA9674803A]) [ ] o.e.j.s.Server jetty-9.3.8.v20160314
[junit4] 2> 3237876 INFO (TEST-CdcrReplicationHandlerTest.testReplicationWithBufferedUpdates-seed#[B9FEBBEA9674803A]) [ ] o.e.j.s.h.ContextHandler Started o.e.j.s.ServletContextHandler@25a283ec{/,null,AVAILABLE}
[junit4] 2> 3237878 INFO (TEST-CdcrReplicationHandlerTest.testReplicationWithBufferedUpdates-seed#[B9FEBBEA9674803A]) [ ] o.e.j.s.ServerConnector Started ServerConnector@71f52bd9{SSL,[ssl, http/1.1]}{127.0.0.1:40147}
[junit4] 2> 3237878 INFO (TEST-CdcrReplicationHandlerTest.testReplicationWithBufferedUpdates-seed#[B9FEBBEA9674803A]) [ ] o.e.j.s.Server Started @3239766ms
[junit4] 2> 3237878 INFO (TEST-CdcrReplicationHandlerTest.testReplicationWithBufferedUpdates-seed#[B9FEBBEA9674803A]) [ ] o.a.s.c.s.e.JettySolrRunner Jetty properties: {shards=shard1, hostContext=/, hostPort=40147, coreRootDirectory=/x1/jenkins/jenkins-slave/workspace/Lucene-Solr-NightlyTests-master/solr/build/solr-core/test/J2/temp/solr.cloud.CdcrReplicationHandlerTest_B9FEBBEA9674803A-001/jetty-001/cores}
[junit4] 2> 3237878 INFO (TEST-CdcrReplicationHandlerTest.testReplicationWithBufferedUpdates-seed#[B9FEBBEA9674803A]) [ ] o.a.s.s.SolrDispatchFilter SolrDispatchFilter.init(): sun.misc.Launcher$AppClassLoader@73d16e93
[junit4] 2> 3237878 INFO (TEST-CdcrReplicationHandlerTest.testReplicationWithBufferedUpdates-seed#[B9FEBBEA9674803A]) [ ] o.a.s.c.SolrResourceLoader new SolrResourceLoader for directory: '/x1/jenkins/jenkins-slave/workspace/Lucene-Solr-NightlyTests-master/solr/build/solr-core/test/J2/temp/solr.cloud.CdcrReplicationHandlerTest_B9FEBBEA9674803A-001/jetty-001'
[junit4] 2> 3237879 INFO (TEST-CdcrReplicationHandlerTest.testReplicationWithBufferedUpdates-seed#[B9FEBBEA9674803A]) [ ] o.a.s.c.SolrResourceLoader JNDI not configured for solr (NoInitialContextEx)
[junit4] 2> 3237879 INFO (TEST-CdcrReplicationHandlerTest.testReplicationWithBufferedUpdates-seed#[B9FEBBEA9674803A]) [ ] o.a.s.c.SolrResourceLoader solr home defaulted to 'solr/' (could not find system property or JNDI)
[junit4] 2> 3237879 INFO (TEST-CdcrReplicationHandlerTest.testReplicationWithBufferedUpdates-seed#[B9FEBBEA9674803A]) [ ] o.a.s.c.c.SolrZkClient Using default ZkCredentialsProvider
[junit4] 2> 3237892 INFO (TEST-CdcrReplicationHandlerTest.testReplicationWithBufferedUpdates-seed#[B9FEBBEA9674803A]) [ ] o.a.s.c.c.ConnectionManager Waiting for client to connect to ZooKeeper
[junit4] 2> 3237908 INFO (zkCallback-1819-thread-1) [ ] o.a.s.c.c.ConnectionManager Watcher org.apache.solr.common.cloud.ConnectionManager@19f6814c name:ZooKeeperConnection Watcher:127.0.0.1:48341/solr got event WatchedEvent state:SyncConnected type:None path:null path:null type:None
[junit4] 2> 3237908 INFO (TEST-CdcrReplicationHandlerTest.testReplicationWithBufferedUpdates-seed#[B9FEBBEA9674803A]) [ ] o.a.s.c.c.ConnectionManager Client is connected to ZooKeeper
[junit4] 2> 3237908 INFO (TEST-CdcrReplicationHandlerTest.testReplicationWithBufferedUpdates-seed#[B9FEBBEA9674803A]) [ ] o.a.s.c.c.SolrZkClient Using default ZkACLProvider
[junit4] 2> 3237909 INFO (TEST-CdcrReplicationHandlerTest.testReplicationWithBufferedUpdates-seed#[B9FEBBEA9674803A]) [ ] o.a.s.s.SolrDispatchFilter Loading solr.xml from SolrHome (not found in ZooKeeper)
[junit4] 2> 3237909 INFO (TEST-CdcrReplicationHandlerTest.testReplicationWithBufferedUpdates-seed#[B9FEBBEA9674803A]) [ ] o.a.s.c.SolrXmlConfig Loading container configuration from /x1/jenkins/jenkins-slave/workspace/Lucene-Solr-NightlyTests-master/solr/build/solr-core/test/J2/temp/solr.cloud.CdcrReplicationHandlerTest_B9FEBBEA9674803A-001/jetty-001/solr.xml
[junit4] 2> 3237987 INFO (TEST-CdcrReplicationHandlerTest.testReplicationWithBufferedUpdates-seed#[B9FEBBEA9674803A]) [ ] o.a.s.c.CorePropertiesLocator Config-defined core root directory: /x1/jenkins/jenkins-slave/workspace/Lucene-Solr-NightlyTests-master/solr/build/solr-core/test/J2/temp/solr.cloud.CdcrReplicationHandlerTest_B9FEBBEA9674803A-001/jetty-001/cores
[junit4] 2> 3237987 INFO (TEST-CdcrReplicationHandlerTest.testReplicationWithBufferedUpdates-seed#[B9FEBBEA9674803A]) [ ] o.a.s.c.CoreContainer New CoreContainer 1342732966
[junit4] 2> 3237987 INFO (TEST-CdcrReplicationHandlerTest.testReplicationWithBufferedUpdates-seed#[B9FEBBEA9674803A]) [ ] o.a.s.c.CoreContainer Loading cores into CoreContainer [instanceDir=/x1/jenkins/jenkins-slave/workspace/Lucene-Solr-NightlyTests-master/solr/build/solr-core/test/J2/temp/solr.cloud.CdcrReplicationHandlerTest_B9FEBBEA9674803A-001/jetty-001]
[junit4] 2> 3237987 WARN (TEST-CdcrReplicationHandlerTest.testReplicationWithBufferedUpdates-seed#[B9FEBBEA9674803A]) [ ] o.a.s.c.CoreContainer Couldn't add files from /x1/jenkins/jenkins-slave/workspace/Lucene-Solr-NightlyTests-master/solr/build/solr-core/test/J2/temp/solr.cloud.CdcrReplicationHandlerTest_B9FEBBEA9674803A-001/jetty-001/lib to classpath: /x1/jenkins/jenkins-slave/workspace/Lucene-Solr-NightlyTests-master/solr/build/solr-core/test/J2/temp/solr.cloud.CdcrReplicationHandlerTest_B9FEBBEA9674803A-001/jetty-001/lib
[junit4] 2> 3237987 INFO (TEST-CdcrReplicationHandlerTest.testReplicationWithBufferedUpdates-seed#[B9FEBBEA9674803A]) [ ] o.a.s.h.c.HttpShardHandlerFactory created with socketTimeout : 90000,urlScheme : ,connTimeout : 15000,maxConnectionsPerHost : 20,maxConnections : 10000,corePoolSize : 0,maximumPoolSize : 2147483647,maxThreadIdleTime : 5,sizeOfQueue : -1,fairnessPolicy : false,
[junit4] 2> 3237988 INFO (TEST-CdcrReplicationHandlerTest.testReplicationWithBufferedUpdates-seed#[B9FEBBEA9674803A]) [ ] o.a.s.u.UpdateShardHandler Creating UpdateShardHandler HTTP client with params:
[junit4] 2> 3237996 INFO (TEST-CdcrReplicationHandlerTest.testReplicationWithBufferedUpdates-seed#[B9FEBBEA9674803A]) [ ] o.a.s.l.LogWatcher SLF4J impl is org.slf4j.impl.Log4jLoggerFactory
[junit4] 2> 3237996 INFO (TEST-CdcrReplicationHandlerTest.testReplicationWithBufferedUpdates-seed#[B9FEBBEA9674803A]) [ ] o.a.s.l.LogWatcher Registering Log Listener [Log4j (org.slf4j.impl.Log4jLoggerFactory)]
[junit4] 2> 3237996 INFO (TEST-CdcrReplicationHandlerTest.testReplicationWithBufferedUpdates-seed#[B9FEBBEA9674803A]) [ ] o.a.s.c.ZkContainer Zookeeper client=127.0.0.1:48341/solr
[junit4] 2> 3237996 INFO (TEST-CdcrReplicationHandlerTest.testReplicationWithBufferedUpdates-seed#[B9FEBBEA9674803A]) [ ] o.a.s.c.ZkController zkHost includes chroot
[junit4] 2> 3237996 INFO (TEST-CdcrReplicationHandlerTest.testReplicationWithBufferedUpdates-seed#[B9FEBBEA9674803A]) [ ] o.a.s.c.c.SolrZkClient Using default ZkCredentialsProvider
[junit4] 2> 3238016 INFO (TEST-CdcrReplicationHandlerTest.testReplicationWithBufferedUpdates-seed#[B9FEBBEA9674803A]) [ ] o.a.s.c.c.ConnectionManager Waiting for client to connect to ZooKeeper
[junit4] 2> 3238032 INFO (zkCallback-1822-thread-1) [ ] o.a.s.c.c.ConnectionManager Watcher org.apache.solr.common.cloud.ConnectionManager@75458c31 name:ZooKeeperConnection Watcher:127.0.0.1:48341 got event WatchedEvent state:SyncConnected type:None path:null path:null type:None
[junit4] 2> 3238032 INFO (TEST-CdcrReplicationHandlerTest.testReplicationWithBufferedUpdates-seed#[B9FEBBEA9674803A]) [ ] o.a.s.c.c.ConnectionManag
[...truncated too long message...]
s/jenkins-slave/workspace/Lucene-Solr-NightlyTests-master/solr/core/test-lib/apacheds-interceptors-event-2.0.0-M15.jar:/x1/jenkins/jenkins-slave/workspace/Lucene-Solr-NightlyTests-master/solr/core/test-lib/apacheds-interceptors-exception-2.0.0-M15.jar:/x1/jenkins/jenkins-slave/workspace/Lucene-Solr-NightlyTests-master/solr/core/test-lib/apacheds-interceptors-journal-2.0.0-M15.jar:/x1/jenkins/jenkins-slave/workspace/Lucene-Solr-NightlyTests-master/solr/core/test-lib/apacheds-interceptors-normalization-2.0.0-M15.jar:/x1/jenkins/jenkins-slave/workspace/Lucene-Solr-NightlyTests-master/solr/core/test-lib/apacheds-interceptors-operational-2.0.0-M15.jar:/x1/jenkins/jenkins-slave/workspace/Lucene-Solr-NightlyTests-master/solr/core/test-lib/apacheds-interceptors-referral-2.0.0-M15.jar:/x1/jenkins/jenkins-slave/workspace/Lucene-Solr-NightlyTests-master/solr/core/test-lib/apacheds-interceptors-schema-2.0.0-M15.jar:/x1/jenkins/jenkins-slave/workspace/Lucene-Solr-NightlyTests-master/solr/core/test-lib/apacheds-interceptors-subtree-2.0.0-M15.jar:/x1/jenkins/jenkins-slave/workspace/Lucene-Solr-NightlyTests-master/solr/core/test-lib/apacheds-interceptors-trigger-2.0.0-M15.jar:/x1/jenkins/jenkins-slave/workspace/Lucene-Solr-NightlyTests-master/solr/core/test-lib/apacheds-jdbm-partition-2.0.0-M15.jar:/x1/jenkins/jenkins-slave/workspace/Lucene-Solr-NightlyTests-master/solr/core/test-lib/apacheds-jdbm1-2.0.0-M2.jar:/x1/jenkins/jenkins-slave/workspace/Lucene-Solr-NightlyTests-master/solr/core/test-lib/apacheds-kerberos-codec-2.0.0-M15.jar:/x1/jenkins/jenkins-slave/workspace/Lucene-Solr-NightlyTests-master/solr/core/test-lib/apacheds-ldif-partition-2.0.0-M15.jar:/x1/jenkins/jenkins-slave/workspace/Lucene-Solr-NightlyTests-master/solr/core/test-lib/apacheds-mavibot-partition-2.0.0-M15.jar:/x1/jenkins/jenkins-slave/workspace/Lucene-Solr-NightlyTests-master/solr/core/test-lib/apacheds-protocol-kerberos-2.0.0-M15.jar:/x1/jenkins/jenkins-slave/workspace/Lucene-Solr-NightlyTests-master/solr/core/test-lib/apacheds-protocol-ldap-2.0.0-M15.jar:/x1/jenkins/jenkins-slave/workspace/Lucene-Solr-NightlyTests-master/solr/core/test-lib/apacheds-protocol-shared-2.0.0-M15.jar:/x1/jenkins/jenkins-slave/workspace/Lucene-Solr-NightlyTests-master/solr/core/test-lib/apacheds-xdbm-partition-2.0.0-M15.jar:/x1/jenkins/jenkins-slave/workspace/Lucene-Solr-NightlyTests-master/solr/core/test-lib/api-all-1.0.0-M20.jar:/x1/jenkins/jenkins-slave/workspace/Lucene-Solr-NightlyTests-master/solr/core/test-lib/bcprov-jdk15-1.45.jar:/x1/jenkins/jenkins-slave/workspace/Lucene-Solr-NightlyTests-master/solr/core/test-lib/cglib-nodep-2.2.jar:/x1/jenkins/jenkins-slave/workspace/Lucene-Solr-NightlyTests-master/solr/core/test-lib/commons-collections-3.2.2.jar:/x1/jenkins/jenkins-slave/workspace/Lucene-Solr-NightlyTests-master/solr/core/test-lib/commons-math3-3.4.1.jar:/x1/jenkins/jenkins-slave/workspace/Lucene-Solr-NightlyTests-master/solr/core/test-lib/easymock-3.0.jar:/x1/jenkins/jenkins-slave/workspace/Lucene-Solr-NightlyTests-master/solr/core/test-lib/ehcache-core-2.4.4.jar:/x1/jenkins/jenkins-slave/workspace/Lucene-Solr-NightlyTests-master/solr/core/test-lib/hadoop-common-2.6.0-tests.jar:/x1/jenkins/jenkins-slave/workspace/Lucene-Solr-NightlyTests-master/solr/core/test-lib/hadoop-hdfs-2.6.0-tests.jar:/x1/jenkins/jenkins-slave/workspace/Lucene-Solr-NightlyTests-master/solr/core/test-lib/hadoop-minikdc-2.6.0.jar:/x1/jenkins/jenkins-slave/workspace/Lucene-Solr-NightlyTests-master/solr/core/test-lib/jackson-annotations-2.5.4.jar:/x1/jenkins/jenkins-slave/workspace/Lucene-Solr-NightlyTests-master/solr/core/test-lib/jackson-databind-2.5.4.jar:/x1/jenkins/jenkins-slave/workspace/Lucene-Solr-NightlyTests-master/solr/core/test-lib/jersey-core-1.9.jar:/x1/jenkins/jenkins-slave/workspace/Lucene-Solr-NightlyTests-master/solr/core/test-lib/jersey-server-1.9.jar:/x1/jenkins/jenkins-slave/workspace/Lucene-Solr-NightlyTests-master/solr/core/test-lib/jetty-6.1.26.jar:/x1/jenkins/jenkins-slave/workspace/Lucene-Solr-NightlyTests-master/solr/core/test-lib/jetty-util-6.1.26.jar:/x1/jenkins/jenkins-slave/workspace/Lucene-Solr-NightlyTests-master/solr/core/test-lib/mina-core-2.0.0-M5.jar:/x1/jenkins/jenkins-slave/workspace/Lucene-Solr-NightlyTests-master/solr/core/test-lib/mockito-core-1.9.5.jar:/x1/jenkins/jenkins-slave/workspace/Lucene-Solr-NightlyTests-master/solr/core/test-lib/objenesis-1.2.jar:/x1/jenkins/jenkins-slave/workspace/Lucene-Solr-NightlyTests-master/solr/core/test-lib/presto-parser-0.122.jar:/x1/jenkins/jenkins-slave/workspace/Lucene-Solr-NightlyTests-master/solr/core/test-lib/slice-0.10.jar:/x1/jenkins/jenkins-slave/workspace/Lucene-Solr-NightlyTests-master/lucene/build/analysis/icu/lucene-analyzers-icu-7.0.0-SNAPSHOT.jar:/x1/jenkins/jenkins-slave/workspace/Lucene-Solr-NightlyTests-master/solr/build/contrib/solr-analysis-extras/classes/java:/x1/jenkins/jenkins-slave/workspace/Lucene-Solr-NightlyTests-master/lucene/build/queryparser/classes/test:/x1/jenkins/jenkins-slave/workspace/Lucene-Solr-NightlyTests-master/solr/contrib/analysis-extras/lib/icu4j-56.1.jar:/home/jenkins/jenkins-slave/tools/hudson.tasks.Ant_AntInstallation/ant-1.8.2/lib/ant-launcher.jar:/x1/jenkins/.ant/lib/ivy-2.3.0.jar:/home/jenkins/jenkins-slave/tools/hudson.tasks.Ant_AntInstallation/ant-1.8.2/lib/ant-antlr.jar:/home/jenkins/jenkins-slave/tools/hudson.tasks.Ant_AntInstallation/ant-1.8.2/lib/ant-apache-regexp.jar:/home/jenkins/jenkins-slave/tools/hudson.tasks.Ant_AntInstallation/ant-1.8.2/lib/ant-apache-resolver.jar:/home/jenkins/jenkins-slave/tools/hudson.tasks.Ant_AntInstallation/ant-1.8.2/lib/ant-commons-net.jar:/home/jenkins/jenkins-slave/tools/hudson.tasks.Ant_AntInstallation/ant-1.8.2/lib/ant-jmf.jar:/home/jenkins/jenkins-slave/tools/hudson.tasks.Ant_AntInstallation/ant-1.8.2/lib/ant-apache-oro.jar:/home/jenkins/jenkins-slave/tools/hudson.tasks.Ant_AntInstallation/ant-1.8.2/lib/ant-apache-xalan2.jar:/home/jenkins/jenkins-slave/tools/hudson.tasks.Ant_AntInstallation/ant-1.8.2/lib/ant-commons-logging.jar:/home/jenkins/jenkins-slave/tools/hudson.tasks.Ant_AntInstallation/ant-1.8.2/lib/ant-jsch.jar:/home/jenkins/jenkins-slave/tools/hudson.tasks.Ant_AntInstallation/ant-1.8.2/lib/ant-junit4.jar:/home/jenkins/jenkins-slave/tools/hudson.tasks.Ant_AntInstallation/ant-1.8.2/lib/ant-javamail.jar:/home/jenkins/jenkins-slave/tools/hudson.tasks.Ant_AntInstallation/ant-1.8.2/lib/ant-jai.jar:/home/jenkins/jenkins-slave/tools/hudson.tasks.Ant_AntInstallation/ant-1.8.2/lib/ant-jdepend.jar:/home/jenkins/jenkins-slave/tools/hudson.tasks.Ant_AntInstallation/ant-1.8.2/lib/ant-junit.jar:/home/jenkins/jenkins-slave/tools/hudson.tasks.Ant_AntInstallation/ant-1.8.2/lib/ant-apache-bsf.jar:/home/jenkins/jenkins-slave/tools/hudson.tasks.Ant_AntInstallation/ant-1.8.2/lib/ant-swing.jar:/home/jenkins/jenkins-slave/tools/hudson.tasks.Ant_AntInstallation/ant-1.8.2/lib/ant.jar:/home/jenkins/jenkins-slave/tools/hudson.tasks.Ant_AntInstallation/ant-1.8.2/lib/ant-netrexx.jar:/home/jenkins/jenkins-slave/tools/hudson.tasks.Ant_AntInstallation/ant-1.8.2/lib/ant-apache-bcel.jar:/home/jenkins/jenkins-slave/tools/hudson.tasks.Ant_AntInstallation/ant-1.8.2/lib/ant-testutil.jar:/home/jenkins/jenkins-slave/tools/hudson.tasks.Ant_AntInstallation/ant-1.8.2/lib/ant-apache-log4j.jar:/x1/jenkins/jenkins-slave/tools/hudson.model.JDK/latest1.8/lib/tools.jar:/x1/jenkins/.ivy2/cache/com.carrotsearch.randomizedtesting/junit4-ant/jars/junit4-ant-2.3.4.jar com.carrotsearch.ant.tasks.junit4.slave.SlaveMainSafe -eventsfile /x1/jenkins/jenkins-slave/workspace/Lucene-Solr-NightlyTests-master/solr/build/solr-core/test/temp/junit4-J1-20160507_095946_637.events @/x1/jenkins/jenkins-slave/workspace/Lucene-Solr-NightlyTests-master/solr/build/solr-core/test/temp/junit4-J1-20160507_095946_637.suites -stdin
[junit4] ERROR: JVM J1 ended with an exception: Quit event not received from the forked process? This may indicate JVM crash or runner bugs.
[junit4] at com.carrotsearch.ant.tasks.junit4.JUnit4.executeSlave(JUnit4.java:1501)
[junit4] at com.carrotsearch.ant.tasks.junit4.JUnit4.access$000(JUnit4.java:121)
[junit4] at com.carrotsearch.ant.tasks.junit4.JUnit4$2.call(JUnit4.java:955)
[junit4] at com.carrotsearch.ant.tasks.junit4.JUnit4$2.call(JUnit4.java:952)
[junit4] at java.util.concurrent.FutureTask.run(FutureTask.java:266)
[junit4] at java.util.concurrent.ThreadPoolExecutor.runWorker(ThreadPoolExecutor.java:1142)
[junit4] at java.util.concurrent.ThreadPoolExecutor$Worker.run(ThreadPoolExecutor.java:617)
[junit4] at java.lang.Thread.run(Thread.java:745)
BUILD FAILED
/x1/jenkins/jenkins-slave/workspace/Lucene-Solr-NightlyTests-master/build.xml:747: The following error occurred while executing this line:
/x1/jenkins/jenkins-slave/workspace/Lucene-Solr-NightlyTests-master/build.xml:684: The following error occurred while executing this line:
/x1/jenkins/jenkins-slave/workspace/Lucene-Solr-NightlyTests-master/build.xml:59: The following error occurred while executing this line:
/x1/jenkins/jenkins-slave/workspace/Lucene-Solr-NightlyTests-master/solr/build.xml:233: The following error occurred while executing this line:
/x1/jenkins/jenkins-slave/workspace/Lucene-Solr-NightlyTests-master/solr/common-build.xml:529: The following error occurred while executing this line:
/x1/jenkins/jenkins-slave/workspace/Lucene-Solr-NightlyTests-master/lucene/common-build.xml:1457: The following error occurred while executing this line:
/x1/jenkins/jenkins-slave/workspace/Lucene-Solr-NightlyTests-master/lucene/common-build.xml:1014: At least one slave process threw an exception, first: Quit event not received from the forked process? This may indicate JVM crash or runner bugs.
Total time: 233 minutes 42 seconds
Build step 'Invoke Ant' marked build as failure
Archiving artifacts
No prior successful build to compare, so performing full copy of artifacts
Recording test results
Email was triggered for: Failure - Any
Sending email for trigger: Failure - Any