You are viewing a plain text version of this content. The canonical link for it is here.
Posted to issues@geode.apache.org by "Bruce J Schuchardt (Jira)" <ji...@apache.org> on 2020/05/21 22:42:00 UTC
[jira] [Created] (GEODE-8172) CI failure:
ParallelWANPersistenceEnabledGatewaySenderOffHeapDUnitTest.testpersistentWanGateway_restartSenderWithCleanQueues_expectNoEventsReceived
Bruce J Schuchardt created GEODE-8172:
-----------------------------------------
Summary: CI failure: ParallelWANPersistenceEnabledGatewaySenderOffHeapDUnitTest.testpersistentWanGateway_restartSenderWithCleanQueues_expectNoEventsReceived
Key: GEODE-8172
URL: https://issues.apache.org/jira/browse/GEODE-8172
Project: Geode
Issue Type: Bug
Components: wan
Reporter: Bruce J Schuchardt
Failed in a CI run (https://concourse.apachegeode-ci.info/teams/main/pipelines/apache-develop-main/jobs/DistributedTestOpenJDK8/builds/191#A).
No previous failures for this issue are found in JIRA and no recent WAN changes could be detected. Flaky?
{noformat}
> Task :geode-wan:distributedTest
org.apache.geode.internal.cache.wan.offheap.ParallelWANPersistenceEnabledGatewaySenderOffHeapDUnitTest > testpersistentWanGateway_restartSenderWithCleanQueues_expectNoEventsReceived FAILED
org.apache.geode.test.dunit.RMIException: While invoking org.apache.geode.internal.cache.wan.parallel.ParallelWANPersistenceEnabledGatewaySenderDUnitTest$$Lambda$487/908301056.run in VM 2 running on Host 8e35f765a792 with 8 VMs
Caused by:
org.awaitility.core.ConditionTimeoutException: Assertion condition defined as a lambda expression in org.apache.geode.internal.cache.wan.WANTestBase that uses int, intorg.apache.geode.cache.Region Expected region entries: 0 but actual entries: 20 present region keyset [3, 5, 8, 13, 16, 21, 27, 30, 35, 38, 43, 45, 50, 54, 58, 62, 65, 68, 73, 78] expected:<0> but was:<20> within 5 minutes.
Caused by:
java.lang.AssertionError: Expected region entries: 0 but actual entries: 20 present region keyset [3, 5, 8, 13, 16, 21, 27, 30, 35, 38, 43, 45, 50, 54, 58, 62, 65, 68, 73, 78] expected:<0> but was:<20>
824 tests completed, 1 failed, 59 skipped
> Task :geode-wan:distributedTest FAILED
{noformat}
--
This message was sent by Atlassian Jira
(v8.3.4#803005)