You are viewing a plain text version of this content. The canonical link for it is here.
Posted to dev@mahout.apache.org by Apache Jenkins Server <je...@builds.apache.org> on 2013/06/09 16:10:41 UTC

Build failed in Jenkins: Mahout-Quality #2064

See <https://builds.apache.org/job/Mahout-Quality/2064/changes>

Changes:

[gsingers] MAHOUT-1211: clean up use of deprecated closeQuietly api

------------------------------------------
[...truncated 7204 lines...]
[WARNING] Failure executing PMD: Couldn't find the class Can't find resource rulesets/basic.xml.  Make sure the resource is a valid file or URL or is on the CLASSPATH.  Here's the current classpath: /home/hudson/tools/maven/apache-maven-3.0.4/boot/plexus-classworlds-2.4.jar
java.lang.RuntimeException: Couldn't find the class Can't find resource rulesets/basic.xml.  Make sure the resource is a valid file or URL or is on the CLASSPATH.  Here's the current classpath: /home/hudson/tools/maven/apache-maven-3.0.4/boot/plexus-classworlds-2.4.jar
	at net.sourceforge.pmd.RuleSetFactory.classNotFoundProblem(RuleSetFactory.java:244)
	at net.sourceforge.pmd.RuleSetFactory.parseRuleSetNode(RuleSetFactory.java:234)
	at net.sourceforge.pmd.RuleSetFactory.createRuleSet(RuleSetFactory.java:161)
	at net.sourceforge.pmd.RuleSetFactory.createRuleSets(RuleSetFactory.java:126)
	at net.sourceforge.pmd.RuleSetFactory.createRuleSets(RuleSetFactory.java:111)
	at net.sourceforge.pmd.processor.AbstractPMDProcessor.createRuleSets(AbstractPMDProcessor.java:56)
	at net.sourceforge.pmd.processor.MonoThreadProcessor.processFiles(MonoThreadProcessor.java:41)
	at net.sourceforge.pmd.PMD.processFiles(PMD.java:271)
	at org.apache.maven.plugin.pmd.PmdReport.generateReport(PmdReport.java:296)
	at org.apache.maven.plugin.pmd.PmdReport.execute(PmdReport.java:194)
	at org.apache.maven.plugin.pmd.PmdReport.executeReport(PmdReport.java:168)
	at org.apache.maven.reporting.AbstractMavenReport.generate(AbstractMavenReport.java:190)
	at org.apache.maven.reporting.AbstractMavenReport.execute(AbstractMavenReport.java:99)
	at org.apache.maven.plugin.DefaultBuildPluginManager.executeMojo(DefaultBuildPluginManager.java:101)
	at org.apache.maven.lifecycle.internal.MojoExecutor.execute(MojoExecutor.java:209)
	at org.apache.maven.lifecycle.internal.MojoExecutor.execute(MojoExecutor.java:153)
	at org.apache.maven.lifecycle.internal.MojoExecutor.execute(MojoExecutor.java:145)
	at org.apache.maven.lifecycle.internal.LifecycleModuleBuilder.buildProject(LifecycleModuleBuilder.java:84)
	at org.apache.maven.lifecycle.internal.LifecycleModuleBuilder.buildProject(LifecycleModuleBuilder.java:59)
	at org.apache.maven.lifecycle.internal.LifecycleStarter.singleThreadedBuild(LifecycleStarter.java:183)
	at org.apache.maven.lifecycle.internal.LifecycleStarter.execute(LifecycleStarter.java:161)
	at org.apache.maven.DefaultMaven.doExecute(DefaultMaven.java:320)
	at org.apache.maven.DefaultMaven.execute(DefaultMaven.java:156)
	at org.apache.maven.cli.MavenCli.execute(MavenCli.java:537)
	at org.apache.maven.cli.MavenCli.doMain(MavenCli.java:196)
	at org.apache.maven.cli.MavenCli.main(MavenCli.java:141)
	at sun.reflect.NativeMethodAccessorImpl.invoke0(Native Method)
	at sun.reflect.NativeMethodAccessorImpl.invoke(NativeMethodAccessorImpl.java:39)
	at sun.reflect.DelegatingMethodAccessorImpl.invoke(DelegatingMethodAccessorImpl.java:25)
	at java.lang.reflect.Method.invoke(Method.java:597)
	at org.codehaus.plexus.classworlds.launcher.Launcher.launchEnhanced(Launcher.java:290)
	at org.codehaus.plexus.classworlds.launcher.Launcher.launch(Launcher.java:230)
	at org.codehaus.plexus.classworlds.launcher.Launcher.mainWithExitCode(Launcher.java:409)
	at org.codehaus.plexus.classworlds.launcher.Launcher.main(Launcher.java:352)
[INFO]                                                                         
[INFO] ------------------------------------------------------------------------
[INFO] Building Mahout Integration 0.8-SNAPSHOT
[INFO] ------------------------------------------------------------------------
[WARNING] The POM for com.atlassian.maven.plugins:maven-clover2-plugin:jar:3.1.11.1 is missing, no dependency information available
[WARNING] Failed to retrieve plugin descriptor for com.atlassian.maven.plugins:maven-clover2-plugin:3.1.11.1: Plugin com.atlassian.maven.plugins:maven-clover2-plugin:3.1.11.1 or one of its dependencies could not be resolved: Failed to read artifact descriptor for com.atlassian.maven.plugins:maven-clover2-plugin:jar:3.1.11.1
[WARNING] The POM for com.atlassian.maven.plugins:maven-clover2-plugin:jar:3.1.11.1 is missing, no dependency information available
[WARNING] Failed to retrieve plugin descriptor for com.atlassian.maven.plugins:maven-clover2-plugin:3.1.11.1: Plugin com.atlassian.maven.plugins:maven-clover2-plugin:3.1.11.1 or one of its dependencies could not be resolved: Failed to read artifact descriptor for com.atlassian.maven.plugins:maven-clover2-plugin:jar:3.1.11.1
[WARNING] The POM for org.eclipse.m2e:lifecycle-mapping:jar:1.0.0 is missing, no dependency information available
[WARNING] Failed to retrieve plugin descriptor for org.eclipse.m2e:lifecycle-mapping:1.0.0: Plugin org.eclipse.m2e:lifecycle-mapping:1.0.0 or one of its dependencies could not be resolved: Failed to read artifact descriptor for org.eclipse.m2e:lifecycle-mapping:jar:1.0.0
[WARNING] The POM for com.atlassian.maven.plugins:maven-clover2-plugin:jar:3.1.11.1 is missing, no dependency information available
[WARNING] Failed to retrieve plugin descriptor for com.atlassian.maven.plugins:maven-clover2-plugin:3.1.11.1: Plugin com.atlassian.maven.plugins:maven-clover2-plugin:3.1.11.1 or one of its dependencies could not be resolved: Failed to read artifact descriptor for com.atlassian.maven.plugins:maven-clover2-plugin:jar:3.1.11.1
[WARNING] The POM for org.eclipse.m2e:lifecycle-mapping:jar:1.0.0 is missing, no dependency information available
[WARNING] Failed to retrieve plugin descriptor for org.eclipse.m2e:lifecycle-mapping:1.0.0: Plugin org.eclipse.m2e:lifecycle-mapping:1.0.0 or one of its dependencies could not be resolved: Failed to read artifact descriptor for org.eclipse.m2e:lifecycle-mapping:jar:1.0.0
[INFO] 
[INFO] --- maven-clean-plugin:2.4.1:clean (default-clean) @ mahout-integration ---
[INFO] 
[INFO] --- maven-resources-plugin:2.6:resources (default-resources) @ mahout-integration ---
[INFO] Using 'UTF-8' encoding to copy filtered resources.
[INFO] Copying 0 resource
[INFO] 
[INFO] --- maven-compiler-plugin:3.1:compile (default-compile) @ mahout-integration ---
[INFO] Changes detected - recompiling the module!
[INFO] Compiling 125 source files to /home/hudson/jenkins-slave/workspace/Mahout-Quality/trunk/integration/target/classes
[WARNING] Note: /home/hudson/jenkins-slave/workspace/Mahout-Quality/trunk/integration/src/main/java/org/apache/mahout/cf/taste/impl/model/mongodb/MongoDBDataModel.java uses or overrides a deprecated API.
[WARNING] Note: Recompile with -Xlint:deprecation for details.
[WARNING] Note: /home/hudson/jenkins-slave/workspace/Mahout-Quality/trunk/integration/src/main/java/org/apache/mahout/cf/taste/impl/model/mongodb/MongoDBDataModel.java uses unchecked or unsafe operations.
[WARNING] Note: Recompile with -Xlint:unchecked for details.
[INFO] 
[INFO] --- maven-resources-plugin:2.6:testResources (default-testResources) @ mahout-integration ---
[INFO] Using 'UTF-8' encoding to copy filtered resources.
[INFO] Copying 10 resources
[INFO] 
[INFO] --- maven-compiler-plugin:3.1:testCompile (default-testCompile) @ mahout-integration ---
[INFO] Changes detected - recompiling the module!
[INFO] Compiling 38 source files to /home/hudson/jenkins-slave/workspace/Mahout-Quality/trunk/integration/target/test-classes
[WARNING] Note: Some input files use or override a deprecated API.
[WARNING] Note: Recompile with -Xlint:deprecation for details.
[INFO] 
[INFO] --- maven-surefire-plugin:2.14.1:test (default-test) @ mahout-integration ---
[INFO] Surefire report directory: /home/hudson/jenkins-slave/workspace/Mahout-Quality/trunk/integration/target/surefire-reports

-------------------------------------------------------
 T E S T S
-------------------------------------------------------

-------------------------------------------------------
 T E S T S
-------------------------------------------------------
parallel='classes', perCoreThreadCount=false, threadCount=1, useUnlimitedThreads=false
parallel='classes', perCoreThreadCount=false, threadCount=1, useUnlimitedThreads=false
parallel='classes', perCoreThreadCount=false, threadCount=1, useUnlimitedThreads=false
parallel='classes', perCoreThreadCount=false, threadCount=1, useUnlimitedThreads=false
parallel='classes', perCoreThreadCount=false, threadCount=1, useUnlimitedThreads=false
parallel='classes', perCoreThreadCount=false, threadCount=1, useUnlimitedThreads=false
parallel='classes', perCoreThreadCount=false, threadCount=1, useUnlimitedThreads=false
parallel='classes', perCoreThreadCount=false, threadCount=1, useUnlimitedThreads=false
parallel='classes', perCoreThreadCount=false, threadCount=1, useUnlimitedThreads=false
Running org.apache.mahout.utils.vectors.arff.ARFFVectorIterableTest
parallel='classes', perCoreThreadCount=false, threadCount=1, useUnlimitedThreads=false
Running org.apache.mahout.utils.regex.RegexMapperTest
Running org.apache.mahout.utils.vectors.lucene.LuceneIterableTest
Running org.apache.mahout.utils.regex.RegexUtilsTest
Tests run: 1, Failures: 0, Errors: 0, Skipped: 0, Time elapsed: 0.014 sec
parallel='classes', perCoreThreadCount=false, threadCount=1, useUnlimitedThreads=false
parallel='classes', perCoreThreadCount=false, threadCount=1, useUnlimitedThreads=false
Running org.apache.mahout.utils.email.MailProcessorTest
Tests run: 8, Failures: 0, Errors: 0, Skipped: 0, Time elapsed: 0.185 sec
Running org.apache.mahout.utils.vectors.arff.ARFFTypeTest
Running org.apache.mahout.utils.vectors.lucene.DriverTest
Running org.apache.mahout.utils.SplitInputTest
Tests run: 1, Failures: 0, Errors: 0, Skipped: 0, Time elapsed: 0.022 sec
Running org.apache.mahout.utils.vectors.arff.DriverTest
Running org.apache.mahout.utils.vectors.VectorHelperTest
Tests run: 2, Failures: 0, Errors: 0, Skipped: 0, Time elapsed: 0.216 sec
Tests run: 3, Failures: 0, Errors: 0, Skipped: 0, Time elapsed: 0.026 sec
Running org.apache.mahout.utils.vectors.lucene.CachedTermInfoTest
Running org.apache.mahout.utils.Bump125Test
Tests run: 1, Failures: 0, Errors: 0, Skipped: 0, Time elapsed: 0.014 sec
parallel='classes', perCoreThreadCount=false, threadCount=1, useUnlimitedThreads=false
parallel='classes', perCoreThreadCount=false, threadCount=1, useUnlimitedThreads=false
Tests run: 2, Failures: 0, Errors: 0, Skipped: 0, Time elapsed: 0.567 sec
parallel='classes', perCoreThreadCount=false, threadCount=1, useUnlimitedThreads=false
parallel='classes', perCoreThreadCount=false, threadCount=1, useUnlimitedThreads=false
Running org.apache.mahout.utils.vectors.io.VectorWriterTest
parallel='classes', perCoreThreadCount=false, threadCount=1, useUnlimitedThreads=false
Running org.apache.mahout.utils.vectors.arff.MapBackedARFFModelTest
parallel='classes', perCoreThreadCount=false, threadCount=1, useUnlimitedThreads=false
Tests run: 1, Failures: 0, Errors: 0, Skipped: 0, Time elapsed: 0.017 sec
Running org.apache.mahout.text.LuceneSegmentInputSplitTest
Running org.apache.mahout.utils.nlp.collocations.llr.BloomTokenFilterTest
Running org.apache.mahout.utils.vectors.csv.CSVVectorIteratorTest
Running org.apache.mahout.text.SequenceFilesFromLuceneStorageTest
Tests run: 3, Failures: 0, Errors: 0, Skipped: 0, Time elapsed: 1.344 sec
Tests run: 1, Failures: 0, Errors: 0, Skipped: 0, Time elapsed: 0.964 sec
Tests run: 5, Failures: 0, Errors: 0, Skipped: 0, Time elapsed: 0.142 sec
Tests run: 3, Failures: 0, Errors: 0, Skipped: 0, Time elapsed: 1.521 sec
Tests run: 1, Failures: 0, Errors: 0, Skipped: 0, Time elapsed: 0.32 sec
parallel='classes', perCoreThreadCount=false, threadCount=1, useUnlimitedThreads=false
parallel='classes', perCoreThreadCount=false, threadCount=1, useUnlimitedThreads=false
Running org.apache.mahout.text.LuceneSegmentRecordReaderTest
parallel='classes', perCoreThreadCount=false, threadCount=1, useUnlimitedThreads=false
parallel='classes', perCoreThreadCount=false, threadCount=1, useUnlimitedThreads=false
parallel='classes', perCoreThreadCount=false, threadCount=1, useUnlimitedThreads=false
parallel='classes', perCoreThreadCount=false, threadCount=1, useUnlimitedThreads=false
Running org.apache.mahout.text.MailArchivesClusteringAnalyzerTest
Tests run: 2, Failures: 0, Errors: 0, Skipped: 0, Time elapsed: 1.36 sec
Running org.apache.mahout.text.LuceneStorageConfigurationTest
Running org.apache.mahout.text.LuceneSegmentInputFormatTest
Tests run: 1, Failures: 0, Errors: 0, Skipped: 0, Time elapsed: 0.173 sec
parallel='classes', perCoreThreadCount=false, threadCount=1, useUnlimitedThreads=false
Running org.apache.mahout.text.SequenceFilesFromLuceneStorageMRJobTest
Running org.apache.mahout.text.TestSequenceFilesFromDirectory
Running org.apache.mahout.text.SequenceFilesFromLuceneStorageDriverTest
parallel='classes', perCoreThreadCount=false, threadCount=1, useUnlimitedThreads=false
Running org.apache.mahout.cf.taste.impl.similarity.jdbc.MySQLJDBCInMemoryItemSimilarityTest
parallel='classes', perCoreThreadCount=false, threadCount=1, useUnlimitedThreads=false
Tests run: 1, Failures: 0, Errors: 0, Skipped: 0, Time elapsed: 3.285 sec
Tests run: 1, Failures: 0, Errors: 0, Skipped: 0, Time elapsed: 0.4 sec
Tests run: 2, Failures: 0, Errors: 0, Skipped: 0, Time elapsed: 1.2 sec
Running org.apache.mahout.text.SequenceFilesFromMailArchivesTest
parallel='classes', perCoreThreadCount=false, threadCount=1, useUnlimitedThreads=false
Tests run: 2, Failures: 0, Errors: 0, Skipped: 0, Time elapsed: 3.003 sec
Tests run: 1, Failures: 0, Errors: 0, Skipped: 0, Time elapsed: 1.672 sec
parallel='classes', perCoreThreadCount=false, threadCount=1, useUnlimitedThreads=false
parallel='classes', perCoreThreadCount=false, threadCount=1, useUnlimitedThreads=false
Running org.apache.mahout.clustering.cdbw.TestCDbwEvaluator
Running org.apache.mahout.clustering.dirichlet.TestL1ModelClustering
Tests run: 1, Failures: 0, Errors: 0, Skipped: 0, Time elapsed: 1.207 sec
Running org.apache.mahout.clustering.TestClusterDumper
parallel='classes', perCoreThreadCount=false, threadCount=1, useUnlimitedThreads=false
Tests run: 1, Failures: 0, Errors: 0, Skipped: 0, Time elapsed: 2.712 sec
Running org.apache.mahout.clustering.TestClusterEvaluator
Tests run: 1, Failures: 0, Errors: 0, Skipped: 0, Time elapsed: 3.24 sec
Tests run: 4, Failures: 0, Errors: 0, Skipped: 0, Time elapsed: 2.037 sec
Tests run: 1, Failures: 0, Errors: 0, Skipped: 0, Time elapsed: 6.339 sec
Tests run: 5, Failures: 0, Errors: 1, Skipped: 0, Time elapsed: 6.017 sec <<< FAILURE!
testRun_invalidQuery(org.apache.mahout.text.SequenceFilesFromLuceneStorageDriverTest)  Time elapsed: 0.854 sec  <<< ERROR!
java.lang.RuntimeException: org.xml.sax.SAXParseException: XML document structures must start and end within the same entity.
	at org.apache.xerces.parsers.DOMParser.parse(Unknown Source)
	at org.apache.xerces.jaxp.DocumentBuilderImpl.parse(Unknown Source)
	at javax.xml.parsers.DocumentBuilder.parse(DocumentBuilder.java:124)
	at org.apache.hadoop.conf.Configuration.loadResource(Configuration.java:1161)
	at org.apache.hadoop.conf.Configuration.loadResources(Configuration.java:1109)
	at org.apache.hadoop.conf.Configuration.getProps(Configuration.java:1045)
	at org.apache.hadoop.conf.Configuration.get(Configuration.java:397)
	at org.apache.hadoop.mapred.JobConf.checkAndWarnDeprecation(JobConf.java:1910)
	at org.apache.hadoop.mapred.JobConf.<init>(JobConf.java:378)
	at org.apache.hadoop.mapred.LocalJobRunner$Job.<init>(LocalJobRunner.java:150)
	at org.apache.hadoop.mapred.LocalJobRunner.submitJob(LocalJobRunner.java:437)
	at org.apache.hadoop.mapred.JobClient$2.run(JobClient.java:983)
	at org.apache.hadoop.mapred.JobClient$2.run(JobClient.java:912)
	at java.security.AccessController.doPrivileged(Native Method)
	at javax.security.auth.Subject.doAs(Subject.java:396)
	at org.apache.hadoop.security.UserGroupInformation.doAs(UserGroupInformation.java:1149)
	at org.apache.hadoop.mapred.JobClient.submitJobInternal(JobClient.java:912)
	at org.apache.hadoop.mapreduce.Job.submit(Job.java:500)
	at org.apache.hadoop.mapreduce.Job.waitForCompletion(Job.java:530)
	at org.apache.mahout.text.SequenceFilesFromLuceneStorageMRJob.run(SequenceFilesFromLuceneStorageMRJob.java:62)
	at org.apache.mahout.text.SequenceFilesFromLuceneStorageDriver.run(SequenceFilesFromLuceneStorageDriver.java:121)
	at org.apache.mahout.text.SequenceFilesFromLuceneStorageDriverTest.testRun_invalidQuery(SequenceFilesFromLuceneStorageDriverTest.java:159)

Tests run: 6, Failures: 0, Errors: 0, Skipped: 0, Time elapsed: 7.688 sec
Tests run: 12, Failures: 0, Errors: 0, Skipped: 0, Time elapsed: 8.862 sec
Tests run: 6, Failures: 0, Errors: 0, Skipped: 0, Time elapsed: 7.899 sec
Tests run: 12, Failures: 0, Errors: 0, Skipped: 0, Time elapsed: 8.932 sec
Tests run: 12, Failures: 0, Errors: 0, Skipped: 0, Time elapsed: 17.696 sec

Results :

Tests in error: 
  SequenceFilesFromLuceneStorageDriverTest.testRun_invalidQuery:159 ? Runtime or...

Tests run: 103, Failures: 0, Errors: 1, Skipped: 0

[INFO] ------------------------------------------------------------------------
[INFO] Reactor Summary:
[INFO] 
[INFO] Apache Mahout ..................................... SUCCESS [7.337s]
[INFO] Mahout Build Tools ................................ SUCCESS [1.980s]
[INFO] Mahout Math ....................................... SUCCESS [1:22.432s]
[INFO] Mahout Core ....................................... SUCCESS [5:48.162s]
[INFO] Mahout Integration ................................ FAILURE [29.312s]
[INFO] Mahout Examples ................................... SKIPPED
[INFO] Mahout Release Package ............................ SKIPPED
[INFO] ------------------------------------------------------------------------
[INFO] BUILD FAILURE
[INFO] ------------------------------------------------------------------------
[INFO] Total time: 7:54.552s
[INFO] Finished at: Sun Jun 09 14:10:03 UTC 2013
[INFO] Final Memory: 48M/390M
[INFO] ------------------------------------------------------------------------
[ERROR] Failed to execute goal org.apache.maven.plugins:maven-surefire-plugin:2.14.1:test (default-test) on project mahout-integration: There are test failures.
[ERROR] 
[ERROR] Please refer to /home/hudson/jenkins-slave/workspace/Mahout-Quality/trunk/integration/target/surefire-reports for the individual test results.
[ERROR] -> [Help 1]
[ERROR] 
[ERROR] To see the full stack trace of the errors, re-run Maven with the -e switch.
[ERROR] Re-run Maven using the -X switch to enable full debug logging.
[ERROR] 
[ERROR] For more information about the errors and possible solutions, please read the following articles:
[ERROR] [Help 1] http://cwiki.apache.org/confluence/display/MAVEN/MojoFailureException
[ERROR] 
[ERROR] After correcting the problems, you can resume the build with the command
[ERROR]   mvn <goals> -rf :mahout-integration
Build step 'Invoke top-level Maven targets' marked build as failure
[FINDBUGS] Skipping publisher since build result is FAILURE
[PMD] Skipping publisher since build result is FAILURE
[TASKS] Skipping publisher since build result is FAILURE
Archiving artifacts
Recording test results
Publishing Javadoc
Updating MAHOUT-1211

Jenkins build is back to normal : Mahout-Quality #2065

Posted by Apache Jenkins Server <je...@builds.apache.org>.
See <https://builds.apache.org/job/Mahout-Quality/2065/changes>