You are viewing a plain text version of this content. The canonical link for it is here.
Posted to builds@cassandra.apache.org by Apache Jenkins Server <je...@builds.apache.org> on 2022/10/28 18:04:31 UTC
Build complete: Cassandra-3.11 #398 [UNSTABLE] deede44af5b0d8d6ec19ecf1e613544262d85144
-------------------------------------------------------------------------------
Build Cassandra-3.11 #398 Still Unstable
URL: https://ci-cassandra.apache.org/job/Cassandra-3.11/398/
-------------------------------------------------------------------------------
Changes:
[a.penya.garcia] CircleCI: Fix generate.sh without options modifying config
-------------------------------------------------------------------------------
Failed Tests:
15 tests failed.
FAILED: dtest-upgrade.upgrade_tests.upgrade_through_versions_test.TestUpgrade_current_2_1_x_To_indev_3_11_x.test_bootstrap
FAILED: dtest-upgrade.upgrade_tests.upgrade_through_versions_test.TestProtoV3Upgrade_AllVersions_RandomPartitioner_EndsAt_3_11_X_HEAD.test_parallel_upgrade_with_internode_ssl
FAILED: org.apache.cassandra.distributed.upgrade.DropCompactStorageWithDeletesAndWritesTest.testDropCompactWithClusteringAndValueColumnWithDeletesAndWrites
FAILED: org.apache.cassandra.db.compaction.LongLeveledCompactionStrategyCQLTest.stressTestCompactionStrategyManager
FAILED: org.apache.cassandra.locator.DynamicEndpointSnitchLongTest.testConcurrency
FAILED: org.apache.cassandra.cql3.validation.operations.TTLTest.testCapNoWarnExpirationOverflowPolicy-compression
FAILED: org.apache.cassandra.cql3.ViewComplexTest.testPartialDeleteSelectedColumnWithoutFlush
FAILED: org.apache.cassandra.cql3.ViewFilteringTest.testPartitionKeyAndClusteringKeyFilteringRestrictions
FAILED: dtest-novnode.repair_tests.repair_test.TestRepair.test_dead_sync_initiator
FAILED: dtest-novnode.repair_tests.repair_test.TestRepair.test_failure_during_validation
FAILED: dtest-offheap.repair_tests.repair_test.TestRepair.test_dead_sync_initiator
FAILED: dtest-offheap.repair_tests.repair_test.TestRepair.test_failure_during_validation
FAILED: dtest.repair_tests.repair_test.TestRepair.test_dead_sync_initiator
FAILED: dtest.repair_tests.repair_test.TestRepair.test_failure_during_validation
FAILED: dtest-upgrade.upgrade_internal_auth_test.TestAuthUpgrade.test_upgrade_legacy_table
-------------------------------------------------------------------------------
For complete test report and logs see https://nightlies.apache.org/cassandra/Cassandra-3.11/398/