You are viewing a plain text version of this content. The canonical link for it is here.
Posted to builds@cassandra.apache.org by Apache Jenkins Server <je...@builds.apache.org> on 2024/12/14 12:02:02 UTC
Build complete: Cassandra-trunk #1961 [ABORTED] 54e46880690bd5effb31116986292c1bdc9e891e
-------------------------------------------------------------------------------
Build Cassandra-trunk #1961 Aborted
URL: https://ci-cassandra.apache.org/job/Cassandra-trunk/1961/
-------------------------------------------------------------------------------
Changes:
[Caleb Rackliffe] Restore optimization in MultiCBuilder around building one clustering
[Marcus Eriksson] Avoid prepared statement invalidation race when committing schema changes
[Marcus Eriksson] Don't skip paxos repair on topology change
[Marcus Eriksson] Add flag to avoid invalidating key cache on sstable deletions
[branimir.lambov] Parallelized UCS compactions
-------------------------------------------------------------------------------
Failed Tests:
26 tests failed.
FAILED: dtest-latest.disk_balance_test.TestDiskBalance.Tests / dtest-latest jdk11 42/64 / test_disk_balance_after_joining_ring_stcs
FAILED: dtest-latest.disk_balance_test.TestDiskBalance.Tests / dtest-latest jdk11 42/64 / test_disk_balance_after_joining_ring_stcs
FAILED: dtest-latest.sslnodetonode_test.TestNodeToNodeSSLEncryption.Tests / dtest-latest jdk11 30/64 / test_ssl_client_auth_required_fail
FAILED: dtest-novnode.compaction_test.TestCompaction.Tests / dtest-novnode jdk11 62/64 / test_compaction_throughput
FAILED: dtest-novnode.compaction_test.TestCompaction.Tests / dtest-novnode jdk17 62/64 / test_compaction_throughput
FAILED: dtest-novnode.cqlsh_tests.test_cqlsh.TestCqlshSmoke.Tests / dtest-novnode jdk17 25/64 / test_colons_in_string_literals
FAILED: dtest-novnode.cqlsh_tests.test_cqlsh.TestCqlshSmoke.Tests / dtest-novnode jdk17 25/64 / test_colons_in_string_literals
FAILED: dtest-novnode.cqlsh_tests.test_cqlsh_copy.TestCqlshCopy.Tests / dtest-novnode jdk17 25/64 / test_all_datatypes_read
FAILED: dtest-novnode.repair_tests.preview_repair_test.TestPreviewRepair.Tests / dtest-novnode jdk17 25/64 / test_parent_repair_session_cleanup
FAILED: dtest-novnode.replace_address_test.TestReplaceAddress.Tests / dtest-novnode jdk17 25/64 / test_insert_data_during_replace_same_address
FAILED: dtest-novnode.transient_replication_test.TestTransientReplication.Tests / dtest-novnode jdk17 25/64 / test_transient_noop_write
FAILED: dtest-novnode.user_types_test.TestUserTypes.Tests / dtest-novnode jdk17 25/64 / test_type_secondary_indexing
FAILED: dtest.commitlog_test.TestCommitLog.Tests / dtest jdk17 36/64 / test_commitlog_replay_on_startup
FAILED: dtest.compaction_test.TestCompaction.Tests / dtest jdk11 58/64 / test_compaction_throughput
FAILED: dtest.compaction_test.TestCompaction.Tests / dtest jdk17 58/64 / test_compaction_throughput
FAILED: dtest.disk_balance_test.TestDiskBalance.Tests / dtest jdk17 40/64 / test_disk_balance_after_boundary_change_stcs
FAILED: org.apache.cassandra.db.compaction.CorruptedSSTablesCompactionsTest.Tests / test-compression jdk11 3/8 / testCorruptedSSTablesWithUnifiedCompactionStrategyParallelized-compression_jdk11_x86_64
FAILED: org.apache.cassandra.db.compaction.CorruptedSSTablesCompactionsTest.Tests / test-compression jdk17 3/8 / testCorruptedSSTablesWithUnifiedCompactionStrategyParallelized-compression_jdk17_x86_64
FAILED: dtest-latest.configuration_test.TestConfiguration.Tests / dtest-latest jdk11 31/64 / test_change_durable_writes
FAILED: org.apache.cassandra.index.CustomIndexTest.Tests / test-latest jdk17 7/8 / testFailing2iFlush-cassandra.testtag_IS_UNDEFINED
FAILED: org.apache.cassandra.db.compaction.CorruptedSSTablesCompactionsTest.Tests / test-compression jdk11 3/8 / testCorruptedSSTablesWithLeveledCompactionStrategy-compression_jdk11_x86_64
FAILED: org.apache.cassandra.db.compaction.CorruptedSSTablesCompactionsTest.Tests / test-compression jdk17 3/8 / testCorruptedSSTablesWithLeveledCompactionStrategy-compression_jdk17_x86_64
FAILED: org.apache.cassandra.db.compaction.CorruptedSSTablesCompactionsTest.Tests / test-compression jdk11 3/8 / testCorruptedSSTablesWithSizeTieredCompactionStrategy-compression_jdk11_x86_64
FAILED: org.apache.cassandra.db.compaction.CorruptedSSTablesCompactionsTest.Tests / test-compression jdk17 3/8 / testCorruptedSSTablesWithSizeTieredCompactionStrategy-compression_jdk17_x86_64
FAILED: org.apache.cassandra.db.compaction.CorruptedSSTablesCompactionsTest.Tests / test-compression jdk11 3/8 / testCorruptedSSTablesWithUnifiedCompactionStrategy-compression_jdk11_x86_64
FAILED: org.apache.cassandra.db.compaction.CorruptedSSTablesCompactionsTest.Tests / test-compression jdk17 3/8 / testCorruptedSSTablesWithUnifiedCompactionStrategy-compression_jdk17_x86_64
-------------------------------------------------------------------------------
For complete test report and logs see https://nightlies.apache.org/cassandra/Cassandra-trunk/1961/