You are viewing a plain text version of this content. The canonical link for it is here.
Posted to commits@phoenix.apache.org by Apache Jenkins Server <je...@builds.apache.org> on 2019/11/16 09:55:30 UTC
Build failed in Jenkins: Phoenix-4.x-HBase-1.3 #600
See <https://builds.apache.org/job/Phoenix-4.x-HBase-1.3/600/display/redirect?page=changes>
Changes:
[kadir] PHOENIX-5564 Restructure read repair to improve readability and
------------------------------------------
[...truncated 104.88 KB...]
[INFO]
[INFO] Results:
[INFO]
[WARNING] Tests run: 3700, Failures: 0, Errors: 0, Skipped: 2
[INFO]
[INFO]
[INFO] --- maven-failsafe-plugin:2.22.2:integration-test (HBaseManagedTimeTests) @ phoenix-core ---
[INFO]
[INFO] -------------------------------------------------------
[INFO] T E S T S
[INFO] -------------------------------------------------------
[INFO]
[INFO] Results:
[INFO]
[INFO] Tests run: 0, Failures: 0, Errors: 0, Skipped: 0
[INFO]
[INFO]
[INFO] --- maven-failsafe-plugin:2.22.2:integration-test (NeedTheirOwnClusterTests) @ phoenix-core ---
[INFO]
[INFO] -------------------------------------------------------
[INFO] T E S T S
[INFO] -------------------------------------------------------
[INFO] Running org.apache.hadoop.hbase.regionserver.wal.WALReplayWithIndexWritesAndCompressedWALIT
[WARNING] Tests run: 1, Failures: 0, Errors: 0, Skipped: 1, Time elapsed: 0.002 s - in org.apache.hadoop.hbase.regionserver.wal.WALReplayWithIndexWritesAndCompressedWALIT
[INFO] Running org.apache.phoenix.end2end.ConnectionUtilIT
[INFO] Running org.apache.hadoop.hbase.regionserver.wal.WALRecoveryRegionPostOpenIT
[INFO] Tests run: 1, Failures: 0, Errors: 0, Skipped: 0, Time elapsed: 11.031 s - in org.apache.hadoop.hbase.regionserver.wal.WALRecoveryRegionPostOpenIT
[INFO] Running org.apache.phoenix.end2end.ColumnEncodedMutableTxStatsCollectorIT
[INFO] Running org.apache.phoenix.end2end.ConcurrentMutationsExtendedIT
[INFO] Running org.apache.phoenix.end2end.ColumnEncodedImmutableTxStatsCollectorIT
[INFO] Running org.apache.phoenix.end2end.ColumnEncodedImmutableNonTxStatsCollectorIT
[INFO] Running org.apache.phoenix.end2end.ColumnEncodedMutableNonTxStatsCollectorIT
[INFO] Tests run: 1, Failures: 0, Errors: 0, Skipped: 0, Time elapsed: 54.224 s - in org.apache.phoenix.end2end.ConnectionUtilIT
[INFO] Running org.apache.phoenix.end2end.ContextClassloaderIT
[INFO] Tests run: 3, Failures: 0, Errors: 0, Skipped: 0, Time elapsed: 4.581 s - in org.apache.phoenix.end2end.ContextClassloaderIT
[INFO] Running org.apache.phoenix.end2end.CostBasedDecisionIT
[INFO] Running org.apache.phoenix.end2end.CountDistinctCompressionIT
[INFO] Tests run: 1, Failures: 0, Errors: 0, Skipped: 0, Time elapsed: 5.136 s - in org.apache.phoenix.end2end.CountDistinctCompressionIT
[WARNING] Tests run: 28, Failures: 0, Errors: 0, Skipped: 4, Time elapsed: 180.726 s - in org.apache.phoenix.end2end.ColumnEncodedImmutableNonTxStatsCollectorIT
[WARNING] Tests run: 28, Failures: 0, Errors: 0, Skipped: 4, Time elapsed: 181.225 s - in org.apache.phoenix.end2end.ColumnEncodedMutableNonTxStatsCollectorIT
[WARNING] Tests run: 28, Failures: 0, Errors: 0, Skipped: 4, Time elapsed: 186.913 s - in org.apache.phoenix.end2end.ColumnEncodedMutableTxStatsCollectorIT
[WARNING] Tests run: 28, Failures: 0, Errors: 0, Skipped: 4, Time elapsed: 184.378 s - in org.apache.phoenix.end2end.ColumnEncodedImmutableTxStatsCollectorIT
[INFO] Running org.apache.phoenix.end2end.CsvBulkLoadToolIT
[INFO] Running org.apache.phoenix.end2end.DropSchemaIT
[INFO] Running org.apache.phoenix.end2end.FlappingLocalIndexIT
[INFO] Running org.apache.phoenix.end2end.IndexExtendedIT
[INFO] Running org.apache.phoenix.end2end.IndexBuildTimestampIT
[INFO] Tests run: 10, Failures: 0, Errors: 0, Skipped: 0, Time elapsed: 277.154 s - in org.apache.phoenix.end2end.ConcurrentMutationsExtendedIT
[INFO] Tests run: 2, Failures: 0, Errors: 0, Skipped: 0, Time elapsed: 34.381 s - in org.apache.phoenix.end2end.DropSchemaIT
[INFO] Running org.apache.phoenix.end2end.IndexRebuildTaskIT
[INFO] Tests run: 16, Failures: 0, Errors: 0, Skipped: 0, Time elapsed: 141.813 s - in org.apache.phoenix.end2end.CsvBulkLoadToolIT
[INFO] Tests run: 1, Failures: 0, Errors: 0, Skipped: 0, Time elapsed: 18.134 s - in org.apache.phoenix.end2end.IndexRebuildTaskIT
[INFO] Tests run: 20, Failures: 0, Errors: 0, Skipped: 0, Time elapsed: 95.411 s - in org.apache.phoenix.end2end.IndexExtendedIT
[INFO] Running org.apache.phoenix.end2end.IndexScrutinyToolForTenantIT
[INFO] Running org.apache.phoenix.end2end.IndexScrutinyToolIT
[INFO] Running org.apache.phoenix.end2end.IndexToolForPartialBuildIT
[INFO] Running org.apache.phoenix.end2end.IndexToolForPartialBuildWithNamespaceEnabledIT
[INFO] Tests run: 1, Failures: 0, Errors: 0, Skipped: 0, Time elapsed: 21.196 s - in org.apache.phoenix.end2end.IndexToolForPartialBuildIT
[INFO] Tests run: 16, Failures: 0, Errors: 0, Skipped: 0, Time elapsed: 181.944 s - in org.apache.phoenix.end2end.IndexBuildTimestampIT
[INFO] Tests run: 12, Failures: 0, Errors: 0, Skipped: 0, Time elapsed: 189.09 s - in org.apache.phoenix.end2end.FlappingLocalIndexIT
[INFO] Tests run: 6, Failures: 0, Errors: 0, Skipped: 0, Time elapsed: 90.757 s - in org.apache.phoenix.end2end.IndexScrutinyToolForTenantIT
[INFO] Running org.apache.phoenix.end2end.MigrateSystemTablesToSystemNamespaceIT
[INFO] Tests run: 2, Failures: 0, Errors: 0, Skipped: 0, Time elapsed: 39.083 s - in org.apache.phoenix.end2end.IndexToolForPartialBuildWithNamespaceEnabledIT
[INFO] Running org.apache.phoenix.end2end.IndexToolIT
[INFO] Running org.apache.phoenix.end2end.LocalIndexSplitMergeIT
[INFO] Running org.apache.phoenix.end2end.NonColumnEncodedImmutableNonTxStatsCollectorIT
[INFO] Running org.apache.phoenix.end2end.NonColumnEncodedImmutableTxStatsCollectorIT
[INFO] Tests run: 20, Failures: 0, Errors: 0, Skipped: 0, Time elapsed: 617.601 s - in org.apache.phoenix.end2end.CostBasedDecisionIT
[INFO] Tests run: 3, Failures: 0, Errors: 0, Skipped: 0, Time elapsed: 191.979 s - in org.apache.phoenix.end2end.LocalIndexSplitMergeIT
[WARNING] Tests run: 28, Failures: 0, Errors: 0, Skipped: 4, Time elapsed: 180.071 s - in org.apache.phoenix.end2end.NonColumnEncodedImmutableNonTxStatsCollectorIT
[INFO] Running org.apache.phoenix.end2end.OrderByWithServerClientSpoolingDisabledIT
[INFO] Running org.apache.phoenix.end2end.OrderByWithServerMemoryLimitIT
[INFO] Running org.apache.phoenix.end2end.OrderByWithSpillingIT
[INFO] Tests run: 1, Failures: 0, Errors: 0, Skipped: 0, Time elapsed: 2.509 s - in org.apache.phoenix.end2end.OrderByWithServerMemoryLimitIT
[INFO] Running org.apache.phoenix.end2end.ParameterizedIndexUpgradeToolIT
[WARNING] Tests run: 33, Failures: 0, Errors: 0, Skipped: 3, Time elapsed: 404.133 s - in org.apache.phoenix.end2end.IndexScrutinyToolIT
[INFO] Running org.apache.phoenix.end2end.PartialResultServerConfigurationIT
[WARNING] Tests run: 56, Failures: 0, Errors: 0, Skipped: 8, Time elapsed: 338.559 s - in org.apache.phoenix.end2end.NonColumnEncodedImmutableTxStatsCollectorIT
[INFO] Running org.apache.phoenix.end2end.PermissionNSDisabledIT
[INFO] Tests run: 4, Failures: 0, Errors: 0, Skipped: 0, Time elapsed: 456.747 s - in org.apache.phoenix.end2end.MigrateSystemTablesToSystemNamespaceIT
[INFO] Tests run: 1, Failures: 0, Errors: 0, Skipped: 0, Time elapsed: 63.814 s - in org.apache.phoenix.end2end.PartialResultServerConfigurationIT
[INFO] Running org.apache.phoenix.end2end.PermissionNSEnabledIT
[INFO] Running org.apache.phoenix.end2end.PermissionsCacheIT
[INFO] Tests run: 16, Failures: 0, Errors: 0, Skipped: 0, Time elapsed: 229.999 s - in org.apache.phoenix.end2end.OrderByWithServerClientSpoolingDisabledIT
[INFO] Tests run: 16, Failures: 0, Errors: 0, Skipped: 0, Time elapsed: 260.265 s - in org.apache.phoenix.end2end.OrderByWithSpillingIT
[INFO] Running org.apache.phoenix.end2end.PhoenixDriverIT
[INFO] Running org.apache.phoenix.end2end.QueryLoggerIT
[INFO] Tests run: 4, Failures: 0, Errors: 0, Skipped: 0, Time elapsed: 95.302 s - in org.apache.phoenix.end2end.PhoenixDriverIT
[INFO] Tests run: 7, Failures: 0, Errors: 0, Skipped: 0, Time elapsed: 60.64 s - in org.apache.phoenix.end2end.QueryLoggerIT
[INFO] Tests run: 8, Failures: 0, Errors: 0, Skipped: 0, Time elapsed: 298.232 s - in org.apache.phoenix.end2end.PermissionNSDisabledIT
[INFO] Running org.apache.phoenix.end2end.QueryTimeoutIT
[INFO] Tests run: 2, Failures: 0, Errors: 0, Skipped: 0, Time elapsed: 9.221 s - in org.apache.phoenix.end2end.QueryTimeoutIT
[INFO] Tests run: 9, Failures: 0, Errors: 0, Skipped: 0, Time elapsed: 300.005 s - in org.apache.phoenix.end2end.PermissionsCacheIT
[INFO] Tests run: 11, Failures: 0, Errors: 0, Skipped: 0, Time elapsed: 315.561 s - in org.apache.phoenix.end2end.PermissionNSEnabledIT
[INFO] Tests run: 105, Failures: 0, Errors: 0, Skipped: 0, Time elapsed: 764.299 s - in org.apache.phoenix.end2end.IndexToolIT
[INFO] Running org.apache.phoenix.end2end.QueryWithLimitIT
[INFO] Tests run: 2, Failures: 0, Errors: 0, Skipped: 0, Time elapsed: 9.214 s - in org.apache.phoenix.end2end.QueryWithLimitIT
[INFO] Running org.apache.phoenix.end2end.RebuildIndexConnectionPropsIT
[INFO] Tests run: 1, Failures: 0, Errors: 0, Skipped: 0, Time elapsed: 0.31 s - in org.apache.phoenix.end2end.RebuildIndexConnectionPropsIT
[INFO] Running org.apache.phoenix.end2end.RegexBulkLoadToolIT
[INFO] Running org.apache.phoenix.end2end.RenewLeaseIT
[INFO] Running org.apache.phoenix.end2end.SequencePointInTimeIT
[INFO] Tests run: 1, Failures: 0, Errors: 0, Skipped: 0, Time elapsed: 0.106 s - in org.apache.phoenix.end2end.SequencePointInTimeIT
[INFO] Tests run: 1, Failures: 0, Errors: 0, Skipped: 0, Time elapsed: 28.527 s - in org.apache.phoenix.end2end.RenewLeaseIT
[INFO] Running org.apache.phoenix.end2end.SystemCatalogCreationOnConnectionIT
[INFO] Running org.apache.phoenix.end2end.SpillableGroupByIT
[INFO] Running org.apache.phoenix.end2end.StatsEnabledSplitSystemCatalogIT
[INFO] Running org.apache.phoenix.end2end.SplitIT
[WARNING] Tests run: 10, Failures: 0, Errors: 0, Skipped: 2, Time elapsed: 70.734 s - in org.apache.phoenix.end2end.RegexBulkLoadToolIT
[INFO] Tests run: 3, Failures: 0, Errors: 0, Skipped: 0, Time elapsed: 16.77 s - in org.apache.phoenix.end2end.SpillableGroupByIT
[INFO] Running org.apache.phoenix.end2end.SysTableNamespaceMappedStatsCollectorIT
[INFO] Running org.apache.phoenix.end2end.SystemCatalogIT
[INFO] Running org.apache.phoenix.end2end.TableSnapshotReadsMapReduceIT
[INFO] Tests run: 4, Failures: 0, Errors: 0, Skipped: 0, Time elapsed: 37.188 s - in org.apache.phoenix.end2end.TableSnapshotReadsMapReduceIT
[INFO] Tests run: 18, Failures: 0, Errors: 0, Skipped: 0, Time elapsed: 129.052 s - in org.apache.phoenix.end2end.StatsEnabledSplitSystemCatalogIT
[INFO] Running org.apache.phoenix.end2end.UpdateCacheAcrossDifferentClientsIT
[INFO] Tests run: 2, Failures: 0, Errors: 0, Skipped: 0, Time elapsed: 102.019 s - in org.apache.phoenix.end2end.SystemCatalogIT
[INFO] Running org.apache.phoenix.end2end.UpgradeIT
[INFO] Running org.apache.phoenix.end2end.UserDefinedFunctionsIT
[INFO] Tests run: 6, Failures: 0, Errors: 0, Skipped: 0, Time elapsed: 110.144 s - in org.apache.phoenix.end2end.UpdateCacheAcrossDifferentClientsIT
[WARNING] Tests run: 42, Failures: 0, Errors: 0, Skipped: 6, Time elapsed: 247.459 s - in org.apache.phoenix.end2end.SysTableNamespaceMappedStatsCollectorIT
[INFO] Running org.apache.phoenix.end2end.index.GlobalIndexCheckerIT
[INFO] Tests run: 9, Failures: 0, Errors: 0, Skipped: 0, Time elapsed: 153.591 s - in org.apache.phoenix.end2end.UpgradeIT
[INFO] Running org.apache.phoenix.end2end.index.ImmutableIndexIT
[INFO] Tests run: 12, Failures: 0, Errors: 0, Skipped: 0, Time elapsed: 377.257 s - in org.apache.phoenix.end2end.SplitIT
[INFO] Tests run: 16, Failures: 0, Errors: 0, Skipped: 0, Time elapsed: 173.493 s - in org.apache.phoenix.end2end.UserDefinedFunctionsIT
[INFO] Running org.apache.phoenix.end2end.index.LocalIndexIT
[INFO] Running org.apache.phoenix.end2end.index.IndexRebuildIncrementDisableCountIT
[INFO] Tests run: 2, Failures: 0, Errors: 0, Skipped: 0, Time elapsed: 15.36 s - in org.apache.phoenix.end2end.index.IndexRebuildIncrementDisableCountIT
[INFO] Running org.apache.phoenix.end2end.index.MutableIndexExtendedIT
[INFO] Running org.apache.phoenix.end2end.index.MutableIndexFailureIT
[INFO] Tests run: 9, Failures: 0, Errors: 0, Skipped: 0, Time elapsed: 99.451 s - in org.apache.phoenix.end2end.index.MutableIndexExtendedIT
[INFO] Running org.apache.phoenix.end2end.index.MutableIndexFailureWithNamespaceIT
[INFO] Tests run: 32, Failures: 0, Errors: 0, Skipped: 0, Time elapsed: 378.934 s - in org.apache.phoenix.end2end.index.GlobalIndexCheckerIT
[INFO] Running org.apache.phoenix.end2end.index.MutableIndexRebuilderIT
[INFO] Tests run: 14, Failures: 0, Errors: 0, Skipped: 0, Time elapsed: 269.059 s - in org.apache.phoenix.end2end.index.MutableIndexFailureIT
[INFO] Tests run: 1, Failures: 0, Errors: 0, Skipped: 0, Time elapsed: 79.766 s - in org.apache.phoenix.end2end.index.MutableIndexRebuilderIT
[INFO] Tests run: 8, Failures: 0, Errors: 0, Skipped: 0, Time elapsed: 167.188 s - in org.apache.phoenix.end2end.index.MutableIndexFailureWithNamespaceIT
[INFO] Tests run: 11, Failures: 0, Errors: 0, Skipped: 0, Time elapsed: 867.155 s - in org.apache.phoenix.end2end.SystemCatalogCreationOnConnectionIT
[INFO] Tests run: 16, Failures: 0, Errors: 0, Skipped: 0, Time elapsed: 1,430.592 s - in org.apache.phoenix.end2end.ParameterizedIndexUpgradeToolIT
[INFO] Running org.apache.phoenix.end2end.index.MutableIndexReplicationIT
[INFO] Running org.apache.phoenix.end2end.index.PartialIndexRebuilderIT
[INFO] Running org.apache.phoenix.end2end.index.PhoenixMRJobSubmitterIT
[INFO] Tests run: 1, Failures: 0, Errors: 0, Skipped: 0, Time elapsed: 38.098 s - in org.apache.phoenix.end2end.index.MutableIndexReplicationIT
[INFO] Tests run: 1, Failures: 0, Errors: 0, Skipped: 0, Time elapsed: 11.601 s - in org.apache.phoenix.end2end.index.PhoenixMRJobSubmitterIT
[INFO] Running org.apache.phoenix.end2end.index.ShortViewIndexIdIT
[INFO] Running org.apache.phoenix.end2end.index.txn.TxWriteFailureIT
[INFO] Tests run: 2, Failures: 0, Errors: 0, Skipped: 0, Time elapsed: 24.291 s - in org.apache.phoenix.end2end.index.ShortViewIndexIdIT
[WARNING] Tests run: 72, Failures: 0, Errors: 0, Skipped: 18, Time elapsed: 602.841 s - in org.apache.phoenix.end2end.index.ImmutableIndexIT
[INFO] Running org.apache.phoenix.end2end.join.HashJoinCacheIT
[INFO] Tests run: 1, Failures: 0, Errors: 0, Skipped: 0, Time elapsed: 13.169 s - in org.apache.phoenix.end2end.join.HashJoinCacheIT
[INFO] Running org.apache.phoenix.hbase.index.FailForUnsupportedHBaseVersionsIT
[INFO] Running org.apache.phoenix.end2end.join.SortMergeJoinNoSpoolingIT
[INFO] Running org.apache.phoenix.execute.PartialCommitIT
[INFO] Tests run: 12, Failures: 0, Errors: 0, Skipped: 0, Time elapsed: 97.529 s - in org.apache.phoenix.end2end.index.txn.TxWriteFailureIT
[INFO] Tests run: 2, Failures: 0, Errors: 0, Skipped: 0, Time elapsed: 38.449 s - in org.apache.phoenix.hbase.index.FailForUnsupportedHBaseVersionsIT
[INFO] Tests run: 35, Failures: 0, Errors: 0, Skipped: 0, Time elapsed: 31.088 s - in org.apache.phoenix.end2end.join.SortMergeJoinNoSpoolingIT
[INFO] Running org.apache.phoenix.execute.UpsertSelectOverlappingBatchesIT
[INFO] Running org.apache.phoenix.jdbc.SecureUserConnectionsIT
[INFO] Tests run: 8, Failures: 0, Errors: 0, Skipped: 0, Time elapsed: 9.395 s - in org.apache.phoenix.jdbc.SecureUserConnectionsIT
[INFO] Running org.apache.phoenix.iterate.ScannerLeaseRenewalIT
[INFO] Running org.apache.phoenix.iterate.RoundRobinResultIteratorWithStatsIT
[INFO] Tests run: 1, Failures: 0, Errors: 0, Skipped: 0, Time elapsed: 6.975 s - in org.apache.phoenix.iterate.RoundRobinResultIteratorWithStatsIT
[INFO] Tests run: 50, Failures: 0, Errors: 0, Skipped: 0, Time elapsed: 680.513 s - in org.apache.phoenix.end2end.index.LocalIndexIT
[INFO] Tests run: 3, Failures: 0, Errors: 0, Skipped: 0, Time elapsed: 79.112 s - in org.apache.phoenix.execute.UpsertSelectOverlappingBatchesIT
[INFO] Running org.apache.phoenix.monitoring.PhoenixLoggingMetricsIT
[INFO] Running org.apache.phoenix.rpc.PhoenixClientRpcIT
[INFO] Running org.apache.phoenix.monitoring.PhoenixMetricsIT
[INFO] Running org.apache.phoenix.rpc.PhoenixServerRpcIT
[INFO] Tests run: 2, Failures: 0, Errors: 0, Skipped: 0, Time elapsed: 7.954 s - in org.apache.phoenix.rpc.PhoenixClientRpcIT
[INFO] Tests run: 12, Failures: 0, Errors: 0, Skipped: 0, Time elapsed: 159.361 s - in org.apache.phoenix.execute.PartialCommitIT
[INFO] Tests run: 4, Failures: 0, Errors: 0, Skipped: 0, Time elapsed: 44.824 s - in org.apache.phoenix.monitoring.PhoenixLoggingMetricsIT
[INFO] Running org.apache.phoenix.tool.ParameterizedPhoenixCanaryToolIT
[INFO] Tests run: 2, Failures: 0, Errors: 0, Skipped: 0, Time elapsed: 19.947 s - in org.apache.phoenix.rpc.PhoenixServerRpcIT
[INFO] Running org.apache.phoenix.util.CoprocessorHConnectionTableFactoryIT
[INFO] Tests run: 2, Failures: 0, Errors: 0, Skipped: 0, Time elapsed: 169.797 s - in org.apache.phoenix.iterate.ScannerLeaseRenewalIT
[INFO] Tests run: 1, Failures: 0, Errors: 0, Skipped: 0, Time elapsed: 10.856 s - in org.apache.phoenix.util.CoprocessorHConnectionTableFactoryIT
[INFO] Tests run: 22, Failures: 0, Errors: 0, Skipped: 0, Time elapsed: 112.598 s - in org.apache.phoenix.monitoring.PhoenixMetricsIT
[INFO] Tests run: 8, Failures: 0, Errors: 0, Skipped: 0, Time elapsed: 120.932 s - in org.apache.phoenix.tool.ParameterizedPhoenixCanaryToolIT
[INFO] Tests run: 31, Failures: 0, Errors: 0, Skipped: 0, Time elapsed: 467.986 s - in org.apache.phoenix.end2end.index.PartialIndexRebuilderIT
[INFO]
[INFO] Results:
[INFO]
[WARNING] Tests run: 1021, Failures: 0, Errors: 0, Skipped: 58
[INFO]
[INFO]
[INFO] --- maven-failsafe-plugin:2.22.2:integration-test (SplitSystemCatalogTests) @ phoenix-core ---
[INFO]
[INFO] -------------------------------------------------------
[INFO] T E S T S
[INFO] -------------------------------------------------------
[INFO] Running org.apache.phoenix.end2end.AlterMultiTenantTableWithViewsIT
[INFO] Running org.apache.phoenix.end2end.AlterTableWithViewsIT
[INFO] Running org.apache.phoenix.end2end.DropTableWithViewsIT
[INFO] Running org.apache.phoenix.end2end.DropIndexedColsIT
[INFO] Running org.apache.phoenix.end2end.TenantSpecificViewIndexIT
[INFO] Running org.apache.phoenix.end2end.TenantSpecificViewIndexSaltedIT
[INFO] Tests run: 4, Failures: 0, Errors: 0, Skipped: 0, Time elapsed: 43.857 s - in org.apache.phoenix.end2end.DropTableWithViewsIT
[INFO] Running org.apache.phoenix.end2end.ViewIT
[INFO] Tests run: 4, Failures: 0, Errors: 0, Skipped: 0, Time elapsed: 51.951 s - in org.apache.phoenix.end2end.DropIndexedColsIT
[INFO] Tests run: 4, Failures: 0, Errors: 0, Skipped: 0, Time elapsed: 59.955 s - in org.apache.phoenix.end2end.TenantSpecificViewIndexSaltedIT
[INFO] Tests run: 9, Failures: 0, Errors: 0, Skipped: 0, Time elapsed: 125.272 s - in org.apache.phoenix.end2end.AlterMultiTenantTableWithViewsIT
[INFO] Tests run: 10, Failures: 0, Errors: 0, Skipped: 0, Time elapsed: 134.426 s - in org.apache.phoenix.end2end.TenantSpecificViewIndexIT
[INFO] Running org.apache.phoenix.end2end.ViewMetadataIT
[INFO] Running org.apache.phoenix.end2end.index.ViewIndexIT
[INFO] Tests run: 75, Failures: 0, Errors: 0, Skipped: 0, Time elapsed: 375.459 s - in org.apache.phoenix.end2end.ViewIT
[INFO] Tests run: 56, Failures: 0, Errors: 0, Skipped: 0, Time elapsed: 436.222 s - in org.apache.phoenix.end2end.AlterTableWithViewsIT
[WARNING] Tests run: 24, Failures: 0, Errors: 0, Skipped: 2, Time elapsed: 202.015 s - in org.apache.phoenix.end2end.index.ViewIndexIT
[INFO] Tests run: 22, Failures: 0, Errors: 0, Skipped: 0, Time elapsed: 295.074 s - in org.apache.phoenix.end2end.ViewMetadataIT
[INFO]
[INFO] Results:
[INFO]
[WARNING] Tests run: 208, Failures: 0, Errors: 0, Skipped: 2
[INFO]
[INFO]
[INFO] --- maven-failsafe-plugin:2.22.2:verify (ParallelStatsEnabledTest) @ phoenix-core ---
[INFO] ------------------------------------------------------------------------
[INFO] Reactor Summary for Apache Phoenix 4.15.0-HBase-1.3:
[INFO]
[INFO] Apache Phoenix ..................................... SUCCESS [ 1.971 s]
[INFO] Phoenix Core ....................................... FAILURE [ 02:40 h]
[INFO] Phoenix - Pherf .................................... SKIPPED
[INFO] Phoenix Client ..................................... SKIPPED
[INFO] Phoenix Server ..................................... SKIPPED
[INFO] Phoenix Assembly ................................... SKIPPED
[INFO] Phoenix - Tracing Web Application .................. SKIPPED
[INFO] ------------------------------------------------------------------------
[INFO] BUILD FAILURE
[INFO] ------------------------------------------------------------------------
[INFO] Total time: 02:40 h
[INFO] Finished at: 2019-11-16T09:55:22Z
[INFO] ------------------------------------------------------------------------
[ERROR] Failed to execute goal org.apache.maven.plugins:maven-failsafe-plugin:2.22.2:verify (ParallelStatsEnabledTest) on project phoenix-core: There are test failures.
[ERROR]
[ERROR] Please refer to <https://builds.apache.org/job/Phoenix-4.x-HBase-1.3/ws/phoenix-core/target/failsafe-reports> for the individual test results.
[ERROR] Please refer to dump files (if any exist) [date].dump, [date]-jvmRun[N].dump and [date].dumpstream.
[ERROR] -> [Help 1]
[ERROR]
[ERROR] To see the full stack trace of the errors, re-run Maven with the -e switch.
[ERROR] Re-run Maven using the -X switch to enable full debug logging.
[ERROR]
[ERROR] For more information about the errors and possible solutions, please read the following articles:
[ERROR] [Help 1] http://cwiki.apache.org/confluence/display/MAVEN/MojoFailureException
[ERROR]
[ERROR] After correcting the problems, you can resume the build with the command
[ERROR] mvn <args> -rf :phoenix-core
Build step 'Invoke top-level Maven targets' marked build as failure
[JIRA] Updating issue PHOENIX-5564
Recording test results
Jenkins build is back to normal : Phoenix-4.x-HBase-1.3 #601
Posted by Apache Jenkins Server <je...@builds.apache.org>.
See <https://builds.apache.org/job/Phoenix-4.x-HBase-1.3/601/display/redirect?page=changes>