You are viewing a plain text version of this content. The canonical link for it is here.
Posted to commits@phoenix.apache.org by Apache Jenkins Server <je...@builds.apache.org> on 2015/01/20 23:49:48 UTC

Build failed in Jenkins: Phoenix | Master #561

See <https://builds.apache.org/job/Phoenix-master/561/changes>

Changes:

[rajeshbabu] PHOENIX-1059 Support index regions merge on their corresponding data regions merge(Rajeshbabu)

------------------------------------------
[...truncated 454 lines...]
Running org.apache.phoenix.end2end.index.LocalMutableIndexIT
Tests run: 3, Failures: 0, Errors: 0, Skipped: 0, Time elapsed: 14.84 sec - in org.apache.phoenix.end2end.index.SaltedIndexIT
Running org.apache.phoenix.end2end.index.ImmutableIndexIT
Tests run: 6, Failures: 0, Errors: 0, Skipped: 0, Time elapsed: 41.007 sec - in org.apache.phoenix.end2end.index.GlobalIndexOptimizationIT
Running org.apache.phoenix.end2end.index.ViewIndexIT
Tests run: 13, Failures: 0, Errors: 0, Skipped: 0, Time elapsed: 26.336 sec - in org.apache.phoenix.end2end.index.ImmutableIndexIT
Running org.apache.phoenix.end2end.index.IndexMetadataIT
Tests run: 1, Failures: 0, Errors: 0, Skipped: 0, Time elapsed: 4.375 sec - in org.apache.phoenix.end2end.index.ViewIndexIT
Running org.apache.phoenix.end2end.index.GlobalMutableIndexIT
Tests run: 15, Failures: 0, Errors: 0, Skipped: 0, Time elapsed: 66.846 sec - in org.apache.phoenix.end2end.index.LocalMutableIndexIT
Running org.apache.phoenix.end2end.MD5FunctionIT
Tests run: 6, Failures: 0, Errors: 0, Skipped: 0, Time elapsed: 33.449 sec - in org.apache.phoenix.end2end.index.IndexMetadataIT
Running org.apache.phoenix.end2end.ConvertTimezoneFunctionIT
Tests run: 2, Failures: 0, Errors: 0, Skipped: 0, Time elapsed: 4.271 sec - in org.apache.phoenix.end2end.MD5FunctionIT
Running org.apache.phoenix.end2end.EncodeFunctionIT
Tests run: 6, Failures: 0, Errors: 0, Skipped: 0, Time elapsed: 2.803 sec - in org.apache.phoenix.end2end.ConvertTimezoneFunctionIT
Running org.apache.phoenix.end2end.UpsertBigValuesIT
Tests run: 6, Failures: 0, Errors: 0, Skipped: 0, Time elapsed: 7.034 sec - in org.apache.phoenix.end2end.EncodeFunctionIT
Running org.apache.phoenix.end2end.StddevIT
Tests run: 4, Failures: 0, Errors: 0, Skipped: 0, Time elapsed: 7.525 sec - in org.apache.phoenix.end2end.UpsertBigValuesIT
Running org.apache.phoenix.end2end.AutoCommitIT
Tests run: 4, Failures: 0, Errors: 0, Skipped: 0, Time elapsed: 3.176 sec - in org.apache.phoenix.end2end.StddevIT
Running org.apache.phoenix.end2end.LpadFunctionIT
Tests run: 1, Failures: 0, Errors: 0, Skipped: 0, Time elapsed: 2.212 sec - in org.apache.phoenix.end2end.AutoCommitIT
Running org.apache.phoenix.end2end.NthValueFunctionIT
Tests run: 5, Failures: 0, Errors: 0, Skipped: 0, Time elapsed: 93.448 sec - in org.apache.phoenix.trace.PhoenixTracingEndToEndIT
Tests run: 11, Failures: 0, Errors: 0, Skipped: 0, Time elapsed: 5.461 sec - in org.apache.phoenix.end2end.NthValueFunctionIT
Running org.apache.phoenix.end2end.SkipScanQueryIT
Running org.apache.phoenix.end2end.RegexpSplitFunctionIT
Tests run: 10, Failures: 0, Errors: 0, Skipped: 0, Time elapsed: 6.177 sec - in org.apache.phoenix.end2end.LpadFunctionIT
Running org.apache.phoenix.end2end.EvaluationOfORIT
Tests run: 1, Failures: 0, Errors: 0, Skipped: 0, Time elapsed: 1.995 sec - in org.apache.phoenix.end2end.EvaluationOfORIT
Running org.apache.phoenix.end2end.ToDateFunctionIT
Tests run: 6, Failures: 0, Errors: 0, Skipped: 0, Time elapsed: 0.515 sec - in org.apache.phoenix.end2end.ToDateFunctionIT
Running org.apache.phoenix.end2end.SkipScanAfterManualSplitIT
Tests run: 11, Failures: 0, Errors: 0, Skipped: 0, Time elapsed: 3.478 sec - in org.apache.phoenix.end2end.RegexpSplitFunctionIT
Running org.apache.phoenix.end2end.HashJoinIT
Tests run: 15, Failures: 0, Errors: 0, Skipped: 0, Time elapsed: 60.192 sec - in org.apache.phoenix.end2end.index.GlobalMutableIndexIT
Running org.apache.phoenix.end2end.MappingTableDataTypeIT
Tests run: 9, Failures: 0, Errors: 0, Skipped: 0, Time elapsed: 13.295 sec - in org.apache.phoenix.end2end.SkipScanQueryIT
Running org.apache.phoenix.end2end.TenantSpecificViewIndexSaltedIT
Tests run: 1, Failures: 0, Errors: 0, Skipped: 0, Time elapsed: 7.311 sec - in org.apache.phoenix.end2end.MappingTableDataTypeIT
Running org.apache.phoenix.end2end.SortOrderFIT
Tests run: 19, Failures: 1, Errors: 0, Skipped: 0, Time elapsed: 114.719 sec <<< FAILURE! - in org.apache.phoenix.end2end.index.LocalIndexIT
testLocalIndexScanAfterRegionsMerge(org.apache.phoenix.end2end.index.LocalIndexIT)  Time elapsed: 6.963 sec  <<< FAILURE!
org.junit.ComparisonFailure: expected:<...OCAL_IDX_T [-32768]
[]CLIENT MERGE SORT> but was:<...OCAL_IDX_T [-32768]
[    SERVER FILTER BY FIRST KEY ONLY
]CLIENT MERGE SORT>
	at org.junit.Assert.assertEquals(Assert.java:115)
	at org.junit.Assert.assertEquals(Assert.java:144)
	at org.apache.phoenix.end2end.index.LocalIndexIT.testLocalIndexScanAfterRegionsMerge(LocalIndexIT.java:845)

Running org.apache.phoenix.end2end.MinMaxAggregateFunctionIT
Tests run: 4, Failures: 0, Errors: 0, Skipped: 0, Time elapsed: 8.726 sec - in org.apache.phoenix.end2end.TenantSpecificViewIndexSaltedIT
Running org.apache.phoenix.end2end.DynamicFamilyIT
Tests run: 1, Failures: 0, Errors: 0, Skipped: 0, Time elapsed: 2.274 sec - in org.apache.phoenix.end2end.MinMaxAggregateFunctionIT
Running org.apache.phoenix.end2end.ReverseScanIT
Tests run: 30, Failures: 0, Errors: 0, Skipped: 0, Time elapsed: 5.741 sec - in org.apache.phoenix.end2end.SortOrderFIT
Running org.apache.phoenix.end2end.ExecuteStatementsIT
Tests run: 3, Failures: 0, Errors: 0, Skipped: 0, Time elapsed: 22.685 sec - in org.apache.phoenix.end2end.SkipScanAfterManualSplitIT
Tests run: 2, Failures: 0, Errors: 0, Skipped: 0, Time elapsed: 2.579 sec - in org.apache.phoenix.end2end.ReverseScanIT
Running org.apache.phoenix.end2end.TenantSpecificViewIndexIT
Running org.apache.phoenix.end2end.LastValueFunctionIT
Tests run: 4, Failures: 0, Errors: 0, Skipped: 0, Time elapsed: 4.695 sec - in org.apache.phoenix.end2end.DynamicFamilyIT
Running org.apache.phoenix.end2end.ReverseFunctionIT
Tests run: 5, Failures: 0, Errors: 0, Skipped: 0, Time elapsed: 2.755 sec - in org.apache.phoenix.end2end.ReverseFunctionIT
Running org.apache.phoenix.end2end.QueryMoreIT
Tests run: 11, Failures: 0, Errors: 0, Skipped: 0, Time elapsed: 5.126 sec - in org.apache.phoenix.end2end.LastValueFunctionIT
Running org.apache.phoenix.end2end.RoundFloorCeilFunctionsEnd2EndIT
Tests run: 2, Failures: 0, Errors: 0, Skipped: 0, Time elapsed: 13.224 sec - in org.apache.phoenix.end2end.ExecuteStatementsIT
Running org.apache.phoenix.end2end.CSVCommonsLoaderIT
Tests run: 30, Failures: 0, Errors: 0, Skipped: 0, Time elapsed: 6.402 sec - in org.apache.phoenix.end2end.RoundFloorCeilFunctionsEnd2EndIT
Running org.apache.phoenix.end2end.salted.SaltedTableUpsertSelectIT
Tests run: 7, Failures: 0, Errors: 0, Skipped: 0, Time elapsed: 12.789 sec - in org.apache.phoenix.end2end.TenantSpecificViewIndexIT
Running org.apache.phoenix.end2end.salted.SaltedTableVarLengthRowKeyIT
Tests run: 1, Failures: 0, Errors: 0, Skipped: 0, Time elapsed: 2.717 sec - in org.apache.phoenix.end2end.salted.SaltedTableVarLengthRowKeyIT
Running org.apache.phoenix.end2end.UpsertSelectAutoCommitIT
Tests run: 4, Failures: 0, Errors: 0, Skipped: 0, Time elapsed: 15.825 sec - in org.apache.phoenix.end2end.QueryMoreIT
Running org.apache.phoenix.end2end.CoalesceFunctionIT
Tests run: 5, Failures: 0, Errors: 0, Skipped: 0, Time elapsed: 8.868 sec - in org.apache.phoenix.end2end.salted.SaltedTableUpsertSelectIT
Running org.apache.phoenix.end2end.SubqueryIT
Tests run: 3, Failures: 0, Errors: 0, Skipped: 0, Time elapsed: 10.264 sec - in org.apache.phoenix.end2end.UpsertSelectAutoCommitIT
Running org.apache.phoenix.end2end.ServerExceptionIT
Tests run: 15, Failures: 0, Errors: 0, Skipped: 0, Time elapsed: 16.071 sec - in org.apache.phoenix.end2end.CSVCommonsLoaderIT
Running org.apache.phoenix.end2end.ModulusExpressionIT
Tests run: 1, Failures: 0, Errors: 0, Skipped: 0, Time elapsed: 1.674 sec - in org.apache.phoenix.end2end.ServerExceptionIT
Tests run: 10, Failures: 0, Errors: 0, Skipped: 0, Time elapsed: 7.745 sec - in org.apache.phoenix.end2end.CoalesceFunctionIT
Running org.apache.phoenix.end2end.SubqueryUsingSortMergeJoinIT
Running org.apache.phoenix.end2end.BinaryRowKeyIT
Tests run: 3, Failures: 0, Errors: 0, Skipped: 0, Time elapsed: 2.99 sec - in org.apache.phoenix.end2end.BinaryRowKeyIT
Running org.apache.phoenix.end2end.ReadOnlyIT
Tests run: 11, Failures: 0, Errors: 0, Skipped: 0, Time elapsed: 3.929 sec - in org.apache.phoenix.end2end.ModulusExpressionIT
Running org.apache.phoenix.end2end.DeleteIT
Tests run: 1, Failures: 0, Errors: 0, Skipped: 0, Time elapsed: 6.797 sec - in org.apache.phoenix.end2end.ReadOnlyIT
Running org.apache.phoenix.end2end.HashJoinLocalIndexIT
Tests run: 1, Failures: 0, Errors: 0, Skipped: 0, Time elapsed: 13.07 sec - in org.apache.phoenix.end2end.HashJoinLocalIndexIT
Running org.apache.phoenix.end2end.StatementHintsIT
Tests run: 2, Failures: 0, Errors: 0, Skipped: 0, Time elapsed: 1.872 sec - in org.apache.phoenix.end2end.StatementHintsIT
Running org.apache.phoenix.end2end.DecodeFunctionIT
Tests run: 6, Failures: 0, Errors: 0, Skipped: 0, Time elapsed: 3.275 sec - in org.apache.phoenix.end2end.DecodeFunctionIT
Running org.apache.phoenix.end2end.TimezoneOffsetFunctionIT
Tests run: 20, Failures: 0, Errors: 0, Skipped: 0, Time elapsed: 25.664 sec - in org.apache.phoenix.end2end.DeleteIT
Running org.apache.phoenix.end2end.SpooledSortMergeJoinIT
Tests run: 6, Failures: 0, Errors: 0, Skipped: 0, Time elapsed: 2.302 sec - in org.apache.phoenix.end2end.TimezoneOffsetFunctionIT
Running org.apache.phoenix.end2end.ArithmeticQueryIT
Tests run: 21, Failures: 0, Errors: 0, Skipped: 0, Time elapsed: 42.243 sec - in org.apache.phoenix.end2end.SubqueryIT
Running org.apache.phoenix.end2end.SpooledTmpFileDeleteIT
Tests run: 15, Failures: 0, Errors: 0, Skipped: 0, Time elapsed: 36.285 sec - in org.apache.phoenix.end2end.SubqueryUsingSortMergeJoinIT
Running org.apache.phoenix.end2end.FirstValueFunctionIT
Tests run: 1, Failures: 0, Errors: 0, Skipped: 0, Time elapsed: 2.267 sec - in org.apache.phoenix.end2end.SpooledTmpFileDeleteIT
Running org.apache.phoenix.end2end.RegexpSubstrFunctionIT
Tests run: 7, Failures: 0, Errors: 0, Skipped: 0, Time elapsed: 3.015 sec - in org.apache.phoenix.end2end.FirstValueFunctionIT
Running org.apache.phoenix.end2end.QueryExecWithoutSCNIT
Tests run: 2, Failures: 0, Errors: 0, Skipped: 0, Time elapsed: 1.904 sec - in org.apache.phoenix.end2end.RegexpSubstrFunctionIT
Running org.apache.phoenix.end2end.InListIT
Tests run: 1, Failures: 0, Errors: 0, Skipped: 0, Time elapsed: 2.273 sec - in org.apache.phoenix.end2end.QueryExecWithoutSCNIT
Running org.apache.phoenix.end2end.SortMergeJoinIT
Tests run: 20, Failures: 0, Errors: 0, Skipped: 0, Time elapsed: 12.612 sec - in org.apache.phoenix.end2end.ArithmeticQueryIT
Running org.apache.phoenix.end2end.StoreNullsIT
Tests run: 102, Failures: 0, Errors: 0, Skipped: 0, Time elapsed: 96.253 sec - in org.apache.phoenix.end2end.HashJoinIT
Tests run: 3, Failures: 0, Errors: 0, Skipped: 0, Time elapsed: 14.402 sec - in org.apache.phoenix.end2end.StoreNullsIT
Tests run: 25, Failures: 0, Errors: 0, Skipped: 0, Time elapsed: 61.938 sec - in org.apache.phoenix.end2end.InListIT
Tests run: 102, Failures: 0, Errors: 0, Skipped: 0, Time elapsed: 97.372 sec - in org.apache.phoenix.end2end.SpooledSortMergeJoinIT
Tests run: 102, Failures: 0, Errors: 0, Skipped: 0, Time elapsed: 91.621 sec - in org.apache.phoenix.end2end.SortMergeJoinIT

Results :

Failed tests: 
  LocalIndexIT.testLocalIndexScanAfterRegionsMerge:845 expected:<...OCAL_IDX_T [-32768]
[]CLIENT MERGE SORT> but was:<...OCAL_IDX_T [-32768]
[    SERVER FILTER BY FIRST KEY ONLY
]CLIENT MERGE SORT>



Tests run: 749, Failures: 1, Errors: 0, Skipped: 0

[INFO] 
[INFO] --- maven-failsafe-plugin:2.18:integration-test (NeedTheirOwnClusterTests) @ phoenix-core ---
[INFO] Failsafe report directory: <https://builds.apache.org/job/Phoenix-master/ws/phoenix-core/target/failsafe-reports>
[INFO] parallel='none', perCoreThreadCount=true, threadCount=0, useUnlimitedThreads=false, threadCountSuites=0, threadCountClasses=0, threadCountMethods=0, parallelOptimized=true

-------------------------------------------------------
 T E S T S
-------------------------------------------------------
Running org.apache.hadoop.hbase.regionserver.wal.WALReplayWithIndexWritesAndUncompressedWALInHBase_094_9_IT
Running org.apache.hadoop.hbase.regionserver.wal.WALReplayWithIndexWritesAndCompressedWALIT
Running org.apache.phoenix.hbase.index.covered.example.EndToEndCoveredIndexingIT
Running org.apache.phoenix.hbase.index.covered.example.EndtoEndIndexingWithCompressionIT
Running org.apache.phoenix.hbase.index.covered.EndToEndCoveredColumnsIndexBuilderIT
Tests run: 1, Failures: 0, Errors: 0, Skipped: 0, Time elapsed: 17.727 sec - in org.apache.hadoop.hbase.regionserver.wal.WALReplayWithIndexWritesAndUncompressedWALInHBase_094_9_IT
Tests run: 1, Failures: 0, Errors: 0, Skipped: 0, Time elapsed: 17.726 sec - in org.apache.hadoop.hbase.regionserver.wal.WALReplayWithIndexWritesAndCompressedWALIT
Running org.apache.phoenix.hbase.index.FailForUnsupportedHBaseVersionsIT
Tests run: 2, Failures: 0, Errors: 0, Skipped: 0, Time elapsed: 7.907 sec - in org.apache.phoenix.hbase.index.covered.EndToEndCoveredColumnsIndexBuilderIT
Running org.apache.phoenix.hbase.index.covered.example.FailWithoutRetriesIT
Running org.apache.phoenix.hbase.index.balancer.IndexLoadBalancerIT
Tests run: 2, Failures: 0, Errors: 0, Skipped: 0, Time elapsed: 15.314 sec - in org.apache.phoenix.hbase.index.FailForUnsupportedHBaseVersionsIT
Tests run: 1, Failures: 0, Errors: 0, Skipped: 0, Time elapsed: 9.067 sec - in org.apache.phoenix.hbase.index.covered.example.FailWithoutRetriesIT
Running org.apache.phoenix.end2end.index.MutableIndexFailureIT
Running org.apache.phoenix.end2end.index.MutableIndexReplicationIT
Tests run: 11, Failures: 0, Errors: 0, Skipped: 0, Time elapsed: 48.139 sec - in org.apache.phoenix.hbase.index.covered.example.EndtoEndIndexingWithCompressionIT
Running org.apache.phoenix.end2end.index.DropIndexDuringUpsertIT
Tests run: 11, Failures: 0, Errors: 0, Skipped: 0, Time elapsed: 48.204 sec - in org.apache.phoenix.hbase.index.covered.example.EndToEndCoveredIndexingIT
Tests run: 1, Failures: 0, Errors: 0, Skipped: 1, Time elapsed: 0 sec - in org.apache.phoenix.end2end.index.DropIndexDuringUpsertIT
Tests run: 1, Failures: 0, Errors: 0, Skipped: 0, Time elapsed: 16.259 sec - in org.apache.phoenix.end2end.index.MutableIndexReplicationIT
Running org.apache.phoenix.end2end.StatsCollectorIT
Running org.apache.phoenix.end2end.StatsCollectorWithSplitsAndMultiCFIT
Running org.apache.phoenix.end2end.TenantSpecificTablesDDLIT
Tests run: 2, Failures: 0, Errors: 0, Skipped: 0, Time elapsed: 29.255 sec - in org.apache.phoenix.end2end.StatsCollectorWithSplitsAndMultiCFIT
Tests run: 18, Failures: 0, Errors: 0, Skipped: 0, Time elapsed: 30.776 sec - in org.apache.phoenix.end2end.TenantSpecificTablesDDLIT
Running org.apache.phoenix.end2end.CountDistinctCompressionIT
Tests run: 4, Failures: 0, Errors: 0, Skipped: 0, Time elapsed: 49.477 sec - in org.apache.phoenix.end2end.StatsCollectorIT
Tests run: 1, Failures: 0, Errors: 0, Skipped: 0, Time elapsed: 9.525 sec - in org.apache.phoenix.end2end.CountDistinctCompressionIT
Running org.apache.phoenix.end2end.SpillableGroupByIT
Tests run: 9, Failures: 0, Errors: 0, Skipped: 0, Time elapsed: 108.604 sec - in org.apache.phoenix.hbase.index.balancer.IndexLoadBalancerIT
Running org.apache.phoenix.end2end.KeyOnlyIT
Tests run: 1, Failures: 0, Errors: 0, Skipped: 0, Time elapsed: 9.088 sec - in org.apache.phoenix.end2end.SpillableGroupByIT
Running org.apache.phoenix.end2end.ViewIT
Tests run: 3, Failures: 0, Errors: 0, Skipped: 0, Time elapsed: 9.358 sec - in org.apache.phoenix.end2end.KeyOnlyIT
Running org.apache.phoenix.end2end.MultiCfQueryExecIT
Running org.apache.phoenix.end2end.ContextClassloaderIT
Tests run: 12, Failures: 0, Errors: 0, Skipped: 0, Time elapsed: 13.364 sec - in org.apache.phoenix.end2end.ViewIT
Running org.apache.phoenix.end2end.QueryWithLimitIT
Tests run: 3, Failures: 0, Errors: 0, Skipped: 0, Time elapsed: 8.046 sec - in org.apache.phoenix.end2end.ContextClassloaderIT
Tests run: 7, Failures: 0, Errors: 0, Skipped: 0, Time elapsed: 17.715 sec - in org.apache.phoenix.end2end.MultiCfQueryExecIT
Running org.apache.phoenix.end2end.ParallelIteratorsIT
Tests run: 2, Failures: 0, Errors: 0, Skipped: 0, Time elapsed: 10.055 sec - in org.apache.phoenix.end2end.QueryWithLimitIT
Running org.apache.phoenix.end2end.TenantSpecificTablesDMLIT
Running org.apache.phoenix.end2end.AlterTableIT
Tests run: 2, Failures: 0, Errors: 0, Skipped: 0, Time elapsed: 12.268 sec - in org.apache.phoenix.end2end.ParallelIteratorsIT
Tests run: 3, Failures: 0, Errors: 0, Skipped: 0, Time elapsed: 153.948 sec - in org.apache.phoenix.end2end.index.MutableIndexFailureIT
Running org.apache.phoenix.end2end.SaltedViewIT
Tests run: 16, Failures: 0, Errors: 0, Skipped: 0, Time elapsed: 11.459 sec - in org.apache.phoenix.end2end.TenantSpecificTablesDMLIT
Running org.apache.phoenix.end2end.QueryTimeoutIT
Tests run: 2, Failures: 0, Errors: 0, Skipped: 0, Time elapsed: 8.809 sec - in org.apache.phoenix.end2end.SaltedViewIT
Tests run: 1, Failures: 0, Errors: 0, Skipped: 0, Time elapsed: 9.162 sec - in org.apache.phoenix.end2end.QueryTimeoutIT
Running org.apache.phoenix.mapreduce.CsvBulkLoadToolIT
Tests run: 4, Failures: 0, Errors: 0, Skipped: 0, Time elapsed: 166.899 sec - in org.apache.phoenix.mapreduce.CsvBulkLoadToolIT
Tests run: 51, Failures: 0, Errors: 0, Skipped: 0, Time elapsed: 249.292 sec - in org.apache.phoenix.end2end.AlterTableIT

Results :




Tests run: 172, Failures: 0, Errors: 0, Skipped: 1

[INFO] 
[INFO] --- maven-failsafe-plugin:2.18:verify (ClientManagedTimeTests) @ phoenix-core ---
[INFO] Failsafe report directory: <https://builds.apache.org/job/Phoenix-master/ws/phoenix-core/target/failsafe-reports>
[INFO] ------------------------------------------------------------------------
[INFO] Reactor Summary:
[INFO] 
[INFO] Apache Phoenix .................................... SUCCESS [1.834s]
[INFO] Phoenix Core ...................................... FAILURE [16:32.898s]
[INFO] Phoenix - Flume ................................... SKIPPED
[INFO] Phoenix - Pig ..................................... SKIPPED
[INFO] Phoenix Assembly .................................. SKIPPED
[INFO] ------------------------------------------------------------------------
[INFO] BUILD FAILURE
[INFO] ------------------------------------------------------------------------
[INFO] Total time: 16:35.114s
[INFO] Finished at: Tue Jan 20 22:48:30 UTC 2015
[INFO] Final Memory: 47M/1038M
[INFO] ------------------------------------------------------------------------
[ERROR] Failed to execute goal org.apache.maven.plugins:maven-failsafe-plugin:2.18:verify (ClientManagedTimeTests) on project phoenix-core: There are test failures.
[ERROR] 
[ERROR] Please refer to <https://builds.apache.org/job/Phoenix-master/ws/phoenix-core/target/failsafe-reports> for the individual test results.
[ERROR] -> [Help 1]
[ERROR] 
[ERROR] To see the full stack trace of the errors, re-run Maven with the -e switch.
[ERROR] Re-run Maven using the -X switch to enable full debug logging.
[ERROR] 
[ERROR] For more information about the errors and possible solutions, please read the following articles:
[ERROR] [Help 1] http://cwiki.apache.org/confluence/display/MAVEN/MojoFailureException
[ERROR] 
[ERROR] After correcting the problems, you can resume the build with the command
[ERROR]   mvn <goals> -rf :phoenix-core
Build step 'Invoke top-level Maven targets' marked build as failure
Archiving artifacts
Sending artifact delta relative to Phoenix | Master #560
Archived 807 artifacts
Archive block size is 32768
Received 5623 blocks and 411620967 bytes
Compression is 30.9%
Took 1 min 59 sec
Updating PHOENIX-1059
Recording test results

Jenkins build is back to normal : Phoenix | Master #562

Posted by Apache Jenkins Server <je...@builds.apache.org>.
See <https://builds.apache.org/job/Phoenix-master/562/changes>