You are viewing a plain text version of this content. The canonical link for it is here.
Posted to builds@beam.apache.org by Apache Jenkins Server <je...@builds.apache.org> on 2023/09/12 18:24:26 UTC
Build failed in Jenkins: beam_PostCommit_XVR_Direct #4590
See <https://ci-beam.apache.org/job/beam_PostCommit_XVR_Direct/4590/display/redirect?page=changes>
Changes:
[noreply] Update protobuf dependency to the version that fixes memory leaks.
------------------------------------------
[...truncated 2.40 MB...]
return self._state.response is not None or (
cygrpc.OperationType.receive_message not in self._state.due
and self._state.code is not None
)
_common.wait(self._state.condition.wait, _response_ready)
if self._state.response is not None:
response = self._state.response
self._state.response = None
return response
elif cygrpc.OperationType.receive_message not in self._state.due:
if self._state.code is grpc.StatusCode.OK:
raise StopIteration()
elif self._state.code is not None:
> raise self
E grpc._channel._MultiThreadedRendezvous: <_MultiThreadedRendezvous of RPC that terminated with:
E status = StatusCode.DEADLINE_EXCEEDED
E details = "Deadline Exceeded"
E debug_error_string = "UNKNOWN:Error received from peer ipv4:127.0.0.1:37259 {created_time:"2023-09-12T18:23:37.493749935+00:00", grpc_status:4, grpc_message:"Deadline Exceeded"}"
E >
../../build/gradleenv/1922375555/lib/python3.11/site-packages/grpc/_channel.py:967: _MultiThreadedRendezvous
------------------------------ Captured log call -------------------------------
INFO apache_beam.utils.subprocess_server:subprocess_server.py:239 Using pre-built snapshot at <https://ci-beam.apache.org/job/beam_PostCommit_XVR_Direct/ws/src/sdks/java/extensions/sql/expansion-service/build/libs/beam-sdks-java-extensions-sql-expansion-service-2.51.0-SNAPSHOT.jar>
INFO root:external.py:970 Starting a JAR-based expansion service from JAR <https://ci-beam.apache.org/job/beam_PostCommit_XVR_Direct/ws/src/sdks/java/extensions/sql/expansion-service/build/libs/beam-sdks-java-extensions-sql-expansion-service-2.51.0-SNAPSHOT.jar>
INFO apache_beam.utils.subprocess_server:subprocess_server.py:116 Starting service with ['java' '-jar' '<https://ci-beam.apache.org/job/beam_PostCommit_XVR_Direct/ws/src/sdks/java/extensions/sql/expansion-service/build/libs/beam-sdks-java-extensions-sql-expansion-service-2.51.0-SNAPSHOT.jar'> '41233' '--filesToStage=<https://ci-beam.apache.org/job/beam_PostCommit_XVR_Direct/ws/src/sdks/java/extensions/sql/expansion-service/build/libs/beam-sdks-java-extensions-sql-expansion-service-2.51.0-SNAPSHOT.jar']>
INFO apache_beam.utils.subprocess_server:subprocess_server.py:126 Starting expansion service at localhost:41233
WARNING root:subprocess_server.py:95 Waiting for grpc channel to be ready at localhost:41233.
WARNING root:subprocess_server.py:95 Waiting for grpc channel to be ready at localhost:41233.
WARNING root:subprocess_server.py:95 Waiting for grpc channel to be ready at localhost:41233.
WARNING root:subprocess_server.py:95 Waiting for grpc channel to be ready at localhost:41233.
INFO apache_beam.utils.subprocess_server:subprocess_server.py:126 Sep 12, 2023 6:22:19 PM org.apache.beam.sdk.expansion.service.ExpansionService loadRegisteredTransforms
INFO apache_beam.utils.subprocess_server:subprocess_server.py:126 INFO: Registering external transforms: [beam:external:java:sql:v1, beam:transform:org.apache.beam:pubsub_read:v1, beam:transform:org.apache.beam:pubsub_write:v1, beam:transform:org.apache.beam:pubsublite_write:v1, beam:transform:org.apache.beam:pubsublite_read:v1, beam:transform:org.apache.beam:spanner_insert:v1, beam:transform:org.apache.beam:spanner_update:v1, beam:transform:org.apache.beam:spanner_replace:v1, beam:transform:org.apache.beam:spanner_insert_or_update:v1, beam:transform:org.apache.beam:spanner_delete:v1, beam:transform:org.apache.beam:spanner_read:v1, beam:transform:org.apache.beam:kafka_read_with_metadata:v1, beam:transform:org.apache.beam:kafka_read_without_metadata:v1, beam:transform:org.apache.beam:kafka_write:v1, beam:external:java:generate_sequence:v1]
WARNING root:subprocess_server.py:95 Waiting for grpc channel to be ready at localhost:41233.
INFO apache_beam.utils.subprocess_server:subprocess_server.py:126
INFO apache_beam.utils.subprocess_server:subprocess_server.py:126 Registered transforms:
INFO apache_beam.utils.subprocess_server:subprocess_server.py:126 beam:external:java:sql:v1: org.apache.beam.sdk.expansion.service.ExpansionService$ExternalTransformRegistrarLoader$1@3c46e67a
INFO apache_beam.utils.subprocess_server:subprocess_server.py:126 beam:transform:org.apache.beam:pubsub_read:v1: org.apache.beam.sdk.expansion.service.ExpansionService$ExternalTransformRegistrarLoader$1@c730b35
INFO apache_beam.utils.subprocess_server:subprocess_server.py:126 beam:transform:org.apache.beam:pubsub_write:v1: org.apache.beam.sdk.expansion.service.ExpansionService$ExternalTransformRegistrarLoader$1@206a70ef
INFO apache_beam.utils.subprocess_server:subprocess_server.py:126 beam:transform:org.apache.beam:pubsublite_write:v1: org.apache.beam.sdk.expansion.service.ExpansionService$ExternalTransformRegistrarLoader$1@292b08d6
INFO apache_beam.utils.subprocess_server:subprocess_server.py:126 beam:transform:org.apache.beam:pubsublite_read:v1: org.apache.beam.sdk.expansion.service.ExpansionService$ExternalTransformRegistrarLoader$1@22555ebf
INFO apache_beam.utils.subprocess_server:subprocess_server.py:126 beam:transform:org.apache.beam:spanner_insert:v1: org.apache.beam.sdk.expansion.service.ExpansionService$ExternalTransformRegistrarLoader$1@36ebc363
INFO apache_beam.utils.subprocess_server:subprocess_server.py:126 beam:transform:org.apache.beam:spanner_update:v1: org.apache.beam.sdk.expansion.service.ExpansionService$ExternalTransformRegistrarLoader$1@45752059
INFO apache_beam.utils.subprocess_server:subprocess_server.py:126 beam:transform:org.apache.beam:spanner_replace:v1: org.apache.beam.sdk.expansion.service.ExpansionService$ExternalTransformRegistrarLoader$1@34e9fd99
INFO apache_beam.utils.subprocess_server:subprocess_server.py:126 beam:transform:org.apache.beam:spanner_insert_or_update:v1: org.apache.beam.sdk.expansion.service.ExpansionService$ExternalTransformRegistrarLoader$1@3c41ed1d
INFO apache_beam.utils.subprocess_server:subprocess_server.py:126 beam:transform:org.apache.beam:spanner_delete:v1: org.apache.beam.sdk.expansion.service.ExpansionService$ExternalTransformRegistrarLoader$1@54d9d12d
INFO apache_beam.utils.subprocess_server:subprocess_server.py:126 beam:transform:org.apache.beam:spanner_read:v1: org.apache.beam.sdk.expansion.service.ExpansionService$ExternalTransformRegistrarLoader$1@38425407
INFO apache_beam.utils.subprocess_server:subprocess_server.py:126 beam:transform:org.apache.beam:kafka_read_with_metadata:v1: org.apache.beam.sdk.expansion.service.ExpansionService$ExternalTransformRegistrarLoader$1@43bc63a3
INFO apache_beam.utils.subprocess_server:subprocess_server.py:126 beam:transform:org.apache.beam:kafka_read_without_metadata:v1: org.apache.beam.sdk.expansion.service.ExpansionService$ExternalTransformRegistrarLoader$1@702657cc
INFO apache_beam.utils.subprocess_server:subprocess_server.py:126 beam:transform:org.apache.beam:kafka_write:v1: org.apache.beam.sdk.expansion.service.ExpansionService$ExternalTransformRegistrarLoader$1@6a6cb05c
INFO apache_beam.utils.subprocess_server:subprocess_server.py:126 beam:external:java:generate_sequence:v1: org.apache.beam.sdk.expansion.service.ExpansionService$ExternalTransformRegistrarLoader$1@40a4337a
INFO apache_beam.utils.subprocess_server:subprocess_server.py:126
INFO apache_beam.utils.subprocess_server:subprocess_server.py:126 Registered SchemaTransformProviders:
INFO apache_beam.utils.subprocess_server:subprocess_server.py:126 beam:schematransform:org.apache.beam:spanner_cdc_read:v1
INFO apache_beam.utils.subprocess_server:subprocess_server.py:126 beam:schematransform:org.apache.beam:bigtable_write:v1
INFO apache_beam.utils.subprocess_server:subprocess_server.py:126 beam:schematransform:org.apache.beam:spanner_write:v1
INFO apache_beam.utils.subprocess_server:subprocess_server.py:126 beam:schematransform:org.apache.beam:pubsublite_read:v1
INFO apache_beam.utils.subprocess_server:subprocess_server.py:126 beam:schematransform:org.apache.beam:bigquery_storage_read:v1
INFO apache_beam.utils.subprocess_server:subprocess_server.py:126 beam:schematransform:org.apache.beam:bigquery_fileloads_write:v1
INFO apache_beam.utils.subprocess_server:subprocess_server.py:126 beam:schematransform:org.apache.beam:bigquery_export_read:v1
INFO apache_beam.utils.subprocess_server:subprocess_server.py:126 beam:schematransform:org.apache.beam:kafka_read:v1
INFO apache_beam.utils.subprocess_server:subprocess_server.py:126 beam:schematransform:org.apache.beam:kafka_write:v1
INFO apache_beam.utils.subprocess_server:subprocess_server.py:126 beam:schematransform:org.apache.beam:bigquery_storage_write:v2
INFO apache_beam.utils.subprocess_server:subprocess_server.py:126 schematransform:org.apache.beam:sql_transform:v1
INFO apache_beam.utils.subprocess_server:subprocess_server.py:126 beam:schematransform:org.apache.beam:pubsub_read:v1
INFO apache_beam.utils.subprocess_server:subprocess_server.py:126 beam:schematransform:org.apache.beam:pubsub_write:v1
INFO apache_beam.utils.subprocess_server:subprocess_server.py:126 beam:schematransform:org.apache.beam:bigtable_read:v1
INFO apache_beam.utils.subprocess_server:subprocess_server.py:126 beam:schematransform:org.apache.beam:pubsublite_write:v1
WARNING root:subprocess_server.py:95 Waiting for grpc channel to be ready at localhost:41233.
WARNING root:subprocess_server.py:95 Waiting for grpc channel to be ready at localhost:41233.
INFO apache_beam.utils.subprocess_server:subprocess_server.py:126 Sep 12, 2023 6:22:25 PM org.apache.beam.sdk.expansion.service.ExpansionService expand
INFO apache_beam.utils.subprocess_server:subprocess_server.py:126 INFO: Expanding 'SqlTransform(beam:external:java:sql:v1)' with URN 'beam:external:java:sql:v1'
INFO apache_beam.utils.subprocess_server:subprocess_server.py:126 Dependencies list: {}
INFO apache_beam.utils.subprocess_server:subprocess_server.py:126 Sep 12, 2023 6:22:25 PM org.apache.beam.sdk.expansion.service.ExpansionService$ExternalTransformRegistrarLoader payloadToConfig
INFO apache_beam.utils.subprocess_server:subprocess_server.py:126 WARNING: Configuration class 'org.apache.beam.sdk.extensions.sql.expansion.ExternalSqlTransformRegistrar$Configuration' has no schema registered. Attempting to construct with setter approach.
INFO apache_beam.utils.subprocess_server:subprocess_server.py:126 Sep 12, 2023 6:22:25 PM org.apache.beam.sdk.expansion.service.ExpansionService$ExternalTransformRegistrarLoader payloadToConfig
INFO apache_beam.utils.subprocess_server:subprocess_server.py:126 WARNING: Configuration class 'org.apache.beam.sdk.extensions.sql.expansion.ExternalSqlTransformRegistrar$Configuration' has no schema registered. Attempting to construct with setter approach.
INFO apache_beam.utils.subprocess_server:subprocess_server.py:126 Sep 12, 2023 6:22:27 PM org.apache.beam.sdk.extensions.sql.impl.CalciteQueryPlanner convertToBeamRel
INFO apache_beam.utils.subprocess_server:subprocess_server.py:126 INFO: SQL:
INFO apache_beam.utils.subprocess_server:subprocess_server.py:126 SELECT COUNT(*) AS `count`
INFO apache_beam.utils.subprocess_server:subprocess_server.py:126 FROM `beam`.`PCOLLECTION` AS `PCOLLECTION`
INFO apache_beam.utils.subprocess_server:subprocess_server.py:126 Sep 12, 2023 6:22:27 PM org.apache.beam.sdk.extensions.sql.impl.CalciteQueryPlanner convertToBeamRel
INFO apache_beam.utils.subprocess_server:subprocess_server.py:126 INFO: SQLPlan>
INFO apache_beam.utils.subprocess_server:subprocess_server.py:126 LogicalAggregate(group=[{}], count=[COUNT()])
INFO apache_beam.utils.subprocess_server:subprocess_server.py:126 BeamIOSourceRel(table=[[beam, PCOLLECTION]])
INFO apache_beam.utils.subprocess_server:subprocess_server.py:126
INFO apache_beam.utils.subprocess_server:subprocess_server.py:126 Sep 12, 2023 6:22:28 PM org.apache.beam.sdk.extensions.sql.impl.CalciteQueryPlanner convertToBeamRel
INFO apache_beam.utils.subprocess_server:subprocess_server.py:126 INFO: BEAMPlan>
INFO apache_beam.utils.subprocess_server:subprocess_server.py:126 BeamAggregationRel(group=[{}], count=[COUNT()])
INFO apache_beam.utils.subprocess_server:subprocess_server.py:126 BeamIOSourceRel(table=[[beam, PCOLLECTION]])
INFO apache_beam.utils.subprocess_server:subprocess_server.py:126
INFO root:environments.py:317 No image given, using default Python SDK image
INFO root:environments.py:320 Python SDK container image set to "apache/beam_python3.11_sdk:2.51.0.dev" for Docker environment
INFO apache_beam.runners.portability.fn_api_runner.translations:translations.py:712 ==================== <function pack_combiners at 0x7fba21f313a0> ====================
INFO apache_beam.runners.portability.fn_api_runner.translations:translations.py:712 ==================== <function lift_combiners at 0x7fba21f31440> ====================
INFO apache_beam.runners.portability.fn_api_runner.translations:translations.py:712 ==================== <function sort_stages at 0x7fba21f31c60> ====================
INFO apache_beam.runners.portability.portable_runner:portable_runner.py:549 Job state changed to STOPPED
INFO apache_beam.runners.portability.portable_runner:portable_runner.py:549 Job state changed to STARTING
INFO apache_beam.runners.portability.portable_runner:portable_runner.py:549 Job state changed to RUNNING
INFO root:portable_runner.py:542 ==================== <function annotate_downstream_side_inputs at 0x7fe4f37de700> ====================
INFO root:portable_runner.py:542 ==================== <function fix_side_input_pcoll_coders at 0x7fe4f37de840> ====================
INFO root:portable_runner.py:542 ==================== <function pack_combiners at 0x7fe4f37dede0> ====================
INFO root:portable_runner.py:542 ==================== <function lift_combiners at 0x7fe4f37dee80> ====================
INFO root:portable_runner.py:542 ==================== <function expand_sdf at 0x7fe4f37df060> ====================
INFO root:portable_runner.py:542 ==================== <function expand_gbk at 0x7fe4f37df100> ====================
INFO root:portable_runner.py:542 ==================== <function sink_flattens at 0x7fe4f37df240> ====================
INFO root:portable_runner.py:542 ==================== <function greedily_fuse at 0x7fe4f37df2e0> ====================
INFO root:portable_runner.py:542 ==================== <function read_to_impulse at 0x7fe4f37df380> ====================
INFO root:portable_runner.py:542 ==================== <function impulse_to_input at 0x7fe4f37df420> ====================
INFO root:portable_runner.py:542 ==================== <function sort_stages at 0x7fe4f37df6a0> ====================
INFO root:portable_runner.py:542 ==================== <function add_impulse_to_dangling_transforms at 0x7fe4f37df7e0> ====================
INFO root:portable_runner.py:542 ==================== <function setup_timer_mapping at 0x7fe4f37df600> ====================
INFO root:portable_runner.py:542 ==================== <function populate_data_channel_coders at 0x7fe4f37df740> ====================
INFO root:portable_runner.py:542 starting control server on port 35921
INFO root:portable_runner.py:542 starting data server on port 44823
INFO root:portable_runner.py:542 starting state server on port 34525
INFO root:portable_runner.py:542 starting logging server on port 38863
INFO root:portable_runner.py:542 Created Worker handler <apache_beam.runners.portability.fn_api_runner.worker_handlers.DockerSdkWorkerHandler object at 0x7fe4f36afa50> for environment ref_Environment_default_environment_2 (beam:env:docker:v1, b'\n%apache/beam_python3.11_sdk:2.51.0.dev')
INFO root:portable_runner.py:542 Attempting to pull image apache/beam_python3.11_sdk:2.51.0.dev
INFO root:portable_runner.py:542 Unable to pull image apache/beam_python3.11_sdk:2.51.0.dev, defaulting to local image if it exists
=============================== warnings summary ===============================
../../build/gradleenv/1922375555/lib/python3.11/site-packages/hdfs/config.py:28
<https://ci-beam.apache.org/job/beam_PostCommit_XVR_Direct/ws/src/build/gradleenv/1922375555/lib/python3.11/site-packages/hdfs/config.py>:28: DeprecationWarning: the imp module is deprecated in favour of importlib and slated for removal in Python 3.12; see the module's documentation for alternative uses
from imp import load_source
../../build/gradleenv/1922375555/lib/python3.11/site-packages/google/rpc/__init__.py:18
<https://ci-beam.apache.org/job/beam_PostCommit_XVR_Direct/ws/src/build/gradleenv/1922375555/lib/python3.11/site-packages/google/rpc/__init__.py>:18: DeprecationWarning: pkg_resources is deprecated as an API. See https://setuptools.pypa.io/en/latest/pkg_resources.html
import pkg_resources
../../build/gradleenv/1922375555/lib/python3.11/site-packages/pkg_resources/__init__.py:2871: 19 warnings
<https://ci-beam.apache.org/job/beam_PostCommit_XVR_Direct/ws/src/build/gradleenv/1922375555/lib/python3.11/site-packages/pkg_resources/__init__.py>:2871: DeprecationWarning: Deprecated call to `pkg_resources.declare_namespace('google')`.
Implementing implicit namespace packages (as specified in PEP 420) is preferred to `pkg_resources.declare_namespace`. See https://setuptools.pypa.io/en/latest/references/keywords.html#keyword-namespace-packages
declare_namespace(pkg)
../../build/gradleenv/1922375555/lib/python3.11/site-packages/pkg_resources/__init__.py:2871: 16 warnings
<https://ci-beam.apache.org/job/beam_PostCommit_XVR_Direct/ws/src/build/gradleenv/1922375555/lib/python3.11/site-packages/pkg_resources/__init__.py>:2871: DeprecationWarning: Deprecated call to `pkg_resources.declare_namespace('google.cloud')`.
Implementing implicit namespace packages (as specified in PEP 420) is preferred to `pkg_resources.declare_namespace`. See https://setuptools.pypa.io/en/latest/references/keywords.html#keyword-namespace-packages
declare_namespace(pkg)
../../build/gradleenv/1922375555/lib/python3.11/site-packages/pkg_resources/__init__.py:2350
../../build/gradleenv/1922375555/lib/python3.11/site-packages/pkg_resources/__init__.py:2350
../../build/gradleenv/1922375555/lib/python3.11/site-packages/pkg_resources/__init__.py:2350
../../build/gradleenv/1922375555/lib/python3.11/site-packages/pkg_resources/__init__.py:2350
<https://ci-beam.apache.org/job/beam_PostCommit_XVR_Direct/ws/src/build/gradleenv/1922375555/lib/python3.11/site-packages/pkg_resources/__init__.py>:2350: DeprecationWarning: Deprecated call to `pkg_resources.declare_namespace('google')`.
Implementing implicit namespace packages (as specified in PEP 420) is preferred to `pkg_resources.declare_namespace`. See https://setuptools.pypa.io/en/latest/references/keywords.html#keyword-namespace-packages
declare_namespace(parent)
../../build/gradleenv/1922375555/lib/python3.11/site-packages/pkg_resources/__init__.py:2871
<https://ci-beam.apache.org/job/beam_PostCommit_XVR_Direct/ws/src/build/gradleenv/1922375555/lib/python3.11/site-packages/pkg_resources/__init__.py>:2871: DeprecationWarning: Deprecated call to `pkg_resources.declare_namespace('google.logging')`.
Implementing implicit namespace packages (as specified in PEP 420) is preferred to `pkg_resources.declare_namespace`. See https://setuptools.pypa.io/en/latest/references/keywords.html#keyword-namespace-packages
declare_namespace(pkg)
../../build/gradleenv/1922375555/lib/python3.11/site-packages/pkg_resources/__init__.py:2871
<https://ci-beam.apache.org/job/beam_PostCommit_XVR_Direct/ws/src/build/gradleenv/1922375555/lib/python3.11/site-packages/pkg_resources/__init__.py>:2871: DeprecationWarning: Deprecated call to `pkg_resources.declare_namespace('google.iam')`.
Implementing implicit namespace packages (as specified in PEP 420) is preferred to `pkg_resources.declare_namespace`. See https://setuptools.pypa.io/en/latest/references/keywords.html#keyword-namespace-packages
declare_namespace(pkg)
../../build/gradleenv/1922375555/lib/python3.11/site-packages/google/rpc/__init__.py:20
<https://ci-beam.apache.org/job/beam_PostCommit_XVR_Direct/ws/src/build/gradleenv/1922375555/lib/python3.11/site-packages/google/rpc/__init__.py>:20: DeprecationWarning: Deprecated call to `pkg_resources.declare_namespace('google.rpc')`.
Implementing implicit namespace packages (as specified in PEP 420) is preferred to `pkg_resources.declare_namespace`. See https://setuptools.pypa.io/en/latest/references/keywords.html#keyword-namespace-packages
pkg_resources.declare_namespace(__name__)
../../build/gradleenv/1922375555/lib/python3.11/site-packages/google/api_core/operations_v1/abstract_operations_client.py:17
<https://ci-beam.apache.org/job/beam_PostCommit_XVR_Direct/ws/src/build/gradleenv/1922375555/lib/python3.11/site-packages/google/api_core/operations_v1/abstract_operations_client.py>:17: DeprecationWarning: The distutils package is deprecated and slated for removal in Python 3.12. Use setuptools or check PEP 632 for potential alternatives
from distutils import util
apache_beam/transforms/sql_test.py::SqlTransformTest::test_agg
apache_beam/transforms/sql_test.py::SqlTransformTest::test_filter
apache_beam/transforms/sql_test.py::SqlTransformTest::test_generate_data
apache_beam/transforms/sql_test.py::SqlTransformTest::test_map
apache_beam/transforms/sql_test.py::SqlTransformTest::test_project
apache_beam/transforms/sql_test.py::SqlTransformTest::test_row
apache_beam/transforms/sql_test.py::SqlTransformTest::test_tagged_join
apache_beam/transforms/sql_test.py::SqlTransformTest::test_windowing_before_sql
apache_beam/transforms/sql_test.py::SqlTransformTest::test_zetasql_generate_data
<https://ci-beam.apache.org/job/beam_PostCommit_XVR_Direct/ws/src/sdks/python/apache_beam/transforms/external.py>:717: BeamDeprecationWarning: options is deprecated since First stable release. References to <pipeline>.options will not be supported
self._expansion_service, pipeline.options)
apache_beam/transforms/sql_test.py::SqlTransformTest::test_windowing_before_sql
<https://ci-beam.apache.org/job/beam_PostCommit_XVR_Direct/ws/src/build/gradleenv/1922375555/lib/python3.11/site-packages/_pytest/threadexception.py>:73: PytestUnhandledThreadExceptionWarning: Exception in thread wait_until_finish_read
Traceback (most recent call last):
File "/usr/lib/python3.11/threading.py", line 1038, in _bootstrap_inner
self.run()
File "/usr/lib/python3.11/threading.py", line 975, in run
self._target(*self._args, **self._kwargs)
File "<https://ci-beam.apache.org/job/beam_PostCommit_XVR_Direct/ws/src/sdks/python/apache_beam/runners/portability/portable_runner.py",> line 540, in read_messages
for message in self._message_stream:
File "<https://ci-beam.apache.org/job/beam_PostCommit_XVR_Direct/ws/src/build/gradleenv/1922375555/lib/python3.11/site-packages/grpc/_channel.py",> line 541, in __next__
return self._next()
^^^^^^^^^^^^
File "<https://ci-beam.apache.org/job/beam_PostCommit_XVR_Direct/ws/src/build/gradleenv/1922375555/lib/python3.11/site-packages/grpc/_channel.py",> line 967, in _next
raise self
grpc._channel._MultiThreadedRendezvous: <_MultiThreadedRendezvous of RPC that terminated with:
status = StatusCode.DEADLINE_EXCEEDED
details = "Deadline Exceeded"
debug_error_string = "UNKNOWN:Error received from peer ipv4:127.0.0.1:37259 {created_time:"2023-09-12T18:23:37.49381313+00:00", grpc_status:4, grpc_message:"Deadline Exceeded"}"
>
warnings.warn(pytest.PytestUnhandledThreadExceptionWarning(msg))
-- Docs: https://docs.pytest.org/en/stable/how-to/capture-warnings.html
- generated xml file: <https://ci-beam.apache.org/job/beam_PostCommit_XVR_Direct/ws/src/sdks/python/pytest_xlangSqlValidateRunner.xml> -
=========================== short test summary info ============================
FAILED apache_beam/transforms/sql_test.py::SqlTransformTest::test_windowing_before_sql - grpc._channel._MultiThreadedRendezvous: <_MultiThreadedRendezvous of RPC that terminated with:
status = StatusCode.DEADLINE_EXCEEDED
details = "Deadline Exceeded"
debug_error_string = "UNKNOWN:Error received from peer ipv4:127.0.0.1:37259 {created_time:"2023-09-12T18:23:37.493749935+00:00", grpc_status:4, grpc_message:"Deadline Exceeded"}"
>
= 1 failed, 8 passed, 17 skipped, 7163 deselected, 55 warnings in 410.27s (0:06:50) =
> Task :sdks:python:test-suites:direct:xlang:validatesCrossLanguageRunnerPythonUsingSql FAILED
> Task :sdks:python:test-suites:direct:xlang:fnApiJobServerCleanup
Killing process at 2238766
> Task :sdks:python:test-suites:direct:xlang:validatesCrossLanguageRunnerCleanup
Stopping expansion service pid: 2241684.
Stopping expansion service pid: 2241685.
FAILURE: Build failed with an exception.
* What went wrong:
Execution failed for task ':sdks:python:test-suites:direct:xlang:validatesCrossLanguageRunnerPythonUsingSql'.
> Process 'command 'sh'' finished with non-zero exit value 1
* Try:
> Run with --stacktrace option to get the stack trace.
> Run with --info or --debug option to get more log output.
* Get more help at https://help.gradle.org
Deprecated Gradle features were used in this build, making it incompatible with Gradle 8.0.
You can use '--warning-mode all' to show the individual deprecation warnings and determine if they come from your own scripts or plugins.
See https://docs.gradle.org/7.6.2/userguide/command_line_interface.html#sec:command_line_warnings
Execution optimizations have been disabled for 1 invalid unit(s) of work during this build to ensure correctness.
Please consult deprecation warnings for more details.
BUILD FAILED in 28m
171 actionable tasks: 26 executed, 145 up-to-date
Publishing build scan...
https://ge.apache.org/s/a2xa32fndmzzo
Build step 'Invoke Gradle script' changed build result to FAILURE
Build step 'Invoke Gradle script' marked build as failure
---------------------------------------------------------------------
To unsubscribe, e-mail: builds-unsubscribe@beam.apache.org
For additional commands, e-mail: builds-help@beam.apache.org
Jenkins build is back to normal : beam_PostCommit_XVR_Direct #4591
Posted by Apache Jenkins Server <je...@builds.apache.org>.
See <https://ci-beam.apache.org/job/beam_PostCommit_XVR_Direct/4591/display/redirect>
---------------------------------------------------------------------
To unsubscribe, e-mail: builds-unsubscribe@beam.apache.org
For additional commands, e-mail: builds-help@beam.apache.org