You are viewing a plain text version of this content. The canonical link for it is here.
Posted to builds@cassandra.apache.org by Apache Jenkins Server <je...@builds.apache.org> on 2026/08/14 12:12:07 UTC
Build complete: Cassandra-trunk #2561 [UNSTABLE] 3c0affbeebaab34cf11b5c8f571bf5f00ba14e0e
-------------------------------------------------------------------------------
Build Cassandra-trunk #2561 Still unstable
URL: https://ci-cassandra.apache.org/job/Cassandra-trunk/2561/
-------------------------------------------------------------------------------
Changes:
[Stefan Miklosovic] Add blob type support to SAI
-------------------------------------------------------------------------------
Failed Tests:
28 tests failed.
FAILED: dtest-latest.disk_balance_test.TestDiskBalance.Tests / dtest-latest jdk17 45/64 / test_disk_balance_decommission
FAILED: dtest-latest.secondary_indexes_test.TestSecondaryIndexes.Tests / dtest-latest jdk21 64/64 / test_6924_dropping_cf
FAILED: dtest-latest.topology_test.TestTopology.Tests / dtest-latest jdk11 9/64 / test_crash_during_decommission
FAILED: dtest-novnode.pushed_notifications_test.TestPushedNotifications.Tests / dtest-novnode jdk17 56/64 / test_move_single_node_localhost
FAILED: dtest.materialized_views_test.TestMaterializedViews.Tests / dtest jdk11 63/64 / test_drop_with_stopped_build
FAILED: dtest.secondary_indexes_test.TestSecondaryIndexes.Tests / dtest jdk11 63/64 / test_6924_dropping_ks
FAILED: org.apache.cassandra.db.commitlog.BatchCommitLogTest.Tests / test-compression jdk11 16/20 / testBatchCLShutDownImmediately[1]-compression_jdk11_x86_64
FAILED: org.apache.cassandra.db.compaction.UnifiedCompactionStrategyTest.Tests / test-system-keyspace-directory jdk17 15/20 / testDropExpiredSSTables-system_keyspace_directory_jdk17_x86_64
FAILED: org.apache.cassandra.db.virtual.AccordDebugKeyspaceTest.Tests / test-latest jdk11 3/20 / tracing-latest_jdk11_x86_64
FAILED: org.apache.cassandra.distributed.test.ReadRepairTest.Tests / jvm-dtest jdk17 4/16 / readRepairTimeoutTest-_jdk17_x86_64
FAILED: org.apache.cassandra.distributed.test.SinglePartitionReadCommandTest.Tests / jvm-dtest jdk21 12/16 / testNonCompactTableWithOnlyUpdatedColumnOnOneNodeAndColumnDeletionOnTheOther-_jdk21_x86_64
FAILED: org.apache.cassandra.fuzz.topology.HarryOnAccordTopologyMixupTest.Tests / jvm-dtest jdk21 2/16 / test-_jdk21_x86_64
FAILED: org.apache.cassandra.repair.autorepair.AutoRepairParameterizedTest.Tests / test-cdc jdk21 13/20 / testMVRepair[repairType=PREVIEW_REPAIRED]-cassandra.testtag_IS_UNDEFINED
FAILED: org.apache.cassandra.repair.autorepair.AutoRepairParameterizedTest.Tests / test-latest jdk11 13/20 / testRepairTurn[repairType=PREVIEW_REPAIRED]-cassandra.testtag_IS_UNDEFINED
FAILED: org.apache.cassandra.simulator.test.HarrySimulatorTest.Tests / simulator-dtest jdk11 1/2 / test-_jdk11_x86_64
FAILED: org.apache.cassandra.tcm.sequences.ProgressBarrierTest.Tests / test jdk21 12/20 / testProgressBarrier-_jdk21_x86_64
FAILED: org.apache.cassandra.distributed.test.accord.InteropAccordCQLTest.Tests / jvm-dtest jdk11 16/16 / testCASSimulatorLite-_jdk11_x86_64
FAILED: org.apache.cassandra.simulator.test.TrivialSimulationTest.Tests / simulator-dtest jdk11 2/2 / trivialTest-_jdk11_x86_64
FAILED: org.apache.cassandra.distributed.upgrade.ClusterMetadata2iInitializeTest.Tests / jvm-dtest-upgrade jdk11 3/6 / initializeCMSWithConcurrentIndexReadsTest-_jdk11_x86_64
FAILED: org.apache.cassandra.repair.autorepair.AutoRepairParameterizedTest.Tests / test jdk21 13/20 / testRepairMaxRetries[repairType=PREVIEW_REPAIRED]-cassandra.testtag_IS_UNDEFINED
FAILED: org.apache.cassandra.distributed.upgrade.ClusterMetadataUpgradePreparedStatementsTest.Tests / jvm-dtest-upgrade jdk11 4/6 / simpleUpgradeTest-_jdk11_x86_64
FAILED: org.apache.cassandra.simulator.test.EpochStressTest.Tests / simulator-dtest jdk11 2/2 / manyEpochsAndAccordConverges-_jdk11_x86_64
FAILED: org.apache.cassandra.simulator.test.SingleNodeSingleTableASTTest.Tests / simulator-dtest jdk11 1/2 / accordFull-_jdk11_x86_64
FAILED: org.apache.cassandra.simulator.test.SingleNodeSingleTableASTTest.Tests / simulator-dtest jdk11 1/2 / accordMixedReads-_jdk11_x86_64
FAILED: org.apache.cassandra.simulator.test.AccordHarrySimulationTest.Tests / simulator-dtest jdk11 2/2 / test-_jdk11_x86_64
FAILED: org.apache.cassandra.simulator.test.ShortAccordSimulationTest.Tests / simulator-dtest jdk11 1/2 / simulationTest-cassandra.testtag_IS_UNDEFINED
FAILED: org.apache.cassandra.simulator.test.ShortPaxosSimulationTest.Tests / simulator-dtest jdk11 2/2 / selfReconcileTest-cassandra.testtag_IS_UNDEFINED
FAILED: org.apache.cassandra.fuzz.sai.MultiNodeSAITest.Tests / jvm-dtest jdk17 9/16 / indexOnlySaiTest-cassandra.testtag_IS_UNDEFINED
-------------------------------------------------------------------------------
For complete test report and logs see https://nightlies.apache.org/cassandra/Cassandra-trunk/2561/