You are viewing a plain text version of this content. The canonical link for it is here.
Posted to builds@cassandra.apache.org by Apache Jenkins Server <je...@builds.apache.org> on 2024/12/13 06:21:38 UTC

Build complete: Cassandra-5.0 #344 [ABORTED] f9ab5cf797013211c51c4e7d2dbd401300eb44e6

-------------------------------------------------------------------------------
  Build Cassandra-5.0 #344 Aborted
  URL: https://ci-cassandra.apache.org/job/Cassandra-5.0/344/
  -------------------------------------------------------------------------------
  Changes:
  [Marcus Eriksson] Add flag to avoid invalidating key cache on sstable deletions


  -------------------------------------------------------------------------------
  Failed Tests:
  18 tests failed.
FAILED:  dtest-latest.bootstrap_test.TestBootstrap.Tests / dtest-latest jdk17 14/64 / test_killed_wiped_node_cannot_join
FAILED:  dtest-latest.bootstrap_test.TestBootstrap.Tests / dtest-latest jdk17 2/64 / test_read_from_bootstrapped_node
FAILED:  dtest-latest.cqlsh_tests.test_cqlsh_copy.TestCqlshCopy.Tests / dtest-latest jdk17 59/64 / test_bulk_round_trip_blogposts_with_max_connections
FAILED:  dtest-latest.cqlsh_tests.test_cqlsh_copy.TestCqlshCopy.Tests / dtest-latest jdk11 63/64 / test_bulk_round_trip_with_backoff
FAILED:  dtest-latest.disk_balance_test.TestDiskBalance.Tests / dtest-latest jdk11 40/64 / test_disk_balance_after_boundary_change_stcs
FAILED:  dtest-latest.topology_test.TestTopology.Tests / dtest-latest jdk11 63/64 / test_decommissioned_node_cant_rejoin
FAILED:  dtest-novnode.replace_address_test.TestReplaceAddress.Tests / dtest-novnode jdk11 24/64 / test_unsafe_replace
FAILED:  dtest-novnode.topology_test.TestTopology.Tests / dtest-novnode jdk17 15/64 / test_decommissioned_node_cant_rejoin
FAILED:  dtest-upgrade-large.upgrade_tests.upgrade_through_versions_test.TestUpgrade_current_4_0_x_To_indev_5_0_x.Tests / dtest-upgrade-large jdk11 29/32 / test_bootstrap
FAILED:  dtest-upgrade-large.upgrade_tests.upgrade_through_versions_test.TestUpgrade_indev_5_0_x_To_indev_trunk.Tests / dtest-upgrade-large jdk11 29/32 / test_parallel_upgrade
FAILED:  dtest.snitch_test.TestGossipingPropertyFileSnitch.Tests / dtest jdk11 24/64 / test_prefer_local_reconnect_on_listen_address
FAILED:  org.apache.cassandra.db.commitlog.CommitLogSegmentManagerCDCTest.Tests / test-compression jdk11 7/8 / testSegmentFlaggingWithNonblockingOnCreation-compression_jdk11_x86_64
FAILED:  dtest-novnode.bootstrap_test.TestBootstrap.Tests / dtest-novnode jdk11 23/64 / test_simultaneous_bootstrap
FAILED:  org.apache.cassandra.distributed.test.RepairTest.Tests / jvm-dtest jdk17 1/12 / testForcedNormalRepairWithOneNodeDown-_jdk17_x86_64
FAILED:  junit.framework.TestSuite.Tests / jvm-dtest jdk17 2/12 / org.apache.cassandra.distributed.test.CASMultiDCTest-_jdk17_x86_64
FAILED:  junit.framework.TestSuite.Tests / jvm-dtest jdk11 1/12 / org.apache.cassandra.distributed.test.RepairTest-_jdk11_x86_64
FAILED:  org.apache.cassandra.distributed.test.RepairTest.Tests / jvm-dtest jdk11 1/12 / testForcedNormalRepairWithOneNodeDown-_jdk11_x86_64
FAILED:  junit.framework.TestSuite.Tests / jvm-dtest jdk17 1/12 / org.apache.cassandra.distributed.test.RepairTest-_jdk17_x86_64

  -------------------------------------------------------------------------------
  For complete test report and logs see https://nightlies.apache.org/cassandra/Cassandra-5.0/344/