You are viewing a plain text version of this content. The canonical link for it is here.
Posted to dev@sling.apache.org by Apache Jenkins Server <je...@builds.apache.org> on 2014/08/07 14:31:08 UTC
Jenkins build is still unstable: sling-trunk-1.8 #25
See <https://builds.apache.org/job/sling-trunk-1.8/changes>
Jenkins build is still unstable: sling-trunk-1.8 #59
Posted by Apache Jenkins Server <je...@builds.apache.org>.
See <https://builds.apache.org/job/sling-trunk-1.8/changes>
Jenkins build is unstable: sling-trunk-1.8 #58
Posted by Apache Jenkins Server <je...@builds.apache.org>.
See <https://builds.apache.org/job/sling-trunk-1.8/58/changes>
Build failed in Jenkins: sling-trunk-1.8 #57
Posted by Apache Jenkins Server <je...@builds.apache.org>.
See <https://builds.apache.org/job/sling-trunk-1.8/57/changes>
Changes:
[cziegeler] SLING-3859 : ResourceResolver from JcrItemAdapterFactory is not closed
[cziegeler] SLING-3846 : JcrModifiableValueMap: Date object not supported for writing data. Apply patch from Stefan Seifert
[cziegeler] SLING-3864 : Deprecate JcrResource.adaptTo(URL)
[cziegeler] SLING-3866 : Deprecate Node/Property adaptions
------------------------------------------
[...truncated 29701 lines...]
[INFO] Apache Sling System Bundle Extension: Java Transaction API SUCCESS [6.193s]
[INFO] Apache Sling System Bundle Extension: XML APIs .... SUCCESS [9.431s]
[INFO] Apache Sling System Bundle Extension: Activation API SUCCESS [6.451s]
[INFO] Apache Sling System Bundle Extension: WS APIs ..... SUCCESS [6.565s]
[INFO] Apache Sling Dynamic Class Loader Support ......... SUCCESS [27.826s]
[INFO] Apache Sling Commons Java Compiler ................ SUCCESS [14.982s]
[INFO] Apache Sling JSON Library ......................... SUCCESS [17.321s]
[INFO] Apache Sling SLF4J Implementation (Logback) ....... SUCCESS [1:29.171s]
[INFO] Apache Sling OSGi LogService Implementation ....... SUCCESS [8.464s]
[INFO] Apache Sling MIME type mapping support ............ SUCCESS [15.026s]
[INFO] Apache Sling Commons OSGi support ................. SUCCESS [12.362s]
[INFO] Apache Sling Scheduler Support .................... SUCCESS [11.357s]
[INFO] Apache Sling Testing Utilities .................... SUCCESS [37.018s]
[INFO] Apache Sling Thread Dumper ........................ SUCCESS [6.791s]
[INFO] Apache Sling Thread Support ....................... SUCCESS [6.715s]
[INFO] Apache Sling Authentication Service ............... SUCCESS [11.904s]
[INFO] Apache Sling OpenID Authentication ................ SUCCESS [20.351s]
[INFO] Apache Sling Form Based Authentication Handler .... SUCCESS [20.746s]
[INFO] Apache Sling Authentication Selector .............. SUCCESS [9.157s]
[INFO] Apache Sling Engine Implementation ................ SUCCESS [36.232s]
[INFO] Apache Sling Repository API Bundle ................ SUCCESS [5.955s]
[INFO] Apache Sling JCR Base Bundle ...................... SUCCESS [15.492s]
[INFO] Apache Sling JCR ClassLoader ...................... SUCCESS [8.955s]
[INFO] Apache Sling Initial Content Loader ............... SUCCESS [18.211s]
[INFO] Apache Sling Jackrabbit Embedded Repository ....... SUCCESS [20.798s]
[INFO] Apache Sling Jackrabbit UserManager Support ....... SUCCESS [11.435s]
[INFO] Apache Sling Jackrabbit JSR-283 Access Control Manager Support SUCCESS [9.431s]
[INFO] Apache Sling Wrapper Bundle for the JCR API ....... SUCCESS [8.472s]
[INFO] Apache Sling JCR Resource Resolver ................ SUCCESS [1:38.983s]
[INFO] Apache Sling JCR Repository Registration .......... SUCCESS [12.040s]
[INFO] Apache Sling Simple WebDAV Access to repositories . SUCCESS [11.796s]
[INFO] Apache Sling DavEx Access to repositories ......... SUCCESS [14.500s]
[INFO] Apache Sling JCR WebConsole Bundle ................ SUCCESS [11.405s]
[INFO] Apache Sling Oak Repository Server ................ SUCCESS [10.889s]
[INFO] Apache Sling SlingRepository Integration Tests .... SUCCESS [1:29.920s]
[INFO] Apache Sling Servlet Resolver ..................... SUCCESS [17.355s]
[INFO] Apache Sling Default GET Servlets ................. SUCCESS [16.877s]
[INFO] Apache Sling Default POST Servlets ................ SUCCESS [15.468s]
[INFO] Apache Sling Compat Servlets ...................... SUCCESS [11.596s]
[INFO] Apache Sling Scripting Implementation API ......... SUCCESS [6.009s]
[INFO] Apache Sling Scripting Core implementation ........ SUCCESS [49.860s]
[INFO] Apache Sling Scripting JavaScript Support ......... SUCCESS [24.726s]
[INFO] Apache Sling Scripting JSP Support ................ SUCCESS [29.964s]
[INFO] Apache Sling JSP Tag Library ...................... SUCCESS [18.238s]
[INFO] Apache Sling JSP Standard Tag Library ............. SUCCESS [7.112s]
[INFO] Apache Sling Adapter Manager Implementation ....... SUCCESS [9.418s]
[INFO] Apache Sling Bundle Resource Provider ............. SUCCESS [8.796s]
[INFO] Apache Sling Discovery API ........................ SUCCESS [6.412s]
[INFO] Apache Sling Resource-Based Discovery Service ..... SUCCESS [3:29.597s]
[INFO] Apache Sling Discovery Support Bundle ............. SUCCESS [6.212s]
[INFO] Apache Sling Discovery Standalone Implementation .. SUCCESS [6.762s]
[INFO] Apache Sling Event Support ........................ SUCCESS [13:50.069s]
[INFO] Apache Sling Feature Flags ........................ SUCCESS [5.882s]
[INFO] Apache Sling Filesystem Resource Provider ......... SUCCESS [5.890s]
[INFO] Apache Sling javax.activation bundle .............. SUCCESS [4.171s]
[INFO] Apache Sling Service User Mapper .................. SUCCESS [9.431s]
[INFO] Apache Sling Settings ............................. SUCCESS [9.658s]
[INFO] Apache Sling Web Console Branding ................. SUCCESS [3.756s]
[INFO] Apache Sling Web Console Security Provider ........ SUCCESS [6.325s]
[INFO] Apache Sling Groovy Extensions .................... SUCCESS [9.125s]
[INFO] Apache Sling Explorer ............................. SUCCESS [5.637s]
[INFO] Apache Sling Health Check Core .................... SUCCESS [20.047s]
[INFO] Apache Sling Health Check Annotations ............. SUCCESS [6.147s]
[INFO] Apache Sling Health Check Samples ................. SUCCESS [9.348s]
[INFO] Apache Sling Health Check Support Components ...... SUCCESS [8.534s]
[INFO] Apache Sling Health Check Webconsole Plugin ....... SUCCESS [8.172s]
[INFO] Apache Sling Health Check JUnit Bridge ............ SUCCESS [8.759s]
[INFO] Apache Sling Health Check Integration Tests ....... SUCCESS [44.099s]
[INFO] Apache Sling Health Check Reactor POM ............. SUCCESS [5.233s]
[INFO] Apache Sling Resource Access Security ............. SUCCESS [8.519s]
[INFO] Apache Sling Installer ............................ SUCCESS [14.508s]
[INFO] Apache Sling File Installer ....................... SUCCESS [5.957s]
[INFO] Apache Sling Launchpad Content .................... SUCCESS [6.447s]
[INFO] Apache Sling JCR Installer ........................ SUCCESS [2:24.765s]
[INFO] Apache Sling Launchpad Application Builder ........ SUCCESS [56.584s]
[INFO] Apache Sling Resource Access Security Integration Tests FAILURE [1:44.229s]
[INFO] Apache Sling Models API ........................... SKIPPED
[INFO] Apache Sling Models Implementation ................ SKIPPED
[INFO] Apache Sling Models Integration Tests ............. SKIPPED
[INFO] Apache Sling Test Tools ........................... SKIPPED
[INFO] Apache Sling JUnit Core ........................... SKIPPED
[INFO] Apache Sling JUnit Scriptable Tests Provider ...... SKIPPED
[INFO] Apache Sling JUnit Health Checks .................. SKIPPED
[INFO] Apache Sling JUnit Remote Tests Runners ........... SKIPPED
[INFO] Apache Sling JUnit Performance .................... SKIPPED
[INFO] Apache Sling Testing Resource Resolver Mock ....... SKIPPED
[INFO] Apache Sling Pax Exam Utilities ................... SKIPPED
[INFO] Apache Sling Installer WebConsole Plugin .......... SKIPPED
[INFO] Apache Sling Installer Configuration Admin Support SKIPPED
[INFO] Apache Sling Deployment Package Installer ......... SKIPPED
[INFO] Apache Sling Subsystems Installer ................. SKIPPED
[INFO] Apache Sling Installer Integration Tests .......... SKIPPED
[INFO] Apache Sling Launchpad API ........................ SKIPPED
[INFO] Apache Sling Launchpad Base ....................... SKIPPED
[INFO] Apache Sling Launchpad Installer .................. SKIPPED
[INFO] Apache Sling Sample Server-Side Tests ............. SKIPPED
[INFO] Apache Sling Failing Server-Side Tests ............ SKIPPED
[INFO] Apache Sling Sample Integration Tests ............. SKIPPED
[INFO] Apache Sling Launchpad Testing Services ........... SKIPPED
[INFO] Apache Sling Launchpad Testing Services WAR ....... SKIPPED
[INFO] Apache Sling Launchpad Testing Fragment Bundle .... SKIPPED
[INFO] Apache Sling Launchpad Test Bundles ............... SKIPPED
[INFO] Apache Sling Integration Tests .................... SKIPPED
[INFO] Apache Sling Launchpad Testing .................... SKIPPED
[INFO] Apache Sling (Builder) ............................ SKIPPED
[INFO] ------------------------------------------------------------------------
[INFO] BUILD FAILURE
[INFO] ------------------------------------------------------------------------
[INFO] Total time: 50:08.771s
[INFO] Finished at: Mon Aug 25 07:39:59 UTC 2014
[INFO] Final Memory: 144M/318M
[INFO] ------------------------------------------------------------------------
[JENKINS] Archiving disabled
[JENKINS] Archiving disabled
[JENKINS] Archiving disabled
[JENKINS] Archiving disabled
[JENKINS] Archiving disabled
[JENKINS] Archiving disabled
[JENKINS] Archiving disabled
[JENKINS] Archiving disabled
[JENKINS] Archiving disabled
[JENKINS] Archiving disabled
[JENKINS] Archiving disabled
[JENKINS] Archiving disabled
[JENKINS] Archiving disabled
[JENKINS] Archiving disabled
[JENKINS] Archiving disabled
[JENKINS] Archiving disabled
[JENKINS] Archiving disabled
[JENKINS] Archiving disabled
[JENKINS] Archiving disabled
[JENKINS] Archiving disabled
[JENKINS] Archiving disabled
[JENKINS] Archiving disabled
[JENKINS] Archiving disabled
[JENKINS] Archiving disabled
[JENKINS] Archiving disabled
[JENKINS] Archiving disabled
[JENKINS] Archiving disabled
[JENKINS] Archiving disabled
[JENKINS] Archiving disabled
[JENKINS] Archiving disabled
[JENKINS] Archiving disabled
[JENKINS] Archiving disabled
[JENKINS] Archiving disabled
[JENKINS] Archiving disabled
[JENKINS] Archiving disabled
[JENKINS] Archiving disabled
[JENKINS] Archiving disabled
[JENKINS] Archiving disabled
[JENKINS] Archiving disabled
[JENKINS] Archiving disabled
[JENKINS] Archiving disabled
[JENKINS] Archiving disabled
[JENKINS] Archiving disabled
[JENKINS] Archiving disabled
[JENKINS] Archiving disabled
[JENKINS] Archiving disabled
[JENKINS] Archiving disabled
[JENKINS] Archiving disabled
[JENKINS] Archiving disabled
[JENKINS] Archiving disabled
[JENKINS] Archiving disabled
[JENKINS] Archiving disabled
[JENKINS] Archiving disabled
[JENKINS] Archiving disabled
[JENKINS] Archiving disabled
[JENKINS] Archiving disabled
[JENKINS] Archiving disabled
[JENKINS] Archiving disabled
[JENKINS] Archiving disabled
[JENKINS] Archiving disabled
[JENKINS] Archiving disabled
[JENKINS] Archiving disabled
[JENKINS] Archiving disabled
[JENKINS] Archiving disabled
[JENKINS] Archiving disabled
[JENKINS] Archiving disabled
[JENKINS] Archiving disabled
[JENKINS] Archiving disabled
[JENKINS] Archiving disabled
[JENKINS] Archiving disabled
[JENKINS] Archiving disabled
[JENKINS] Archiving disabled
[JENKINS] Archiving disabled
[JENKINS] Archiving disabled
[JENKINS] Archiving disabled
[JENKINS] Archiving disabled
[JENKINS] Archiving disabled
[JENKINS] Archiving disabled
[JENKINS] Archiving disabled
[JENKINS] Archiving disabled
[JENKINS] Archiving disabled
[JENKINS] Archiving disabled
[JENKINS] Archiving disabled
[JENKINS] Archiving disabled
[JENKINS] Archiving disabled
[JENKINS] Archiving disabled
[JENKINS] Archiving disabled
[JENKINS] Archiving disabled
[JENKINS] Archiving disabled
[JENKINS] Archiving disabled
[JENKINS] Archiving disabled
[JENKINS] Archiving disabled
[JENKINS] Archiving disabled
[JENKINS] Archiving disabled
[JENKINS] Archiving disabled
[JENKINS] Archiving disabled
[JENKINS] Archiving disabled
[JENKINS] Archiving disabled
[JENKINS] Archiving disabled
[JENKINS] Archiving disabled
[JENKINS] Archiving disabled
[JENKINS] Archiving disabled
[JENKINS] Archiving disabled
[JENKINS] Archiving disabled
[JENKINS] Archiving disabled
[JENKINS] Archiving disabled
[JENKINS] Archiving disabled
[JENKINS] Archiving disabled
[JENKINS] Archiving disabled
[JENKINS] Archiving disabled
[JENKINS] Archiving disabled
[JENKINS] Archiving disabled
[JENKINS] Archiving disabled
[JENKINS] Archiving disabled
[JENKINS] Archiving disabled
[JENKINS] Archiving disabled
[JENKINS] Archiving disabled
[JENKINS] Archiving disabled
[JENKINS] Archiving disabled
[JENKINS] Archiving disabled
[JENKINS] Archiving disabled
Waiting for Jenkins to finish collecting data[ERROR] Failed to execute goal org.apache.maven.plugins:maven-failsafe-plugin:2.16:integration-test (integration-test) on project org.apache.sling.resourceaccesssecurity.it: Execution integration-test of goal org.apache.maven.plugins:maven-failsafe-plugin:2.16:integration-test failed: The forked VM terminated without saying properly goodbye. VM crash or System.exit called ?
[ERROR] Command was/bin/sh -c cd <https://builds.apache.org/job/sling-trunk-1.8/ws/trunk/bundles/resourceaccesssecurity/it> && /home/jenkins/jenkins-slave/tools/hudson.model.JDK/jdk-1.8.0/jre/bin/java -jar <https://builds.apache.org/job/sling-trunk-1.8/ws/trunk/bundles/resourceaccesssecurity/it/target/surefire/surefirebooter450803687911419081.jar> <https://builds.apache.org/job/sling-trunk-1.8/ws/trunk/bundles/resourceaccesssecurity/it/target/surefire/surefire5682319920994135866tmp> <https://builds.apache.org/job/sling-trunk-1.8/ws/trunk/bundles/resourceaccesssecurity/it/target/surefire/surefire_31137869553387415911tmp>
[ERROR] -> [Help 1]
[ERROR]
[ERROR] To see the full stack trace of the errors, re-run Maven with the -e switch.
[ERROR] Re-run Maven using the -X switch to enable full debug logging.
[ERROR]
[ERROR] For more information about the errors and possible solutions, please read the following articles:
[ERROR] [Help 1] http://cwiki.apache.org/confluence/display/MAVEN/PluginExecutionException
[ERROR]
[ERROR] After correcting the problems, you can resume the build with the command
[ERROR] mvn <goals> -rf :org.apache.sling.resourceaccesssecurity.it
Sending e-mails to: dev@sling.apache.org
Sending e-mails to: dev@sling.apache.org
channel stopped
Jenkins build is still unstable: sling-trunk-1.8 #56
Posted by Apache Jenkins Server <je...@builds.apache.org>.
See <https://builds.apache.org/job/sling-trunk-1.8/changes>
Jenkins build is still unstable: sling-trunk-1.8 #55
Posted by Apache Jenkins Server <je...@builds.apache.org>.
See <https://builds.apache.org/job/sling-trunk-1.8/changes>
Jenkins build is still unstable: sling-trunk-1.8 #54
Posted by Apache Jenkins Server <je...@builds.apache.org>.
See <https://builds.apache.org/job/sling-trunk-1.8/changes>
Jenkins build is still unstable: sling-trunk-1.8 #53
Posted by Apache Jenkins Server <je...@builds.apache.org>.
See <https://builds.apache.org/job/sling-trunk-1.8/changes>
Jenkins build is still unstable: sling-trunk-1.8 #52
Posted by Apache Jenkins Server <je...@builds.apache.org>.
See <https://builds.apache.org/job/sling-trunk-1.8/changes>
Jenkins build is still unstable: sling-trunk-1.8 #51
Posted by Apache Jenkins Server <je...@builds.apache.org>.
See <https://builds.apache.org/job/sling-trunk-1.8/changes>
Jenkins build is still unstable: sling-trunk-1.8 #50
Posted by Apache Jenkins Server <je...@builds.apache.org>.
See <https://builds.apache.org/job/sling-trunk-1.8/changes>
Jenkins build is still unstable: sling-trunk-1.8 #49
Posted by Apache Jenkins Server <je...@builds.apache.org>.
See <https://builds.apache.org/job/sling-trunk-1.8/changes>
Jenkins build is still unstable: sling-trunk-1.8 #48
Posted by Apache Jenkins Server <je...@builds.apache.org>.
See <https://builds.apache.org/job/sling-trunk-1.8/changes>
Jenkins build is still unstable: sling-trunk-1.8 #47
Posted by Apache Jenkins Server <je...@builds.apache.org>.
See <https://builds.apache.org/job/sling-trunk-1.8/changes>
Jenkins build is still unstable: sling-trunk-1.8 #46
Posted by Apache Jenkins Server <je...@builds.apache.org>.
See <https://builds.apache.org/job/sling-trunk-1.8/changes>
Jenkins build is still unstable: sling-trunk-1.8 #45
Posted by Apache Jenkins Server <je...@builds.apache.org>.
See <https://builds.apache.org/job/sling-trunk-1.8/changes>
Jenkins build is unstable: sling-trunk-1.8 #44
Posted by Apache Jenkins Server <je...@builds.apache.org>.
See <https://builds.apache.org/job/sling-trunk-1.8/44/changes>
Build failed in Jenkins: sling-trunk-1.8 #43
Posted by Apache Jenkins Server <je...@builds.apache.org>.
See <https://builds.apache.org/job/sling-trunk-1.8/43/>
------------------------------------------
[...truncated 226 lines...]
at org.tmatesoft.svn.core.internal.util.SVNSocketFactory.createPlainSocket(SVNSocketFactory.java:73)
at org.tmatesoft.svn.core.internal.io.dav.http.HTTPConnection.connect(HTTPConnection.java:280)
at org.tmatesoft.svn.core.internal.io.dav.http.HTTPConnection._request(HTTPConnection.java:451)
... 35 more
ERROR: Subversion update failed
java.io.IOException: remote file operation failed: <https://builds.apache.org/job/sling-trunk-1.8/ws/> at hudson.remoting.Channel@6f0a1dfe:ubuntu-5
at hudson.FilePath.act(FilePath.java:910)
at hudson.FilePath.act(FilePath.java:887)
at hudson.scm.SubversionSCM.checkout(SubversionSCM.java:936)
at hudson.scm.SubversionSCM.checkout(SubversionSCM.java:871)
at hudson.model.AbstractProject.checkout(AbstractProject.java:1414)
at hudson.model.AbstractBuild$AbstractBuildExecution.defaultCheckout(AbstractBuild.java:671)
at jenkins.scm.SCMCheckoutStrategy.checkout(SCMCheckoutStrategy.java:88)
at hudson.model.AbstractBuild$AbstractBuildExecution.run(AbstractBuild.java:580)
at hudson.model.Run.execute(Run.java:1676)
at hudson.maven.MavenModuleSetBuild.run(MavenModuleSetBuild.java:529)
at hudson.model.ResourceController.execute(ResourceController.java:88)
at hudson.model.Executor.run(Executor.java:231)
Caused by: java.io.IOException
at hudson.scm.subversion.UpdateUpdater$TaskImpl.perform(UpdateUpdater.java:211)
at hudson.scm.subversion.WorkspaceUpdater$UpdateTask.delegateTo(WorkspaceUpdater.java:161)
at hudson.scm.SubversionSCM$CheckOutTask.perform(SubversionSCM.java:1030)
at hudson.scm.SubversionSCM$CheckOutTask.invoke(SubversionSCM.java:1011)
at hudson.scm.SubversionSCM$CheckOutTask.invoke(SubversionSCM.java:987)
at hudson.FilePath$FileCallableWrapper.call(FilePath.java:2462)
at hudson.remoting.UserRequest.perform(UserRequest.java:118)
at hudson.remoting.UserRequest.perform(UserRequest.java:48)
at hudson.remoting.Request$2.run(Request.java:328)
at hudson.remoting.InterceptingExecutorService$1.call(InterceptingExecutorService.java:72)
at java.util.concurrent.FutureTask.run(FutureTask.java:262)
at java.util.concurrent.ThreadPoolExecutor.runWorker(ThreadPoolExecutor.java:1145)
at java.util.concurrent.ThreadPoolExecutor$Worker.run(ThreadPoolExecutor.java:615)
at java.lang.Thread.run(Thread.java:745)
Caused by: hudson.scm.subversion.UpdaterException: failed to perform svn update
... 14 more
Caused by: org.tmatesoft.svn.core.SVNException: svn: E175002: OPTIONS /repos/asf/sling/trunk failed
at org.tmatesoft.svn.core.internal.io.dav.http.HTTPConnection.request(HTTPConnection.java:388)
at org.tmatesoft.svn.core.internal.io.dav.http.HTTPConnection.request(HTTPConnection.java:373)
at org.tmatesoft.svn.core.internal.io.dav.http.HTTPConnection.request(HTTPConnection.java:361)
at org.tmatesoft.svn.core.internal.io.dav.DAVConnection.performHttpRequest(DAVConnection.java:707)
at org.tmatesoft.svn.core.internal.io.dav.DAVConnection.exchangeCapabilities(DAVConnection.java:627)
at org.tmatesoft.svn.core.internal.io.dav.DAVConnection.open(DAVConnection.java:102)
at org.tmatesoft.svn.core.internal.io.dav.DAVRepository.openConnection(DAVRepository.java:1020)
at org.tmatesoft.svn.core.internal.io.dav.DAVRepository.getRepositoryUUID(DAVRepository.java:148)
at org.tmatesoft.svn.core.internal.wc16.SVNBasicDelegate.createRepository(SVNBasicDelegate.java:339)
at org.tmatesoft.svn.core.internal.wc16.SVNBasicDelegate.createRepository(SVNBasicDelegate.java:328)
at org.tmatesoft.svn.core.internal.wc16.SVNUpdateClient16.update(SVNUpdateClient16.java:482)
at org.tmatesoft.svn.core.internal.wc16.SVNUpdateClient16.doUpdate(SVNUpdateClient16.java:364)
at org.tmatesoft.svn.core.internal.wc16.SVNUpdateClient16.doUpdate(SVNUpdateClient16.java:274)
at org.tmatesoft.svn.core.internal.wc2.old.SvnOldUpdate.run(SvnOldUpdate.java:27)
at org.tmatesoft.svn.core.internal.wc2.old.SvnOldUpdate.run(SvnOldUpdate.java:11)
at org.tmatesoft.svn.core.internal.wc2.SvnOperationRunner.run(SvnOperationRunner.java:20)
at org.tmatesoft.svn.core.wc2.SvnOperationFactory.run(SvnOperationFactory.java:1238)
at org.tmatesoft.svn.core.wc2.SvnOperation.run(SvnOperation.java:294)
at org.tmatesoft.svn.core.wc.SVNUpdateClient.doUpdate(SVNUpdateClient.java:311)
at org.tmatesoft.svn.core.wc.SVNUpdateClient.doUpdate(SVNUpdateClient.java:291)
at org.tmatesoft.svn.core.wc.SVNUpdateClient.doUpdate(SVNUpdateClient.java:387)
at hudson.scm.subversion.UpdateUpdater$TaskImpl.perform(UpdateUpdater.java:157)
... 13 more
Caused by: svn: E175002: OPTIONS /repos/asf/sling/trunk failed
at org.tmatesoft.svn.core.SVNErrorMessage.create(SVNErrorMessage.java:208)
at org.tmatesoft.svn.core.SVNErrorMessage.create(SVNErrorMessage.java:154)
at org.tmatesoft.svn.core.SVNErrorMessage.create(SVNErrorMessage.java:97)
... 35 more
Caused by: org.tmatesoft.svn.core.SVNException: svn: E175002: OPTIONS request failed on '/repos/asf/sling/trunk'
svn: E175002: timed out waiting for server
at org.tmatesoft.svn.core.internal.wc.SVNErrorManager.error(SVNErrorManager.java:64)
at org.tmatesoft.svn.core.internal.wc.SVNErrorManager.error(SVNErrorManager.java:51)
at org.tmatesoft.svn.core.internal.io.dav.http.HTTPConnection._request(HTTPConnection.java:777)
at org.tmatesoft.svn.core.internal.io.dav.http.HTTPConnection.request(HTTPConnection.java:382)
... 34 more
Caused by: svn: E175002: OPTIONS request failed on '/repos/asf/sling/trunk'
at org.tmatesoft.svn.core.SVNErrorMessage.create(SVNErrorMessage.java:208)
at org.tmatesoft.svn.core.internal.io.dav.http.HTTPConnection._request(HTTPConnection.java:775)
... 35 more
Caused by: svn: E175002: timed out waiting for server
at org.tmatesoft.svn.core.SVNErrorMessage.create(SVNErrorMessage.java:208)
at org.tmatesoft.svn.core.internal.io.dav.http.HTTPConnection._request(HTTPConnection.java:514)
... 35 more
Caused by: java.net.SocketTimeoutException: connect timed out
at java.net.PlainSocketImpl.socketConnect(Native Method)
at java.net.AbstractPlainSocketImpl.doConnect(AbstractPlainSocketImpl.java:339)
at java.net.AbstractPlainSocketImpl.connectToAddress(AbstractPlainSocketImpl.java:200)
at java.net.AbstractPlainSocketImpl.connect(AbstractPlainSocketImpl.java:182)
at java.net.SocksSocketImpl.connect(SocksSocketImpl.java:392)
at java.net.Socket.connect(Socket.java:579)
at org.tmatesoft.svn.core.internal.util.SVNSocketFactory.connect(SVNSocketFactory.java:146)
at org.tmatesoft.svn.core.internal.util.SVNSocketFactory.createPlainSocket(SVNSocketFactory.java:73)
at org.tmatesoft.svn.core.internal.io.dav.http.HTTPConnection.connect(HTTPConnection.java:280)
at org.tmatesoft.svn.core.internal.io.dav.http.HTTPConnection._request(HTTPConnection.java:451)
... 35 more
Retrying after 10 seconds
Updating http://svn.apache.org/repos/asf/sling/trunk at revision '2014-08-19T22:19:03.561 +0000'
ERROR: Failed to update http://svn.apache.org/repos/asf/sling/trunk
org.tmatesoft.svn.core.SVNException: svn: E175002: OPTIONS /repos/asf/sling/trunk failed
at org.tmatesoft.svn.core.internal.io.dav.http.HTTPConnection.request(HTTPConnection.java:388)
at org.tmatesoft.svn.core.internal.io.dav.http.HTTPConnection.request(HTTPConnection.java:373)
at org.tmatesoft.svn.core.internal.io.dav.http.HTTPConnection.request(HTTPConnection.java:361)
at org.tmatesoft.svn.core.internal.io.dav.DAVConnection.performHttpRequest(DAVConnection.java:707)
at org.tmatesoft.svn.core.internal.io.dav.DAVConnection.exchangeCapabilities(DAVConnection.java:627)
at org.tmatesoft.svn.core.internal.io.dav.DAVConnection.open(DAVConnection.java:102)
at org.tmatesoft.svn.core.internal.io.dav.DAVRepository.openConnection(DAVRepository.java:1020)
at org.tmatesoft.svn.core.internal.io.dav.DAVRepository.getRepositoryUUID(DAVRepository.java:148)
at org.tmatesoft.svn.core.internal.wc16.SVNBasicDelegate.createRepository(SVNBasicDelegate.java:339)
at org.tmatesoft.svn.core.internal.wc16.SVNBasicDelegate.createRepository(SVNBasicDelegate.java:328)
at org.tmatesoft.svn.core.internal.wc16.SVNUpdateClient16.update(SVNUpdateClient16.java:482)
at org.tmatesoft.svn.core.internal.wc16.SVNUpdateClient16.doUpdate(SVNUpdateClient16.java:364)
at org.tmatesoft.svn.core.internal.wc16.SVNUpdateClient16.doUpdate(SVNUpdateClient16.java:274)
at org.tmatesoft.svn.core.internal.wc2.old.SvnOldUpdate.run(SvnOldUpdate.java:27)
at org.tmatesoft.svn.core.internal.wc2.old.SvnOldUpdate.run(SvnOldUpdate.java:11)
at org.tmatesoft.svn.core.internal.wc2.SvnOperationRunner.run(SvnOperationRunner.java:20)
at org.tmatesoft.svn.core.wc2.SvnOperationFactory.run(SvnOperationFactory.java:1238)
at org.tmatesoft.svn.core.wc2.SvnOperation.run(SvnOperation.java:294)
at org.tmatesoft.svn.core.wc.SVNUpdateClient.doUpdate(SVNUpdateClient.java:311)
at org.tmatesoft.svn.core.wc.SVNUpdateClient.doUpdate(SVNUpdateClient.java:291)
at org.tmatesoft.svn.core.wc.SVNUpdateClient.doUpdate(SVNUpdateClient.java:387)
at hudson.scm.subversion.UpdateUpdater$TaskImpl.perform(UpdateUpdater.java:157)
at hudson.scm.subversion.WorkspaceUpdater$UpdateTask.delegateTo(WorkspaceUpdater.java:161)
at hudson.scm.SubversionSCM$CheckOutTask.perform(SubversionSCM.java:1030)
at hudson.scm.SubversionSCM$CheckOutTask.invoke(SubversionSCM.java:1011)
at hudson.scm.SubversionSCM$CheckOutTask.invoke(SubversionSCM.java:987)
at hudson.FilePath$FileCallableWrapper.call(FilePath.java:2462)
at hudson.remoting.UserRequest.perform(UserRequest.java:118)
at hudson.remoting.UserRequest.perform(UserRequest.java:48)
at hudson.remoting.Request$2.run(Request.java:328)
at hudson.remoting.InterceptingExecutorService$1.call(InterceptingExecutorService.java:72)
at java.util.concurrent.FutureTask.run(FutureTask.java:262)
at java.util.concurrent.ThreadPoolExecutor.runWorker(ThreadPoolExecutor.java:1145)
at java.util.concurrent.ThreadPoolExecutor$Worker.run(ThreadPoolExecutor.java:615)
at java.lang.Thread.run(Thread.java:745)
Caused by: svn: E175002: OPTIONS /repos/asf/sling/trunk failed
at org.tmatesoft.svn.core.SVNErrorMessage.create(SVNErrorMessage.java:208)
at org.tmatesoft.svn.core.SVNErrorMessage.create(SVNErrorMessage.java:154)
at org.tmatesoft.svn.core.SVNErrorMessage.create(SVNErrorMessage.java:97)
... 35 more
Caused by: org.tmatesoft.svn.core.SVNException: svn: E175002: OPTIONS request failed on '/repos/asf/sling/trunk'
svn: E175002: timed out waiting for server
at org.tmatesoft.svn.core.internal.wc.SVNErrorManager.error(SVNErrorManager.java:64)
at org.tmatesoft.svn.core.internal.wc.SVNErrorManager.error(SVNErrorManager.java:51)
at org.tmatesoft.svn.core.internal.io.dav.http.HTTPConnection._request(HTTPConnection.java:777)
at org.tmatesoft.svn.core.internal.io.dav.http.HTTPConnection.request(HTTPConnection.java:382)
... 34 more
Caused by: svn: E175002: OPTIONS request failed on '/repos/asf/sling/trunk'
at org.tmatesoft.svn.core.SVNErrorMessage.create(SVNErrorMessage.java:208)
at org.tmatesoft.svn.core.internal.io.dav.http.HTTPConnection._request(HTTPConnection.java:775)
... 35 more
Caused by: svn: E175002: timed out waiting for server
at org.tmatesoft.svn.core.SVNErrorMessage.create(SVNErrorMessage.java:208)
at org.tmatesoft.svn.core.internal.io.dav.http.HTTPConnection._request(HTTPConnection.java:514)
... 35 more
Caused by: java.net.SocketTimeoutException: connect timed out
at java.net.PlainSocketImpl.socketConnect(Native Method)
at java.net.AbstractPlainSocketImpl.doConnect(AbstractPlainSocketImpl.java:339)
at java.net.AbstractPlainSocketImpl.connectToAddress(AbstractPlainSocketImpl.java:200)
at java.net.AbstractPlainSocketImpl.connect(AbstractPlainSocketImpl.java:182)
at java.net.SocksSocketImpl.connect(SocksSocketImpl.java:392)
at java.net.Socket.connect(Socket.java:579)
at org.tmatesoft.svn.core.internal.util.SVNSocketFactory.connect(SVNSocketFactory.java:146)
at org.tmatesoft.svn.core.internal.util.SVNSocketFactory.createPlainSocket(SVNSocketFactory.java:73)
at org.tmatesoft.svn.core.internal.io.dav.http.HTTPConnection.connect(HTTPConnection.java:280)
at org.tmatesoft.svn.core.internal.io.dav.http.HTTPConnection._request(HTTPConnection.java:451)
... 35 more
ERROR: Subversion update failed
java.io.IOException: remote file operation failed: <https://builds.apache.org/job/sling-trunk-1.8/ws/> at hudson.remoting.Channel@6f0a1dfe:ubuntu-5
at hudson.FilePath.act(FilePath.java:910)
at hudson.FilePath.act(FilePath.java:887)
at hudson.scm.SubversionSCM.checkout(SubversionSCM.java:936)
at hudson.scm.SubversionSCM.checkout(SubversionSCM.java:871)
at hudson.model.AbstractProject.checkout(AbstractProject.java:1414)
at hudson.model.AbstractBuild$AbstractBuildExecution.defaultCheckout(AbstractBuild.java:671)
at jenkins.scm.SCMCheckoutStrategy.checkout(SCMCheckoutStrategy.java:88)
at hudson.model.AbstractBuild$AbstractBuildExecution.run(AbstractBuild.java:580)
at hudson.model.Run.execute(Run.java:1676)
at hudson.maven.MavenModuleSetBuild.run(MavenModuleSetBuild.java:529)
at hudson.model.ResourceController.execute(ResourceController.java:88)
at hudson.model.Executor.run(Executor.java:231)
Caused by: java.io.IOException
at hudson.scm.subversion.UpdateUpdater$TaskImpl.perform(UpdateUpdater.java:211)
at hudson.scm.subversion.WorkspaceUpdater$UpdateTask.delegateTo(WorkspaceUpdater.java:161)
at hudson.scm.SubversionSCM$CheckOutTask.perform(SubversionSCM.java:1030)
at hudson.scm.SubversionSCM$CheckOutTask.invoke(SubversionSCM.java:1011)
at hudson.scm.SubversionSCM$CheckOutTask.invoke(SubversionSCM.java:987)
at hudson.FilePath$FileCallableWrapper.call(FilePath.java:2462)
at hudson.remoting.UserRequest.perform(UserRequest.java:118)
at hudson.remoting.UserRequest.perform(UserRequest.java:48)
at hudson.remoting.Request$2.run(Request.java:328)
at hudson.remoting.InterceptingExecutorService$1.call(InterceptingExecutorService.java:72)
at java.util.concurrent.FutureTask.run(FutureTask.java:262)
at java.util.concurrent.ThreadPoolExecutor.runWorker(ThreadPoolExecutor.java:1145)
at java.util.concurrent.ThreadPoolExecutor$Worker.run(ThreadPoolExecutor.java:615)
at java.lang.Thread.run(Thread.java:745)
Caused by: hudson.scm.subversion.UpdaterException: failed to perform svn update
... 14 more
Caused by: org.tmatesoft.svn.core.SVNException: svn: E175002: OPTIONS /repos/asf/sling/trunk failed
at org.tmatesoft.svn.core.internal.io.dav.http.HTTPConnection.request(HTTPConnection.java:388)
at org.tmatesoft.svn.core.internal.io.dav.http.HTTPConnection.request(HTTPConnection.java:373)
at org.tmatesoft.svn.core.internal.io.dav.http.HTTPConnection.request(HTTPConnection.java:361)
at org.tmatesoft.svn.core.internal.io.dav.DAVConnection.performHttpRequest(DAVConnection.java:707)
at org.tmatesoft.svn.core.internal.io.dav.DAVConnection.exchangeCapabilities(DAVConnection.java:627)
at org.tmatesoft.svn.core.internal.io.dav.DAVConnection.open(DAVConnection.java:102)
at org.tmatesoft.svn.core.internal.io.dav.DAVRepository.openConnection(DAVRepository.java:1020)
at org.tmatesoft.svn.core.internal.io.dav.DAVRepository.getRepositoryUUID(DAVRepository.java:148)
at org.tmatesoft.svn.core.internal.wc16.SVNBasicDelegate.createRepository(SVNBasicDelegate.java:339)
at org.tmatesoft.svn.core.internal.wc16.SVNBasicDelegate.createRepository(SVNBasicDelegate.java:328)
at org.tmatesoft.svn.core.internal.wc16.SVNUpdateClient16.update(SVNUpdateClient16.java:482)
at org.tmatesoft.svn.core.internal.wc16.SVNUpdateClient16.doUpdate(SVNUpdateClient16.java:364)
at org.tmatesoft.svn.core.internal.wc16.SVNUpdateClient16.doUpdate(SVNUpdateClient16.java:274)
at org.tmatesoft.svn.core.internal.wc2.old.SvnOldUpdate.run(SvnOldUpdate.java:27)
at org.tmatesoft.svn.core.internal.wc2.old.SvnOldUpdate.run(SvnOldUpdate.java:11)
at org.tmatesoft.svn.core.internal.wc2.SvnOperationRunner.run(SvnOperationRunner.java:20)
at org.tmatesoft.svn.core.wc2.SvnOperationFactory.run(SvnOperationFactory.java:1238)
at org.tmatesoft.svn.core.wc2.SvnOperation.run(SvnOperation.java:294)
at org.tmatesoft.svn.core.wc.SVNUpdateClient.doUpdate(SVNUpdateClient.java:311)
at org.tmatesoft.svn.core.wc.SVNUpdateClient.doUpdate(SVNUpdateClient.java:291)
at org.tmatesoft.svn.core.wc.SVNUpdateClient.doUpdate(SVNUpdateClient.java:387)
at hudson.scm.subversion.UpdateUpdater$TaskImpl.perform(UpdateUpdater.java:157)
... 13 more
Caused by: svn: E175002: OPTIONS /repos/asf/sling/trunk failed
at org.tmatesoft.svn.core.SVNErrorMessage.create(SVNErrorMessage.java:208)
at org.tmatesoft.svn.core.SVNErrorMessage.create(SVNErrorMessage.java:154)
at org.tmatesoft.svn.core.SVNErrorMessage.create(SVNErrorMessage.java:97)
... 35 more
Caused by: org.tmatesoft.svn.core.SVNException: svn: E175002: OPTIONS request failed on '/repos/asf/sling/trunk'
svn: E175002: timed out waiting for server
at org.tmatesoft.svn.core.internal.wc.SVNErrorManager.error(SVNErrorManager.java:64)
at org.tmatesoft.svn.core.internal.wc.SVNErrorManager.error(SVNErrorManager.java:51)
at org.tmatesoft.svn.core.internal.io.dav.http.HTTPConnection._request(HTTPConnection.java:777)
at org.tmatesoft.svn.core.internal.io.dav.http.HTTPConnection.request(HTTPConnection.java:382)
... 34 more
Caused by: svn: E175002: OPTIONS request failed on '/repos/asf/sling/trunk'
at org.tmatesoft.svn.core.SVNErrorMessage.create(SVNErrorMessage.java:208)
at org.tmatesoft.svn.core.internal.io.dav.http.HTTPConnection._request(HTTPConnection.java:775)
... 35 more
Caused by: svn: E175002: timed out waiting for server
at org.tmatesoft.svn.core.SVNErrorMessage.create(SVNErrorMessage.java:208)
at org.tmatesoft.svn.core.internal.io.dav.http.HTTPConnection._request(HTTPConnection.java:514)
... 35 more
Caused by: java.net.SocketTimeoutException: connect timed out
at java.net.PlainSocketImpl.socketConnect(Native Method)
at java.net.AbstractPlainSocketImpl.doConnect(AbstractPlainSocketImpl.java:339)
at java.net.AbstractPlainSocketImpl.connectToAddress(AbstractPlainSocketImpl.java:200)
at java.net.AbstractPlainSocketImpl.connect(AbstractPlainSocketImpl.java:182)
at java.net.SocksSocketImpl.connect(SocksSocketImpl.java:392)
at java.net.Socket.connect(Socket.java:579)
at org.tmatesoft.svn.core.internal.util.SVNSocketFactory.connect(SVNSocketFactory.java:146)
at org.tmatesoft.svn.core.internal.util.SVNSocketFactory.createPlainSocket(SVNSocketFactory.java:73)
at org.tmatesoft.svn.core.internal.io.dav.http.HTTPConnection.connect(HTTPConnection.java:280)
at org.tmatesoft.svn.core.internal.io.dav.http.HTTPConnection._request(HTTPConnection.java:451)
... 35 more
Build failed in Jenkins: sling-trunk-1.8 #42
Posted by Apache Jenkins Server <je...@builds.apache.org>.
See <https://builds.apache.org/job/sling-trunk-1.8/42/>
------------------------------------------
[...truncated 226 lines...]
at org.tmatesoft.svn.core.internal.util.SVNSocketFactory.createPlainSocket(SVNSocketFactory.java:73)
at org.tmatesoft.svn.core.internal.io.dav.http.HTTPConnection.connect(HTTPConnection.java:280)
at org.tmatesoft.svn.core.internal.io.dav.http.HTTPConnection._request(HTTPConnection.java:451)
... 35 more
ERROR: Subversion update failed
java.io.IOException: remote file operation failed: <https://builds.apache.org/job/sling-trunk-1.8/ws/> at hudson.remoting.Channel@6f0a1dfe:ubuntu-5
at hudson.FilePath.act(FilePath.java:910)
at hudson.FilePath.act(FilePath.java:887)
at hudson.scm.SubversionSCM.checkout(SubversionSCM.java:936)
at hudson.scm.SubversionSCM.checkout(SubversionSCM.java:871)
at hudson.model.AbstractProject.checkout(AbstractProject.java:1414)
at hudson.model.AbstractBuild$AbstractBuildExecution.defaultCheckout(AbstractBuild.java:671)
at jenkins.scm.SCMCheckoutStrategy.checkout(SCMCheckoutStrategy.java:88)
at hudson.model.AbstractBuild$AbstractBuildExecution.run(AbstractBuild.java:580)
at hudson.model.Run.execute(Run.java:1676)
at hudson.maven.MavenModuleSetBuild.run(MavenModuleSetBuild.java:529)
at hudson.model.ResourceController.execute(ResourceController.java:88)
at hudson.model.Executor.run(Executor.java:231)
Caused by: java.io.IOException
at hudson.scm.subversion.UpdateUpdater$TaskImpl.perform(UpdateUpdater.java:211)
at hudson.scm.subversion.WorkspaceUpdater$UpdateTask.delegateTo(WorkspaceUpdater.java:161)
at hudson.scm.SubversionSCM$CheckOutTask.perform(SubversionSCM.java:1030)
at hudson.scm.SubversionSCM$CheckOutTask.invoke(SubversionSCM.java:1011)
at hudson.scm.SubversionSCM$CheckOutTask.invoke(SubversionSCM.java:987)
at hudson.FilePath$FileCallableWrapper.call(FilePath.java:2462)
at hudson.remoting.UserRequest.perform(UserRequest.java:118)
at hudson.remoting.UserRequest.perform(UserRequest.java:48)
at hudson.remoting.Request$2.run(Request.java:328)
at hudson.remoting.InterceptingExecutorService$1.call(InterceptingExecutorService.java:72)
at java.util.concurrent.FutureTask.run(FutureTask.java:262)
at java.util.concurrent.ThreadPoolExecutor.runWorker(ThreadPoolExecutor.java:1145)
at java.util.concurrent.ThreadPoolExecutor$Worker.run(ThreadPoolExecutor.java:615)
at java.lang.Thread.run(Thread.java:745)
Caused by: hudson.scm.subversion.UpdaterException: failed to perform svn update
... 14 more
Caused by: org.tmatesoft.svn.core.SVNException: svn: E175002: OPTIONS /repos/asf/sling/trunk failed
at org.tmatesoft.svn.core.internal.io.dav.http.HTTPConnection.request(HTTPConnection.java:388)
at org.tmatesoft.svn.core.internal.io.dav.http.HTTPConnection.request(HTTPConnection.java:373)
at org.tmatesoft.svn.core.internal.io.dav.http.HTTPConnection.request(HTTPConnection.java:361)
at org.tmatesoft.svn.core.internal.io.dav.DAVConnection.performHttpRequest(DAVConnection.java:707)
at org.tmatesoft.svn.core.internal.io.dav.DAVConnection.exchangeCapabilities(DAVConnection.java:627)
at org.tmatesoft.svn.core.internal.io.dav.DAVConnection.open(DAVConnection.java:102)
at org.tmatesoft.svn.core.internal.io.dav.DAVRepository.openConnection(DAVRepository.java:1020)
at org.tmatesoft.svn.core.internal.io.dav.DAVRepository.getRepositoryUUID(DAVRepository.java:148)
at org.tmatesoft.svn.core.internal.wc16.SVNBasicDelegate.createRepository(SVNBasicDelegate.java:339)
at org.tmatesoft.svn.core.internal.wc16.SVNBasicDelegate.createRepository(SVNBasicDelegate.java:328)
at org.tmatesoft.svn.core.internal.wc16.SVNUpdateClient16.update(SVNUpdateClient16.java:482)
at org.tmatesoft.svn.core.internal.wc16.SVNUpdateClient16.doUpdate(SVNUpdateClient16.java:364)
at org.tmatesoft.svn.core.internal.wc16.SVNUpdateClient16.doUpdate(SVNUpdateClient16.java:274)
at org.tmatesoft.svn.core.internal.wc2.old.SvnOldUpdate.run(SvnOldUpdate.java:27)
at org.tmatesoft.svn.core.internal.wc2.old.SvnOldUpdate.run(SvnOldUpdate.java:11)
at org.tmatesoft.svn.core.internal.wc2.SvnOperationRunner.run(SvnOperationRunner.java:20)
at org.tmatesoft.svn.core.wc2.SvnOperationFactory.run(SvnOperationFactory.java:1238)
at org.tmatesoft.svn.core.wc2.SvnOperation.run(SvnOperation.java:294)
at org.tmatesoft.svn.core.wc.SVNUpdateClient.doUpdate(SVNUpdateClient.java:311)
at org.tmatesoft.svn.core.wc.SVNUpdateClient.doUpdate(SVNUpdateClient.java:291)
at org.tmatesoft.svn.core.wc.SVNUpdateClient.doUpdate(SVNUpdateClient.java:387)
at hudson.scm.subversion.UpdateUpdater$TaskImpl.perform(UpdateUpdater.java:157)
... 13 more
Caused by: svn: E175002: OPTIONS /repos/asf/sling/trunk failed
at org.tmatesoft.svn.core.SVNErrorMessage.create(SVNErrorMessage.java:208)
at org.tmatesoft.svn.core.SVNErrorMessage.create(SVNErrorMessage.java:154)
at org.tmatesoft.svn.core.SVNErrorMessage.create(SVNErrorMessage.java:97)
... 35 more
Caused by: org.tmatesoft.svn.core.SVNException: svn: E175002: OPTIONS request failed on '/repos/asf/sling/trunk'
svn: E175002: timed out waiting for server
at org.tmatesoft.svn.core.internal.wc.SVNErrorManager.error(SVNErrorManager.java:64)
at org.tmatesoft.svn.core.internal.wc.SVNErrorManager.error(SVNErrorManager.java:51)
at org.tmatesoft.svn.core.internal.io.dav.http.HTTPConnection._request(HTTPConnection.java:777)
at org.tmatesoft.svn.core.internal.io.dav.http.HTTPConnection.request(HTTPConnection.java:382)
... 34 more
Caused by: svn: E175002: OPTIONS request failed on '/repos/asf/sling/trunk'
at org.tmatesoft.svn.core.SVNErrorMessage.create(SVNErrorMessage.java:208)
at org.tmatesoft.svn.core.internal.io.dav.http.HTTPConnection._request(HTTPConnection.java:775)
... 35 more
Caused by: svn: E175002: timed out waiting for server
at org.tmatesoft.svn.core.SVNErrorMessage.create(SVNErrorMessage.java:208)
at org.tmatesoft.svn.core.internal.io.dav.http.HTTPConnection._request(HTTPConnection.java:514)
... 35 more
Caused by: java.net.SocketTimeoutException: connect timed out
at java.net.PlainSocketImpl.socketConnect(Native Method)
at java.net.AbstractPlainSocketImpl.doConnect(AbstractPlainSocketImpl.java:339)
at java.net.AbstractPlainSocketImpl.connectToAddress(AbstractPlainSocketImpl.java:200)
at java.net.AbstractPlainSocketImpl.connect(AbstractPlainSocketImpl.java:182)
at java.net.SocksSocketImpl.connect(SocksSocketImpl.java:392)
at java.net.Socket.connect(Socket.java:579)
at org.tmatesoft.svn.core.internal.util.SVNSocketFactory.connect(SVNSocketFactory.java:146)
at org.tmatesoft.svn.core.internal.util.SVNSocketFactory.createPlainSocket(SVNSocketFactory.java:73)
at org.tmatesoft.svn.core.internal.io.dav.http.HTTPConnection.connect(HTTPConnection.java:280)
at org.tmatesoft.svn.core.internal.io.dav.http.HTTPConnection._request(HTTPConnection.java:451)
... 35 more
Retrying after 10 seconds
Updating http://svn.apache.org/repos/asf/sling/trunk at revision '2014-08-18T23:20:46.317 +0000'
ERROR: Failed to update http://svn.apache.org/repos/asf/sling/trunk
org.tmatesoft.svn.core.SVNException: svn: E175002: OPTIONS /repos/asf/sling/trunk failed
at org.tmatesoft.svn.core.internal.io.dav.http.HTTPConnection.request(HTTPConnection.java:388)
at org.tmatesoft.svn.core.internal.io.dav.http.HTTPConnection.request(HTTPConnection.java:373)
at org.tmatesoft.svn.core.internal.io.dav.http.HTTPConnection.request(HTTPConnection.java:361)
at org.tmatesoft.svn.core.internal.io.dav.DAVConnection.performHttpRequest(DAVConnection.java:707)
at org.tmatesoft.svn.core.internal.io.dav.DAVConnection.exchangeCapabilities(DAVConnection.java:627)
at org.tmatesoft.svn.core.internal.io.dav.DAVConnection.open(DAVConnection.java:102)
at org.tmatesoft.svn.core.internal.io.dav.DAVRepository.openConnection(DAVRepository.java:1020)
at org.tmatesoft.svn.core.internal.io.dav.DAVRepository.getRepositoryUUID(DAVRepository.java:148)
at org.tmatesoft.svn.core.internal.wc16.SVNBasicDelegate.createRepository(SVNBasicDelegate.java:339)
at org.tmatesoft.svn.core.internal.wc16.SVNBasicDelegate.createRepository(SVNBasicDelegate.java:328)
at org.tmatesoft.svn.core.internal.wc16.SVNUpdateClient16.update(SVNUpdateClient16.java:482)
at org.tmatesoft.svn.core.internal.wc16.SVNUpdateClient16.doUpdate(SVNUpdateClient16.java:364)
at org.tmatesoft.svn.core.internal.wc16.SVNUpdateClient16.doUpdate(SVNUpdateClient16.java:274)
at org.tmatesoft.svn.core.internal.wc2.old.SvnOldUpdate.run(SvnOldUpdate.java:27)
at org.tmatesoft.svn.core.internal.wc2.old.SvnOldUpdate.run(SvnOldUpdate.java:11)
at org.tmatesoft.svn.core.internal.wc2.SvnOperationRunner.run(SvnOperationRunner.java:20)
at org.tmatesoft.svn.core.wc2.SvnOperationFactory.run(SvnOperationFactory.java:1238)
at org.tmatesoft.svn.core.wc2.SvnOperation.run(SvnOperation.java:294)
at org.tmatesoft.svn.core.wc.SVNUpdateClient.doUpdate(SVNUpdateClient.java:311)
at org.tmatesoft.svn.core.wc.SVNUpdateClient.doUpdate(SVNUpdateClient.java:291)
at org.tmatesoft.svn.core.wc.SVNUpdateClient.doUpdate(SVNUpdateClient.java:387)
at hudson.scm.subversion.UpdateUpdater$TaskImpl.perform(UpdateUpdater.java:157)
at hudson.scm.subversion.WorkspaceUpdater$UpdateTask.delegateTo(WorkspaceUpdater.java:161)
at hudson.scm.SubversionSCM$CheckOutTask.perform(SubversionSCM.java:1030)
at hudson.scm.SubversionSCM$CheckOutTask.invoke(SubversionSCM.java:1011)
at hudson.scm.SubversionSCM$CheckOutTask.invoke(SubversionSCM.java:987)
at hudson.FilePath$FileCallableWrapper.call(FilePath.java:2462)
at hudson.remoting.UserRequest.perform(UserRequest.java:118)
at hudson.remoting.UserRequest.perform(UserRequest.java:48)
at hudson.remoting.Request$2.run(Request.java:328)
at hudson.remoting.InterceptingExecutorService$1.call(InterceptingExecutorService.java:72)
at java.util.concurrent.FutureTask.run(FutureTask.java:262)
at java.util.concurrent.ThreadPoolExecutor.runWorker(ThreadPoolExecutor.java:1145)
at java.util.concurrent.ThreadPoolExecutor$Worker.run(ThreadPoolExecutor.java:615)
at java.lang.Thread.run(Thread.java:745)
Caused by: svn: E175002: OPTIONS /repos/asf/sling/trunk failed
at org.tmatesoft.svn.core.SVNErrorMessage.create(SVNErrorMessage.java:208)
at org.tmatesoft.svn.core.SVNErrorMessage.create(SVNErrorMessage.java:154)
at org.tmatesoft.svn.core.SVNErrorMessage.create(SVNErrorMessage.java:97)
... 35 more
Caused by: org.tmatesoft.svn.core.SVNException: svn: E175002: OPTIONS request failed on '/repos/asf/sling/trunk'
svn: E175002: timed out waiting for server
at org.tmatesoft.svn.core.internal.wc.SVNErrorManager.error(SVNErrorManager.java:64)
at org.tmatesoft.svn.core.internal.wc.SVNErrorManager.error(SVNErrorManager.java:51)
at org.tmatesoft.svn.core.internal.io.dav.http.HTTPConnection._request(HTTPConnection.java:777)
at org.tmatesoft.svn.core.internal.io.dav.http.HTTPConnection.request(HTTPConnection.java:382)
... 34 more
Caused by: svn: E175002: OPTIONS request failed on '/repos/asf/sling/trunk'
at org.tmatesoft.svn.core.SVNErrorMessage.create(SVNErrorMessage.java:208)
at org.tmatesoft.svn.core.internal.io.dav.http.HTTPConnection._request(HTTPConnection.java:775)
... 35 more
Caused by: svn: E175002: timed out waiting for server
at org.tmatesoft.svn.core.SVNErrorMessage.create(SVNErrorMessage.java:208)
at org.tmatesoft.svn.core.internal.io.dav.http.HTTPConnection._request(HTTPConnection.java:514)
... 35 more
Caused by: java.net.SocketTimeoutException: connect timed out
at java.net.PlainSocketImpl.socketConnect(Native Method)
at java.net.AbstractPlainSocketImpl.doConnect(AbstractPlainSocketImpl.java:339)
at java.net.AbstractPlainSocketImpl.connectToAddress(AbstractPlainSocketImpl.java:200)
at java.net.AbstractPlainSocketImpl.connect(AbstractPlainSocketImpl.java:182)
at java.net.SocksSocketImpl.connect(SocksSocketImpl.java:392)
at java.net.Socket.connect(Socket.java:579)
at org.tmatesoft.svn.core.internal.util.SVNSocketFactory.connect(SVNSocketFactory.java:146)
at org.tmatesoft.svn.core.internal.util.SVNSocketFactory.createPlainSocket(SVNSocketFactory.java:73)
at org.tmatesoft.svn.core.internal.io.dav.http.HTTPConnection.connect(HTTPConnection.java:280)
at org.tmatesoft.svn.core.internal.io.dav.http.HTTPConnection._request(HTTPConnection.java:451)
... 35 more
ERROR: Subversion update failed
java.io.IOException: remote file operation failed: <https://builds.apache.org/job/sling-trunk-1.8/ws/> at hudson.remoting.Channel@6f0a1dfe:ubuntu-5
at hudson.FilePath.act(FilePath.java:910)
at hudson.FilePath.act(FilePath.java:887)
at hudson.scm.SubversionSCM.checkout(SubversionSCM.java:936)
at hudson.scm.SubversionSCM.checkout(SubversionSCM.java:871)
at hudson.model.AbstractProject.checkout(AbstractProject.java:1414)
at hudson.model.AbstractBuild$AbstractBuildExecution.defaultCheckout(AbstractBuild.java:671)
at jenkins.scm.SCMCheckoutStrategy.checkout(SCMCheckoutStrategy.java:88)
at hudson.model.AbstractBuild$AbstractBuildExecution.run(AbstractBuild.java:580)
at hudson.model.Run.execute(Run.java:1676)
at hudson.maven.MavenModuleSetBuild.run(MavenModuleSetBuild.java:529)
at hudson.model.ResourceController.execute(ResourceController.java:88)
at hudson.model.Executor.run(Executor.java:231)
Caused by: java.io.IOException
at hudson.scm.subversion.UpdateUpdater$TaskImpl.perform(UpdateUpdater.java:211)
at hudson.scm.subversion.WorkspaceUpdater$UpdateTask.delegateTo(WorkspaceUpdater.java:161)
at hudson.scm.SubversionSCM$CheckOutTask.perform(SubversionSCM.java:1030)
at hudson.scm.SubversionSCM$CheckOutTask.invoke(SubversionSCM.java:1011)
at hudson.scm.SubversionSCM$CheckOutTask.invoke(SubversionSCM.java:987)
at hudson.FilePath$FileCallableWrapper.call(FilePath.java:2462)
at hudson.remoting.UserRequest.perform(UserRequest.java:118)
at hudson.remoting.UserRequest.perform(UserRequest.java:48)
at hudson.remoting.Request$2.run(Request.java:328)
at hudson.remoting.InterceptingExecutorService$1.call(InterceptingExecutorService.java:72)
at java.util.concurrent.FutureTask.run(FutureTask.java:262)
at java.util.concurrent.ThreadPoolExecutor.runWorker(ThreadPoolExecutor.java:1145)
at java.util.concurrent.ThreadPoolExecutor$Worker.run(ThreadPoolExecutor.java:615)
at java.lang.Thread.run(Thread.java:745)
Caused by: hudson.scm.subversion.UpdaterException: failed to perform svn update
... 14 more
Caused by: org.tmatesoft.svn.core.SVNException: svn: E175002: OPTIONS /repos/asf/sling/trunk failed
at org.tmatesoft.svn.core.internal.io.dav.http.HTTPConnection.request(HTTPConnection.java:388)
at org.tmatesoft.svn.core.internal.io.dav.http.HTTPConnection.request(HTTPConnection.java:373)
at org.tmatesoft.svn.core.internal.io.dav.http.HTTPConnection.request(HTTPConnection.java:361)
at org.tmatesoft.svn.core.internal.io.dav.DAVConnection.performHttpRequest(DAVConnection.java:707)
at org.tmatesoft.svn.core.internal.io.dav.DAVConnection.exchangeCapabilities(DAVConnection.java:627)
at org.tmatesoft.svn.core.internal.io.dav.DAVConnection.open(DAVConnection.java:102)
at org.tmatesoft.svn.core.internal.io.dav.DAVRepository.openConnection(DAVRepository.java:1020)
at org.tmatesoft.svn.core.internal.io.dav.DAVRepository.getRepositoryUUID(DAVRepository.java:148)
at org.tmatesoft.svn.core.internal.wc16.SVNBasicDelegate.createRepository(SVNBasicDelegate.java:339)
at org.tmatesoft.svn.core.internal.wc16.SVNBasicDelegate.createRepository(SVNBasicDelegate.java:328)
at org.tmatesoft.svn.core.internal.wc16.SVNUpdateClient16.update(SVNUpdateClient16.java:482)
at org.tmatesoft.svn.core.internal.wc16.SVNUpdateClient16.doUpdate(SVNUpdateClient16.java:364)
at org.tmatesoft.svn.core.internal.wc16.SVNUpdateClient16.doUpdate(SVNUpdateClient16.java:274)
at org.tmatesoft.svn.core.internal.wc2.old.SvnOldUpdate.run(SvnOldUpdate.java:27)
at org.tmatesoft.svn.core.internal.wc2.old.SvnOldUpdate.run(SvnOldUpdate.java:11)
at org.tmatesoft.svn.core.internal.wc2.SvnOperationRunner.run(SvnOperationRunner.java:20)
at org.tmatesoft.svn.core.wc2.SvnOperationFactory.run(SvnOperationFactory.java:1238)
at org.tmatesoft.svn.core.wc2.SvnOperation.run(SvnOperation.java:294)
at org.tmatesoft.svn.core.wc.SVNUpdateClient.doUpdate(SVNUpdateClient.java:311)
at org.tmatesoft.svn.core.wc.SVNUpdateClient.doUpdate(SVNUpdateClient.java:291)
at org.tmatesoft.svn.core.wc.SVNUpdateClient.doUpdate(SVNUpdateClient.java:387)
at hudson.scm.subversion.UpdateUpdater$TaskImpl.perform(UpdateUpdater.java:157)
... 13 more
Caused by: svn: E175002: OPTIONS /repos/asf/sling/trunk failed
at org.tmatesoft.svn.core.SVNErrorMessage.create(SVNErrorMessage.java:208)
at org.tmatesoft.svn.core.SVNErrorMessage.create(SVNErrorMessage.java:154)
at org.tmatesoft.svn.core.SVNErrorMessage.create(SVNErrorMessage.java:97)
... 35 more
Caused by: org.tmatesoft.svn.core.SVNException: svn: E175002: OPTIONS request failed on '/repos/asf/sling/trunk'
svn: E175002: timed out waiting for server
at org.tmatesoft.svn.core.internal.wc.SVNErrorManager.error(SVNErrorManager.java:64)
at org.tmatesoft.svn.core.internal.wc.SVNErrorManager.error(SVNErrorManager.java:51)
at org.tmatesoft.svn.core.internal.io.dav.http.HTTPConnection._request(HTTPConnection.java:777)
at org.tmatesoft.svn.core.internal.io.dav.http.HTTPConnection.request(HTTPConnection.java:382)
... 34 more
Caused by: svn: E175002: OPTIONS request failed on '/repos/asf/sling/trunk'
at org.tmatesoft.svn.core.SVNErrorMessage.create(SVNErrorMessage.java:208)
at org.tmatesoft.svn.core.internal.io.dav.http.HTTPConnection._request(HTTPConnection.java:775)
... 35 more
Caused by: svn: E175002: timed out waiting for server
at org.tmatesoft.svn.core.SVNErrorMessage.create(SVNErrorMessage.java:208)
at org.tmatesoft.svn.core.internal.io.dav.http.HTTPConnection._request(HTTPConnection.java:514)
... 35 more
Caused by: java.net.SocketTimeoutException: connect timed out
at java.net.PlainSocketImpl.socketConnect(Native Method)
at java.net.AbstractPlainSocketImpl.doConnect(AbstractPlainSocketImpl.java:339)
at java.net.AbstractPlainSocketImpl.connectToAddress(AbstractPlainSocketImpl.java:200)
at java.net.AbstractPlainSocketImpl.connect(AbstractPlainSocketImpl.java:182)
at java.net.SocksSocketImpl.connect(SocksSocketImpl.java:392)
at java.net.Socket.connect(Socket.java:579)
at org.tmatesoft.svn.core.internal.util.SVNSocketFactory.connect(SVNSocketFactory.java:146)
at org.tmatesoft.svn.core.internal.util.SVNSocketFactory.createPlainSocket(SVNSocketFactory.java:73)
at org.tmatesoft.svn.core.internal.io.dav.http.HTTPConnection.connect(HTTPConnection.java:280)
at org.tmatesoft.svn.core.internal.io.dav.http.HTTPConnection._request(HTTPConnection.java:451)
... 35 more
Jenkins build is still unstable: sling-trunk-1.8 #41
Posted by Apache Jenkins Server <je...@builds.apache.org>.
See <https://builds.apache.org/job/sling-trunk-1.8/changes>
Jenkins build is unstable: sling-trunk-1.8 #40
Posted by Apache Jenkins Server <je...@builds.apache.org>.
See <https://builds.apache.org/job/sling-trunk-1.8/40/changes>
Build failed in Jenkins: sling-trunk-1.8 #39
Posted by Apache Jenkins Server <je...@builds.apache.org>.
See <https://builds.apache.org/job/sling-trunk-1.8/39/>
------------------------------------------
[...truncated 226 lines...]
at org.tmatesoft.svn.core.internal.util.SVNSocketFactory.createPlainSocket(SVNSocketFactory.java:73)
at org.tmatesoft.svn.core.internal.io.dav.http.HTTPConnection.connect(HTTPConnection.java:280)
at org.tmatesoft.svn.core.internal.io.dav.http.HTTPConnection._request(HTTPConnection.java:451)
... 35 more
ERROR: Subversion update failed
java.io.IOException: remote file operation failed: <https://builds.apache.org/job/sling-trunk-1.8/ws/> at hudson.remoting.Channel@5f3bccdb:ubuntu-5
at hudson.FilePath.act(FilePath.java:910)
at hudson.FilePath.act(FilePath.java:887)
at hudson.scm.SubversionSCM.checkout(SubversionSCM.java:936)
at hudson.scm.SubversionSCM.checkout(SubversionSCM.java:871)
at hudson.model.AbstractProject.checkout(AbstractProject.java:1414)
at hudson.model.AbstractBuild$AbstractBuildExecution.defaultCheckout(AbstractBuild.java:671)
at jenkins.scm.SCMCheckoutStrategy.checkout(SCMCheckoutStrategy.java:88)
at hudson.model.AbstractBuild$AbstractBuildExecution.run(AbstractBuild.java:580)
at hudson.model.Run.execute(Run.java:1676)
at hudson.maven.MavenModuleSetBuild.run(MavenModuleSetBuild.java:529)
at hudson.model.ResourceController.execute(ResourceController.java:88)
at hudson.model.Executor.run(Executor.java:231)
Caused by: java.io.IOException
at hudson.scm.subversion.UpdateUpdater$TaskImpl.perform(UpdateUpdater.java:211)
at hudson.scm.subversion.WorkspaceUpdater$UpdateTask.delegateTo(WorkspaceUpdater.java:161)
at hudson.scm.SubversionSCM$CheckOutTask.perform(SubversionSCM.java:1030)
at hudson.scm.SubversionSCM$CheckOutTask.invoke(SubversionSCM.java:1011)
at hudson.scm.SubversionSCM$CheckOutTask.invoke(SubversionSCM.java:987)
at hudson.FilePath$FileCallableWrapper.call(FilePath.java:2462)
at hudson.remoting.UserRequest.perform(UserRequest.java:118)
at hudson.remoting.UserRequest.perform(UserRequest.java:48)
at hudson.remoting.Request$2.run(Request.java:328)
at hudson.remoting.InterceptingExecutorService$1.call(InterceptingExecutorService.java:72)
at java.util.concurrent.FutureTask.run(FutureTask.java:262)
at java.util.concurrent.ThreadPoolExecutor.runWorker(ThreadPoolExecutor.java:1145)
at java.util.concurrent.ThreadPoolExecutor$Worker.run(ThreadPoolExecutor.java:615)
at java.lang.Thread.run(Thread.java:745)
Caused by: hudson.scm.subversion.UpdaterException: failed to perform svn update
... 14 more
Caused by: org.tmatesoft.svn.core.SVNException: svn: E175002: OPTIONS /repos/asf/sling/trunk failed
at org.tmatesoft.svn.core.internal.io.dav.http.HTTPConnection.request(HTTPConnection.java:388)
at org.tmatesoft.svn.core.internal.io.dav.http.HTTPConnection.request(HTTPConnection.java:373)
at org.tmatesoft.svn.core.internal.io.dav.http.HTTPConnection.request(HTTPConnection.java:361)
at org.tmatesoft.svn.core.internal.io.dav.DAVConnection.performHttpRequest(DAVConnection.java:707)
at org.tmatesoft.svn.core.internal.io.dav.DAVConnection.exchangeCapabilities(DAVConnection.java:627)
at org.tmatesoft.svn.core.internal.io.dav.DAVConnection.open(DAVConnection.java:102)
at org.tmatesoft.svn.core.internal.io.dav.DAVRepository.openConnection(DAVRepository.java:1020)
at org.tmatesoft.svn.core.internal.io.dav.DAVRepository.getRepositoryUUID(DAVRepository.java:148)
at org.tmatesoft.svn.core.internal.wc16.SVNBasicDelegate.createRepository(SVNBasicDelegate.java:339)
at org.tmatesoft.svn.core.internal.wc16.SVNBasicDelegate.createRepository(SVNBasicDelegate.java:328)
at org.tmatesoft.svn.core.internal.wc16.SVNUpdateClient16.update(SVNUpdateClient16.java:482)
at org.tmatesoft.svn.core.internal.wc16.SVNUpdateClient16.doUpdate(SVNUpdateClient16.java:364)
at org.tmatesoft.svn.core.internal.wc16.SVNUpdateClient16.doUpdate(SVNUpdateClient16.java:274)
at org.tmatesoft.svn.core.internal.wc2.old.SvnOldUpdate.run(SvnOldUpdate.java:27)
at org.tmatesoft.svn.core.internal.wc2.old.SvnOldUpdate.run(SvnOldUpdate.java:11)
at org.tmatesoft.svn.core.internal.wc2.SvnOperationRunner.run(SvnOperationRunner.java:20)
at org.tmatesoft.svn.core.wc2.SvnOperationFactory.run(SvnOperationFactory.java:1238)
at org.tmatesoft.svn.core.wc2.SvnOperation.run(SvnOperation.java:294)
at org.tmatesoft.svn.core.wc.SVNUpdateClient.doUpdate(SVNUpdateClient.java:311)
at org.tmatesoft.svn.core.wc.SVNUpdateClient.doUpdate(SVNUpdateClient.java:291)
at org.tmatesoft.svn.core.wc.SVNUpdateClient.doUpdate(SVNUpdateClient.java:387)
at hudson.scm.subversion.UpdateUpdater$TaskImpl.perform(UpdateUpdater.java:157)
... 13 more
Caused by: svn: E175002: OPTIONS /repos/asf/sling/trunk failed
at org.tmatesoft.svn.core.SVNErrorMessage.create(SVNErrorMessage.java:208)
at org.tmatesoft.svn.core.SVNErrorMessage.create(SVNErrorMessage.java:154)
at org.tmatesoft.svn.core.SVNErrorMessage.create(SVNErrorMessage.java:97)
... 35 more
Caused by: org.tmatesoft.svn.core.SVNException: svn: E175002: OPTIONS request failed on '/repos/asf/sling/trunk'
svn: E175002: timed out waiting for server
at org.tmatesoft.svn.core.internal.wc.SVNErrorManager.error(SVNErrorManager.java:64)
at org.tmatesoft.svn.core.internal.wc.SVNErrorManager.error(SVNErrorManager.java:51)
at org.tmatesoft.svn.core.internal.io.dav.http.HTTPConnection._request(HTTPConnection.java:777)
at org.tmatesoft.svn.core.internal.io.dav.http.HTTPConnection.request(HTTPConnection.java:382)
... 34 more
Caused by: svn: E175002: OPTIONS request failed on '/repos/asf/sling/trunk'
at org.tmatesoft.svn.core.SVNErrorMessage.create(SVNErrorMessage.java:208)
at org.tmatesoft.svn.core.internal.io.dav.http.HTTPConnection._request(HTTPConnection.java:775)
... 35 more
Caused by: svn: E175002: timed out waiting for server
at org.tmatesoft.svn.core.SVNErrorMessage.create(SVNErrorMessage.java:208)
at org.tmatesoft.svn.core.internal.io.dav.http.HTTPConnection._request(HTTPConnection.java:514)
... 35 more
Caused by: java.net.SocketTimeoutException: connect timed out
at java.net.PlainSocketImpl.socketConnect(Native Method)
at java.net.AbstractPlainSocketImpl.doConnect(AbstractPlainSocketImpl.java:339)
at java.net.AbstractPlainSocketImpl.connectToAddress(AbstractPlainSocketImpl.java:200)
at java.net.AbstractPlainSocketImpl.connect(AbstractPlainSocketImpl.java:182)
at java.net.SocksSocketImpl.connect(SocksSocketImpl.java:392)
at java.net.Socket.connect(Socket.java:579)
at org.tmatesoft.svn.core.internal.util.SVNSocketFactory.connect(SVNSocketFactory.java:146)
at org.tmatesoft.svn.core.internal.util.SVNSocketFactory.createPlainSocket(SVNSocketFactory.java:73)
at org.tmatesoft.svn.core.internal.io.dav.http.HTTPConnection.connect(HTTPConnection.java:280)
at org.tmatesoft.svn.core.internal.io.dav.http.HTTPConnection._request(HTTPConnection.java:451)
... 35 more
Retrying after 10 seconds
Updating http://svn.apache.org/repos/asf/sling/trunk at revision '2014-08-15T12:47:50.885 +0000'
ERROR: Failed to update http://svn.apache.org/repos/asf/sling/trunk
org.tmatesoft.svn.core.SVNException: svn: E175002: OPTIONS /repos/asf/sling/trunk failed
at org.tmatesoft.svn.core.internal.io.dav.http.HTTPConnection.request(HTTPConnection.java:388)
at org.tmatesoft.svn.core.internal.io.dav.http.HTTPConnection.request(HTTPConnection.java:373)
at org.tmatesoft.svn.core.internal.io.dav.http.HTTPConnection.request(HTTPConnection.java:361)
at org.tmatesoft.svn.core.internal.io.dav.DAVConnection.performHttpRequest(DAVConnection.java:707)
at org.tmatesoft.svn.core.internal.io.dav.DAVConnection.exchangeCapabilities(DAVConnection.java:627)
at org.tmatesoft.svn.core.internal.io.dav.DAVConnection.open(DAVConnection.java:102)
at org.tmatesoft.svn.core.internal.io.dav.DAVRepository.openConnection(DAVRepository.java:1020)
at org.tmatesoft.svn.core.internal.io.dav.DAVRepository.getRepositoryUUID(DAVRepository.java:148)
at org.tmatesoft.svn.core.internal.wc16.SVNBasicDelegate.createRepository(SVNBasicDelegate.java:339)
at org.tmatesoft.svn.core.internal.wc16.SVNBasicDelegate.createRepository(SVNBasicDelegate.java:328)
at org.tmatesoft.svn.core.internal.wc16.SVNUpdateClient16.update(SVNUpdateClient16.java:482)
at org.tmatesoft.svn.core.internal.wc16.SVNUpdateClient16.doUpdate(SVNUpdateClient16.java:364)
at org.tmatesoft.svn.core.internal.wc16.SVNUpdateClient16.doUpdate(SVNUpdateClient16.java:274)
at org.tmatesoft.svn.core.internal.wc2.old.SvnOldUpdate.run(SvnOldUpdate.java:27)
at org.tmatesoft.svn.core.internal.wc2.old.SvnOldUpdate.run(SvnOldUpdate.java:11)
at org.tmatesoft.svn.core.internal.wc2.SvnOperationRunner.run(SvnOperationRunner.java:20)
at org.tmatesoft.svn.core.wc2.SvnOperationFactory.run(SvnOperationFactory.java:1238)
at org.tmatesoft.svn.core.wc2.SvnOperation.run(SvnOperation.java:294)
at org.tmatesoft.svn.core.wc.SVNUpdateClient.doUpdate(SVNUpdateClient.java:311)
at org.tmatesoft.svn.core.wc.SVNUpdateClient.doUpdate(SVNUpdateClient.java:291)
at org.tmatesoft.svn.core.wc.SVNUpdateClient.doUpdate(SVNUpdateClient.java:387)
at hudson.scm.subversion.UpdateUpdater$TaskImpl.perform(UpdateUpdater.java:157)
at hudson.scm.subversion.WorkspaceUpdater$UpdateTask.delegateTo(WorkspaceUpdater.java:161)
at hudson.scm.SubversionSCM$CheckOutTask.perform(SubversionSCM.java:1030)
at hudson.scm.SubversionSCM$CheckOutTask.invoke(SubversionSCM.java:1011)
at hudson.scm.SubversionSCM$CheckOutTask.invoke(SubversionSCM.java:987)
at hudson.FilePath$FileCallableWrapper.call(FilePath.java:2462)
at hudson.remoting.UserRequest.perform(UserRequest.java:118)
at hudson.remoting.UserRequest.perform(UserRequest.java:48)
at hudson.remoting.Request$2.run(Request.java:328)
at hudson.remoting.InterceptingExecutorService$1.call(InterceptingExecutorService.java:72)
at java.util.concurrent.FutureTask.run(FutureTask.java:262)
at java.util.concurrent.ThreadPoolExecutor.runWorker(ThreadPoolExecutor.java:1145)
at java.util.concurrent.ThreadPoolExecutor$Worker.run(ThreadPoolExecutor.java:615)
at java.lang.Thread.run(Thread.java:745)
Caused by: svn: E175002: OPTIONS /repos/asf/sling/trunk failed
at org.tmatesoft.svn.core.SVNErrorMessage.create(SVNErrorMessage.java:208)
at org.tmatesoft.svn.core.SVNErrorMessage.create(SVNErrorMessage.java:154)
at org.tmatesoft.svn.core.SVNErrorMessage.create(SVNErrorMessage.java:97)
... 35 more
Caused by: org.tmatesoft.svn.core.SVNException: svn: E175002: OPTIONS request failed on '/repos/asf/sling/trunk'
svn: E175002: timed out waiting for server
at org.tmatesoft.svn.core.internal.wc.SVNErrorManager.error(SVNErrorManager.java:64)
at org.tmatesoft.svn.core.internal.wc.SVNErrorManager.error(SVNErrorManager.java:51)
at org.tmatesoft.svn.core.internal.io.dav.http.HTTPConnection._request(HTTPConnection.java:777)
at org.tmatesoft.svn.core.internal.io.dav.http.HTTPConnection.request(HTTPConnection.java:382)
... 34 more
Caused by: svn: E175002: OPTIONS request failed on '/repos/asf/sling/trunk'
at org.tmatesoft.svn.core.SVNErrorMessage.create(SVNErrorMessage.java:208)
at org.tmatesoft.svn.core.internal.io.dav.http.HTTPConnection._request(HTTPConnection.java:775)
... 35 more
Caused by: svn: E175002: timed out waiting for server
at org.tmatesoft.svn.core.SVNErrorMessage.create(SVNErrorMessage.java:208)
at org.tmatesoft.svn.core.internal.io.dav.http.HTTPConnection._request(HTTPConnection.java:514)
... 35 more
Caused by: java.net.SocketTimeoutException: connect timed out
at java.net.PlainSocketImpl.socketConnect(Native Method)
at java.net.AbstractPlainSocketImpl.doConnect(AbstractPlainSocketImpl.java:339)
at java.net.AbstractPlainSocketImpl.connectToAddress(AbstractPlainSocketImpl.java:200)
at java.net.AbstractPlainSocketImpl.connect(AbstractPlainSocketImpl.java:182)
at java.net.SocksSocketImpl.connect(SocksSocketImpl.java:392)
at java.net.Socket.connect(Socket.java:579)
at org.tmatesoft.svn.core.internal.util.SVNSocketFactory.connect(SVNSocketFactory.java:146)
at org.tmatesoft.svn.core.internal.util.SVNSocketFactory.createPlainSocket(SVNSocketFactory.java:73)
at org.tmatesoft.svn.core.internal.io.dav.http.HTTPConnection.connect(HTTPConnection.java:280)
at org.tmatesoft.svn.core.internal.io.dav.http.HTTPConnection._request(HTTPConnection.java:451)
... 35 more
ERROR: Subversion update failed
java.io.IOException: remote file operation failed: <https://builds.apache.org/job/sling-trunk-1.8/ws/> at hudson.remoting.Channel@5f3bccdb:ubuntu-5
at hudson.FilePath.act(FilePath.java:910)
at hudson.FilePath.act(FilePath.java:887)
at hudson.scm.SubversionSCM.checkout(SubversionSCM.java:936)
at hudson.scm.SubversionSCM.checkout(SubversionSCM.java:871)
at hudson.model.AbstractProject.checkout(AbstractProject.java:1414)
at hudson.model.AbstractBuild$AbstractBuildExecution.defaultCheckout(AbstractBuild.java:671)
at jenkins.scm.SCMCheckoutStrategy.checkout(SCMCheckoutStrategy.java:88)
at hudson.model.AbstractBuild$AbstractBuildExecution.run(AbstractBuild.java:580)
at hudson.model.Run.execute(Run.java:1676)
at hudson.maven.MavenModuleSetBuild.run(MavenModuleSetBuild.java:529)
at hudson.model.ResourceController.execute(ResourceController.java:88)
at hudson.model.Executor.run(Executor.java:231)
Caused by: java.io.IOException
at hudson.scm.subversion.UpdateUpdater$TaskImpl.perform(UpdateUpdater.java:211)
at hudson.scm.subversion.WorkspaceUpdater$UpdateTask.delegateTo(WorkspaceUpdater.java:161)
at hudson.scm.SubversionSCM$CheckOutTask.perform(SubversionSCM.java:1030)
at hudson.scm.SubversionSCM$CheckOutTask.invoke(SubversionSCM.java:1011)
at hudson.scm.SubversionSCM$CheckOutTask.invoke(SubversionSCM.java:987)
at hudson.FilePath$FileCallableWrapper.call(FilePath.java:2462)
at hudson.remoting.UserRequest.perform(UserRequest.java:118)
at hudson.remoting.UserRequest.perform(UserRequest.java:48)
at hudson.remoting.Request$2.run(Request.java:328)
at hudson.remoting.InterceptingExecutorService$1.call(InterceptingExecutorService.java:72)
at java.util.concurrent.FutureTask.run(FutureTask.java:262)
at java.util.concurrent.ThreadPoolExecutor.runWorker(ThreadPoolExecutor.java:1145)
at java.util.concurrent.ThreadPoolExecutor$Worker.run(ThreadPoolExecutor.java:615)
at java.lang.Thread.run(Thread.java:745)
Caused by: hudson.scm.subversion.UpdaterException: failed to perform svn update
... 14 more
Caused by: org.tmatesoft.svn.core.SVNException: svn: E175002: OPTIONS /repos/asf/sling/trunk failed
at org.tmatesoft.svn.core.internal.io.dav.http.HTTPConnection.request(HTTPConnection.java:388)
at org.tmatesoft.svn.core.internal.io.dav.http.HTTPConnection.request(HTTPConnection.java:373)
at org.tmatesoft.svn.core.internal.io.dav.http.HTTPConnection.request(HTTPConnection.java:361)
at org.tmatesoft.svn.core.internal.io.dav.DAVConnection.performHttpRequest(DAVConnection.java:707)
at org.tmatesoft.svn.core.internal.io.dav.DAVConnection.exchangeCapabilities(DAVConnection.java:627)
at org.tmatesoft.svn.core.internal.io.dav.DAVConnection.open(DAVConnection.java:102)
at org.tmatesoft.svn.core.internal.io.dav.DAVRepository.openConnection(DAVRepository.java:1020)
at org.tmatesoft.svn.core.internal.io.dav.DAVRepository.getRepositoryUUID(DAVRepository.java:148)
at org.tmatesoft.svn.core.internal.wc16.SVNBasicDelegate.createRepository(SVNBasicDelegate.java:339)
at org.tmatesoft.svn.core.internal.wc16.SVNBasicDelegate.createRepository(SVNBasicDelegate.java:328)
at org.tmatesoft.svn.core.internal.wc16.SVNUpdateClient16.update(SVNUpdateClient16.java:482)
at org.tmatesoft.svn.core.internal.wc16.SVNUpdateClient16.doUpdate(SVNUpdateClient16.java:364)
at org.tmatesoft.svn.core.internal.wc16.SVNUpdateClient16.doUpdate(SVNUpdateClient16.java:274)
at org.tmatesoft.svn.core.internal.wc2.old.SvnOldUpdate.run(SvnOldUpdate.java:27)
at org.tmatesoft.svn.core.internal.wc2.old.SvnOldUpdate.run(SvnOldUpdate.java:11)
at org.tmatesoft.svn.core.internal.wc2.SvnOperationRunner.run(SvnOperationRunner.java:20)
at org.tmatesoft.svn.core.wc2.SvnOperationFactory.run(SvnOperationFactory.java:1238)
at org.tmatesoft.svn.core.wc2.SvnOperation.run(SvnOperation.java:294)
at org.tmatesoft.svn.core.wc.SVNUpdateClient.doUpdate(SVNUpdateClient.java:311)
at org.tmatesoft.svn.core.wc.SVNUpdateClient.doUpdate(SVNUpdateClient.java:291)
at org.tmatesoft.svn.core.wc.SVNUpdateClient.doUpdate(SVNUpdateClient.java:387)
at hudson.scm.subversion.UpdateUpdater$TaskImpl.perform(UpdateUpdater.java:157)
... 13 more
Caused by: svn: E175002: OPTIONS /repos/asf/sling/trunk failed
at org.tmatesoft.svn.core.SVNErrorMessage.create(SVNErrorMessage.java:208)
at org.tmatesoft.svn.core.SVNErrorMessage.create(SVNErrorMessage.java:154)
at org.tmatesoft.svn.core.SVNErrorMessage.create(SVNErrorMessage.java:97)
... 35 more
Caused by: org.tmatesoft.svn.core.SVNException: svn: E175002: OPTIONS request failed on '/repos/asf/sling/trunk'
svn: E175002: timed out waiting for server
at org.tmatesoft.svn.core.internal.wc.SVNErrorManager.error(SVNErrorManager.java:64)
at org.tmatesoft.svn.core.internal.wc.SVNErrorManager.error(SVNErrorManager.java:51)
at org.tmatesoft.svn.core.internal.io.dav.http.HTTPConnection._request(HTTPConnection.java:777)
at org.tmatesoft.svn.core.internal.io.dav.http.HTTPConnection.request(HTTPConnection.java:382)
... 34 more
Caused by: svn: E175002: OPTIONS request failed on '/repos/asf/sling/trunk'
at org.tmatesoft.svn.core.SVNErrorMessage.create(SVNErrorMessage.java:208)
at org.tmatesoft.svn.core.internal.io.dav.http.HTTPConnection._request(HTTPConnection.java:775)
... 35 more
Caused by: svn: E175002: timed out waiting for server
at org.tmatesoft.svn.core.SVNErrorMessage.create(SVNErrorMessage.java:208)
at org.tmatesoft.svn.core.internal.io.dav.http.HTTPConnection._request(HTTPConnection.java:514)
... 35 more
Caused by: java.net.SocketTimeoutException: connect timed out
at java.net.PlainSocketImpl.socketConnect(Native Method)
at java.net.AbstractPlainSocketImpl.doConnect(AbstractPlainSocketImpl.java:339)
at java.net.AbstractPlainSocketImpl.connectToAddress(AbstractPlainSocketImpl.java:200)
at java.net.AbstractPlainSocketImpl.connect(AbstractPlainSocketImpl.java:182)
at java.net.SocksSocketImpl.connect(SocksSocketImpl.java:392)
at java.net.Socket.connect(Socket.java:579)
at org.tmatesoft.svn.core.internal.util.SVNSocketFactory.connect(SVNSocketFactory.java:146)
at org.tmatesoft.svn.core.internal.util.SVNSocketFactory.createPlainSocket(SVNSocketFactory.java:73)
at org.tmatesoft.svn.core.internal.io.dav.http.HTTPConnection.connect(HTTPConnection.java:280)
at org.tmatesoft.svn.core.internal.io.dav.http.HTTPConnection._request(HTTPConnection.java:451)
... 35 more
Build failed in Jenkins: sling-trunk-1.8 #38
Posted by Apache Jenkins Server <je...@builds.apache.org>.
See <https://builds.apache.org/job/sling-trunk-1.8/38/>
------------------------------------------
[...truncated 226 lines...]
at org.tmatesoft.svn.core.internal.util.SVNSocketFactory.createPlainSocket(SVNSocketFactory.java:73)
at org.tmatesoft.svn.core.internal.io.dav.http.HTTPConnection.connect(HTTPConnection.java:280)
at org.tmatesoft.svn.core.internal.io.dav.http.HTTPConnection._request(HTTPConnection.java:451)
... 35 more
ERROR: Subversion update failed
java.io.IOException: remote file operation failed: <https://builds.apache.org/job/sling-trunk-1.8/ws/> at hudson.remoting.Channel@52d6c4b:ubuntu-5
at hudson.FilePath.act(FilePath.java:910)
at hudson.FilePath.act(FilePath.java:887)
at hudson.scm.SubversionSCM.checkout(SubversionSCM.java:936)
at hudson.scm.SubversionSCM.checkout(SubversionSCM.java:871)
at hudson.model.AbstractProject.checkout(AbstractProject.java:1414)
at hudson.model.AbstractBuild$AbstractBuildExecution.defaultCheckout(AbstractBuild.java:671)
at jenkins.scm.SCMCheckoutStrategy.checkout(SCMCheckoutStrategy.java:88)
at hudson.model.AbstractBuild$AbstractBuildExecution.run(AbstractBuild.java:580)
at hudson.model.Run.execute(Run.java:1676)
at hudson.maven.MavenModuleSetBuild.run(MavenModuleSetBuild.java:529)
at hudson.model.ResourceController.execute(ResourceController.java:88)
at hudson.model.Executor.run(Executor.java:231)
Caused by: java.io.IOException
at hudson.scm.subversion.UpdateUpdater$TaskImpl.perform(UpdateUpdater.java:211)
at hudson.scm.subversion.WorkspaceUpdater$UpdateTask.delegateTo(WorkspaceUpdater.java:161)
at hudson.scm.SubversionSCM$CheckOutTask.perform(SubversionSCM.java:1030)
at hudson.scm.SubversionSCM$CheckOutTask.invoke(SubversionSCM.java:1011)
at hudson.scm.SubversionSCM$CheckOutTask.invoke(SubversionSCM.java:987)
at hudson.FilePath$FileCallableWrapper.call(FilePath.java:2462)
at hudson.remoting.UserRequest.perform(UserRequest.java:118)
at hudson.remoting.UserRequest.perform(UserRequest.java:48)
at hudson.remoting.Request$2.run(Request.java:328)
at hudson.remoting.InterceptingExecutorService$1.call(InterceptingExecutorService.java:72)
at java.util.concurrent.FutureTask.run(FutureTask.java:262)
at java.util.concurrent.ThreadPoolExecutor.runWorker(ThreadPoolExecutor.java:1145)
at java.util.concurrent.ThreadPoolExecutor$Worker.run(ThreadPoolExecutor.java:615)
at java.lang.Thread.run(Thread.java:745)
Caused by: hudson.scm.subversion.UpdaterException: failed to perform svn update
... 14 more
Caused by: org.tmatesoft.svn.core.SVNException: svn: E175002: OPTIONS /repos/asf/sling/trunk failed
at org.tmatesoft.svn.core.internal.io.dav.http.HTTPConnection.request(HTTPConnection.java:388)
at org.tmatesoft.svn.core.internal.io.dav.http.HTTPConnection.request(HTTPConnection.java:373)
at org.tmatesoft.svn.core.internal.io.dav.http.HTTPConnection.request(HTTPConnection.java:361)
at org.tmatesoft.svn.core.internal.io.dav.DAVConnection.performHttpRequest(DAVConnection.java:707)
at org.tmatesoft.svn.core.internal.io.dav.DAVConnection.exchangeCapabilities(DAVConnection.java:627)
at org.tmatesoft.svn.core.internal.io.dav.DAVConnection.open(DAVConnection.java:102)
at org.tmatesoft.svn.core.internal.io.dav.DAVRepository.openConnection(DAVRepository.java:1020)
at org.tmatesoft.svn.core.internal.io.dav.DAVRepository.getRepositoryUUID(DAVRepository.java:148)
at org.tmatesoft.svn.core.internal.wc16.SVNBasicDelegate.createRepository(SVNBasicDelegate.java:339)
at org.tmatesoft.svn.core.internal.wc16.SVNBasicDelegate.createRepository(SVNBasicDelegate.java:328)
at org.tmatesoft.svn.core.internal.wc16.SVNUpdateClient16.update(SVNUpdateClient16.java:482)
at org.tmatesoft.svn.core.internal.wc16.SVNUpdateClient16.doUpdate(SVNUpdateClient16.java:364)
at org.tmatesoft.svn.core.internal.wc16.SVNUpdateClient16.doUpdate(SVNUpdateClient16.java:274)
at org.tmatesoft.svn.core.internal.wc2.old.SvnOldUpdate.run(SvnOldUpdate.java:27)
at org.tmatesoft.svn.core.internal.wc2.old.SvnOldUpdate.run(SvnOldUpdate.java:11)
at org.tmatesoft.svn.core.internal.wc2.SvnOperationRunner.run(SvnOperationRunner.java:20)
at org.tmatesoft.svn.core.wc2.SvnOperationFactory.run(SvnOperationFactory.java:1238)
at org.tmatesoft.svn.core.wc2.SvnOperation.run(SvnOperation.java:294)
at org.tmatesoft.svn.core.wc.SVNUpdateClient.doUpdate(SVNUpdateClient.java:311)
at org.tmatesoft.svn.core.wc.SVNUpdateClient.doUpdate(SVNUpdateClient.java:291)
at org.tmatesoft.svn.core.wc.SVNUpdateClient.doUpdate(SVNUpdateClient.java:387)
at hudson.scm.subversion.UpdateUpdater$TaskImpl.perform(UpdateUpdater.java:157)
... 13 more
Caused by: svn: E175002: OPTIONS /repos/asf/sling/trunk failed
at org.tmatesoft.svn.core.SVNErrorMessage.create(SVNErrorMessage.java:208)
at org.tmatesoft.svn.core.SVNErrorMessage.create(SVNErrorMessage.java:154)
at org.tmatesoft.svn.core.SVNErrorMessage.create(SVNErrorMessage.java:97)
... 35 more
Caused by: org.tmatesoft.svn.core.SVNException: svn: E175002: OPTIONS request failed on '/repos/asf/sling/trunk'
svn: E175002: timed out waiting for server
at org.tmatesoft.svn.core.internal.wc.SVNErrorManager.error(SVNErrorManager.java:64)
at org.tmatesoft.svn.core.internal.wc.SVNErrorManager.error(SVNErrorManager.java:51)
at org.tmatesoft.svn.core.internal.io.dav.http.HTTPConnection._request(HTTPConnection.java:777)
at org.tmatesoft.svn.core.internal.io.dav.http.HTTPConnection.request(HTTPConnection.java:382)
... 34 more
Caused by: svn: E175002: OPTIONS request failed on '/repos/asf/sling/trunk'
at org.tmatesoft.svn.core.SVNErrorMessage.create(SVNErrorMessage.java:208)
at org.tmatesoft.svn.core.internal.io.dav.http.HTTPConnection._request(HTTPConnection.java:775)
... 35 more
Caused by: svn: E175002: timed out waiting for server
at org.tmatesoft.svn.core.SVNErrorMessage.create(SVNErrorMessage.java:208)
at org.tmatesoft.svn.core.internal.io.dav.http.HTTPConnection._request(HTTPConnection.java:514)
... 35 more
Caused by: java.net.SocketTimeoutException: connect timed out
at java.net.PlainSocketImpl.socketConnect(Native Method)
at java.net.AbstractPlainSocketImpl.doConnect(AbstractPlainSocketImpl.java:339)
at java.net.AbstractPlainSocketImpl.connectToAddress(AbstractPlainSocketImpl.java:200)
at java.net.AbstractPlainSocketImpl.connect(AbstractPlainSocketImpl.java:182)
at java.net.SocksSocketImpl.connect(SocksSocketImpl.java:392)
at java.net.Socket.connect(Socket.java:579)
at org.tmatesoft.svn.core.internal.util.SVNSocketFactory.connect(SVNSocketFactory.java:146)
at org.tmatesoft.svn.core.internal.util.SVNSocketFactory.createPlainSocket(SVNSocketFactory.java:73)
at org.tmatesoft.svn.core.internal.io.dav.http.HTTPConnection.connect(HTTPConnection.java:280)
at org.tmatesoft.svn.core.internal.io.dav.http.HTTPConnection._request(HTTPConnection.java:451)
... 35 more
Retrying after 10 seconds
Updating http://svn.apache.org/repos/asf/sling/trunk at revision '2014-08-13T20:07:53.946 +0000'
ERROR: Failed to update http://svn.apache.org/repos/asf/sling/trunk
org.tmatesoft.svn.core.SVNException: svn: E175002: OPTIONS /repos/asf/sling/trunk failed
at org.tmatesoft.svn.core.internal.io.dav.http.HTTPConnection.request(HTTPConnection.java:388)
at org.tmatesoft.svn.core.internal.io.dav.http.HTTPConnection.request(HTTPConnection.java:373)
at org.tmatesoft.svn.core.internal.io.dav.http.HTTPConnection.request(HTTPConnection.java:361)
at org.tmatesoft.svn.core.internal.io.dav.DAVConnection.performHttpRequest(DAVConnection.java:707)
at org.tmatesoft.svn.core.internal.io.dav.DAVConnection.exchangeCapabilities(DAVConnection.java:627)
at org.tmatesoft.svn.core.internal.io.dav.DAVConnection.open(DAVConnection.java:102)
at org.tmatesoft.svn.core.internal.io.dav.DAVRepository.openConnection(DAVRepository.java:1020)
at org.tmatesoft.svn.core.internal.io.dav.DAVRepository.getRepositoryUUID(DAVRepository.java:148)
at org.tmatesoft.svn.core.internal.wc16.SVNBasicDelegate.createRepository(SVNBasicDelegate.java:339)
at org.tmatesoft.svn.core.internal.wc16.SVNBasicDelegate.createRepository(SVNBasicDelegate.java:328)
at org.tmatesoft.svn.core.internal.wc16.SVNUpdateClient16.update(SVNUpdateClient16.java:482)
at org.tmatesoft.svn.core.internal.wc16.SVNUpdateClient16.doUpdate(SVNUpdateClient16.java:364)
at org.tmatesoft.svn.core.internal.wc16.SVNUpdateClient16.doUpdate(SVNUpdateClient16.java:274)
at org.tmatesoft.svn.core.internal.wc2.old.SvnOldUpdate.run(SvnOldUpdate.java:27)
at org.tmatesoft.svn.core.internal.wc2.old.SvnOldUpdate.run(SvnOldUpdate.java:11)
at org.tmatesoft.svn.core.internal.wc2.SvnOperationRunner.run(SvnOperationRunner.java:20)
at org.tmatesoft.svn.core.wc2.SvnOperationFactory.run(SvnOperationFactory.java:1238)
at org.tmatesoft.svn.core.wc2.SvnOperation.run(SvnOperation.java:294)
at org.tmatesoft.svn.core.wc.SVNUpdateClient.doUpdate(SVNUpdateClient.java:311)
at org.tmatesoft.svn.core.wc.SVNUpdateClient.doUpdate(SVNUpdateClient.java:291)
at org.tmatesoft.svn.core.wc.SVNUpdateClient.doUpdate(SVNUpdateClient.java:387)
at hudson.scm.subversion.UpdateUpdater$TaskImpl.perform(UpdateUpdater.java:157)
at hudson.scm.subversion.WorkspaceUpdater$UpdateTask.delegateTo(WorkspaceUpdater.java:161)
at hudson.scm.SubversionSCM$CheckOutTask.perform(SubversionSCM.java:1030)
at hudson.scm.SubversionSCM$CheckOutTask.invoke(SubversionSCM.java:1011)
at hudson.scm.SubversionSCM$CheckOutTask.invoke(SubversionSCM.java:987)
at hudson.FilePath$FileCallableWrapper.call(FilePath.java:2462)
at hudson.remoting.UserRequest.perform(UserRequest.java:118)
at hudson.remoting.UserRequest.perform(UserRequest.java:48)
at hudson.remoting.Request$2.run(Request.java:328)
at hudson.remoting.InterceptingExecutorService$1.call(InterceptingExecutorService.java:72)
at java.util.concurrent.FutureTask.run(FutureTask.java:262)
at java.util.concurrent.ThreadPoolExecutor.runWorker(ThreadPoolExecutor.java:1145)
at java.util.concurrent.ThreadPoolExecutor$Worker.run(ThreadPoolExecutor.java:615)
at java.lang.Thread.run(Thread.java:745)
Caused by: svn: E175002: OPTIONS /repos/asf/sling/trunk failed
at org.tmatesoft.svn.core.SVNErrorMessage.create(SVNErrorMessage.java:208)
at org.tmatesoft.svn.core.SVNErrorMessage.create(SVNErrorMessage.java:154)
at org.tmatesoft.svn.core.SVNErrorMessage.create(SVNErrorMessage.java:97)
... 35 more
Caused by: org.tmatesoft.svn.core.SVNException: svn: E175002: OPTIONS request failed on '/repos/asf/sling/trunk'
svn: E175002: timed out waiting for server
at org.tmatesoft.svn.core.internal.wc.SVNErrorManager.error(SVNErrorManager.java:64)
at org.tmatesoft.svn.core.internal.wc.SVNErrorManager.error(SVNErrorManager.java:51)
at org.tmatesoft.svn.core.internal.io.dav.http.HTTPConnection._request(HTTPConnection.java:777)
at org.tmatesoft.svn.core.internal.io.dav.http.HTTPConnection.request(HTTPConnection.java:382)
... 34 more
Caused by: svn: E175002: OPTIONS request failed on '/repos/asf/sling/trunk'
at org.tmatesoft.svn.core.SVNErrorMessage.create(SVNErrorMessage.java:208)
at org.tmatesoft.svn.core.internal.io.dav.http.HTTPConnection._request(HTTPConnection.java:775)
... 35 more
Caused by: svn: E175002: timed out waiting for server
at org.tmatesoft.svn.core.SVNErrorMessage.create(SVNErrorMessage.java:208)
at org.tmatesoft.svn.core.internal.io.dav.http.HTTPConnection._request(HTTPConnection.java:514)
... 35 more
Caused by: java.net.SocketTimeoutException: connect timed out
at java.net.PlainSocketImpl.socketConnect(Native Method)
at java.net.AbstractPlainSocketImpl.doConnect(AbstractPlainSocketImpl.java:339)
at java.net.AbstractPlainSocketImpl.connectToAddress(AbstractPlainSocketImpl.java:200)
at java.net.AbstractPlainSocketImpl.connect(AbstractPlainSocketImpl.java:182)
at java.net.SocksSocketImpl.connect(SocksSocketImpl.java:392)
at java.net.Socket.connect(Socket.java:579)
at org.tmatesoft.svn.core.internal.util.SVNSocketFactory.connect(SVNSocketFactory.java:146)
at org.tmatesoft.svn.core.internal.util.SVNSocketFactory.createPlainSocket(SVNSocketFactory.java:73)
at org.tmatesoft.svn.core.internal.io.dav.http.HTTPConnection.connect(HTTPConnection.java:280)
at org.tmatesoft.svn.core.internal.io.dav.http.HTTPConnection._request(HTTPConnection.java:451)
... 35 more
ERROR: Subversion update failed
java.io.IOException: remote file operation failed: <https://builds.apache.org/job/sling-trunk-1.8/ws/> at hudson.remoting.Channel@52d6c4b:ubuntu-5
at hudson.FilePath.act(FilePath.java:910)
at hudson.FilePath.act(FilePath.java:887)
at hudson.scm.SubversionSCM.checkout(SubversionSCM.java:936)
at hudson.scm.SubversionSCM.checkout(SubversionSCM.java:871)
at hudson.model.AbstractProject.checkout(AbstractProject.java:1414)
at hudson.model.AbstractBuild$AbstractBuildExecution.defaultCheckout(AbstractBuild.java:671)
at jenkins.scm.SCMCheckoutStrategy.checkout(SCMCheckoutStrategy.java:88)
at hudson.model.AbstractBuild$AbstractBuildExecution.run(AbstractBuild.java:580)
at hudson.model.Run.execute(Run.java:1676)
at hudson.maven.MavenModuleSetBuild.run(MavenModuleSetBuild.java:529)
at hudson.model.ResourceController.execute(ResourceController.java:88)
at hudson.model.Executor.run(Executor.java:231)
Caused by: java.io.IOException
at hudson.scm.subversion.UpdateUpdater$TaskImpl.perform(UpdateUpdater.java:211)
at hudson.scm.subversion.WorkspaceUpdater$UpdateTask.delegateTo(WorkspaceUpdater.java:161)
at hudson.scm.SubversionSCM$CheckOutTask.perform(SubversionSCM.java:1030)
at hudson.scm.SubversionSCM$CheckOutTask.invoke(SubversionSCM.java:1011)
at hudson.scm.SubversionSCM$CheckOutTask.invoke(SubversionSCM.java:987)
at hudson.FilePath$FileCallableWrapper.call(FilePath.java:2462)
at hudson.remoting.UserRequest.perform(UserRequest.java:118)
at hudson.remoting.UserRequest.perform(UserRequest.java:48)
at hudson.remoting.Request$2.run(Request.java:328)
at hudson.remoting.InterceptingExecutorService$1.call(InterceptingExecutorService.java:72)
at java.util.concurrent.FutureTask.run(FutureTask.java:262)
at java.util.concurrent.ThreadPoolExecutor.runWorker(ThreadPoolExecutor.java:1145)
at java.util.concurrent.ThreadPoolExecutor$Worker.run(ThreadPoolExecutor.java:615)
at java.lang.Thread.run(Thread.java:745)
Caused by: hudson.scm.subversion.UpdaterException: failed to perform svn update
... 14 more
Caused by: org.tmatesoft.svn.core.SVNException: svn: E175002: OPTIONS /repos/asf/sling/trunk failed
at org.tmatesoft.svn.core.internal.io.dav.http.HTTPConnection.request(HTTPConnection.java:388)
at org.tmatesoft.svn.core.internal.io.dav.http.HTTPConnection.request(HTTPConnection.java:373)
at org.tmatesoft.svn.core.internal.io.dav.http.HTTPConnection.request(HTTPConnection.java:361)
at org.tmatesoft.svn.core.internal.io.dav.DAVConnection.performHttpRequest(DAVConnection.java:707)
at org.tmatesoft.svn.core.internal.io.dav.DAVConnection.exchangeCapabilities(DAVConnection.java:627)
at org.tmatesoft.svn.core.internal.io.dav.DAVConnection.open(DAVConnection.java:102)
at org.tmatesoft.svn.core.internal.io.dav.DAVRepository.openConnection(DAVRepository.java:1020)
at org.tmatesoft.svn.core.internal.io.dav.DAVRepository.getRepositoryUUID(DAVRepository.java:148)
at org.tmatesoft.svn.core.internal.wc16.SVNBasicDelegate.createRepository(SVNBasicDelegate.java:339)
at org.tmatesoft.svn.core.internal.wc16.SVNBasicDelegate.createRepository(SVNBasicDelegate.java:328)
at org.tmatesoft.svn.core.internal.wc16.SVNUpdateClient16.update(SVNUpdateClient16.java:482)
at org.tmatesoft.svn.core.internal.wc16.SVNUpdateClient16.doUpdate(SVNUpdateClient16.java:364)
at org.tmatesoft.svn.core.internal.wc16.SVNUpdateClient16.doUpdate(SVNUpdateClient16.java:274)
at org.tmatesoft.svn.core.internal.wc2.old.SvnOldUpdate.run(SvnOldUpdate.java:27)
at org.tmatesoft.svn.core.internal.wc2.old.SvnOldUpdate.run(SvnOldUpdate.java:11)
at org.tmatesoft.svn.core.internal.wc2.SvnOperationRunner.run(SvnOperationRunner.java:20)
at org.tmatesoft.svn.core.wc2.SvnOperationFactory.run(SvnOperationFactory.java:1238)
at org.tmatesoft.svn.core.wc2.SvnOperation.run(SvnOperation.java:294)
at org.tmatesoft.svn.core.wc.SVNUpdateClient.doUpdate(SVNUpdateClient.java:311)
at org.tmatesoft.svn.core.wc.SVNUpdateClient.doUpdate(SVNUpdateClient.java:291)
at org.tmatesoft.svn.core.wc.SVNUpdateClient.doUpdate(SVNUpdateClient.java:387)
at hudson.scm.subversion.UpdateUpdater$TaskImpl.perform(UpdateUpdater.java:157)
... 13 more
Caused by: svn: E175002: OPTIONS /repos/asf/sling/trunk failed
at org.tmatesoft.svn.core.SVNErrorMessage.create(SVNErrorMessage.java:208)
at org.tmatesoft.svn.core.SVNErrorMessage.create(SVNErrorMessage.java:154)
at org.tmatesoft.svn.core.SVNErrorMessage.create(SVNErrorMessage.java:97)
... 35 more
Caused by: org.tmatesoft.svn.core.SVNException: svn: E175002: OPTIONS request failed on '/repos/asf/sling/trunk'
svn: E175002: timed out waiting for server
at org.tmatesoft.svn.core.internal.wc.SVNErrorManager.error(SVNErrorManager.java:64)
at org.tmatesoft.svn.core.internal.wc.SVNErrorManager.error(SVNErrorManager.java:51)
at org.tmatesoft.svn.core.internal.io.dav.http.HTTPConnection._request(HTTPConnection.java:777)
at org.tmatesoft.svn.core.internal.io.dav.http.HTTPConnection.request(HTTPConnection.java:382)
... 34 more
Caused by: svn: E175002: OPTIONS request failed on '/repos/asf/sling/trunk'
at org.tmatesoft.svn.core.SVNErrorMessage.create(SVNErrorMessage.java:208)
at org.tmatesoft.svn.core.internal.io.dav.http.HTTPConnection._request(HTTPConnection.java:775)
... 35 more
Caused by: svn: E175002: timed out waiting for server
at org.tmatesoft.svn.core.SVNErrorMessage.create(SVNErrorMessage.java:208)
at org.tmatesoft.svn.core.internal.io.dav.http.HTTPConnection._request(HTTPConnection.java:514)
... 35 more
Caused by: java.net.SocketTimeoutException: connect timed out
at java.net.PlainSocketImpl.socketConnect(Native Method)
at java.net.AbstractPlainSocketImpl.doConnect(AbstractPlainSocketImpl.java:339)
at java.net.AbstractPlainSocketImpl.connectToAddress(AbstractPlainSocketImpl.java:200)
at java.net.AbstractPlainSocketImpl.connect(AbstractPlainSocketImpl.java:182)
at java.net.SocksSocketImpl.connect(SocksSocketImpl.java:392)
at java.net.Socket.connect(Socket.java:579)
at org.tmatesoft.svn.core.internal.util.SVNSocketFactory.connect(SVNSocketFactory.java:146)
at org.tmatesoft.svn.core.internal.util.SVNSocketFactory.createPlainSocket(SVNSocketFactory.java:73)
at org.tmatesoft.svn.core.internal.io.dav.http.HTTPConnection.connect(HTTPConnection.java:280)
at org.tmatesoft.svn.core.internal.io.dav.http.HTTPConnection._request(HTTPConnection.java:451)
... 35 more
Jenkins build is still unstable: sling-trunk-1.8 #37
Posted by Apache Jenkins Server <je...@builds.apache.org>.
See <https://builds.apache.org/job/sling-trunk-1.8/changes>
Jenkins build is still unstable: sling-trunk-1.8 #36
Posted by Apache Jenkins Server <je...@builds.apache.org>.
See <https://builds.apache.org/job/sling-trunk-1.8/changes>
Jenkins build is still unstable: sling-trunk-1.8 #35
Posted by Apache Jenkins Server <je...@builds.apache.org>.
See <https://builds.apache.org/job/sling-trunk-1.8/changes>
Jenkins build is still unstable: sling-trunk-1.8 #34
Posted by Apache Jenkins Server <je...@builds.apache.org>.
See <https://builds.apache.org/job/sling-trunk-1.8/changes>
Jenkins build is still unstable: sling-trunk-1.8 #33
Posted by Apache Jenkins Server <je...@builds.apache.org>.
See <https://builds.apache.org/job/sling-trunk-1.8/changes>
Jenkins build is still unstable: sling-trunk-1.8 #32
Posted by Apache Jenkins Server <je...@builds.apache.org>.
See <https://builds.apache.org/job/sling-trunk-1.8/changes>
Jenkins build is still unstable: sling-trunk-1.8 #31
Posted by Apache Jenkins Server <je...@builds.apache.org>.
See <https://builds.apache.org/job/sling-trunk-1.8/changes>
Jenkins build is unstable: sling-trunk-1.8 #30
Posted by Apache Jenkins Server <je...@builds.apache.org>.
See <https://builds.apache.org/job/sling-trunk-1.8/30/changes>
Build failed in Jenkins: sling-trunk-1.8 #29
Posted by Apache Jenkins Server <je...@builds.apache.org>.
See <https://builds.apache.org/job/sling-trunk-1.8/29/changes>
Changes:
[cziegeler] SLING-3834 : Update to Felix Http Service Implementation 2.3.0
[cziegeler] Switch to latest snapshots during release phase
[cziegeler] [maven-release-plugin] prepare for next development iteration
[cziegeler] [maven-release-plugin] prepare release org.apache.sling.auth.selector-1.0.6
[cziegeler] [maven-release-plugin] prepare for next development iteration
[cziegeler] [maven-release-plugin] prepare release org.apache.sling.auth.openid-1.0.4
[cziegeler] [maven-release-plugin] prepare for next development iteration
[cziegeler] [maven-release-plugin] prepare release org.apache.sling.auth.form-1.0.6
[cziegeler] [maven-release-plugin] prepare for next development iteration
[cziegeler] [maven-release-plugin] prepare release org.apache.sling.auth.core-1.1.8
------------------------------------------
[...truncated 20216 lines...]
[INFO] Apache Sling System Bundle Extension: XML APIs .... SUCCESS [8.594s]
[INFO] Apache Sling System Bundle Extension: Activation API SUCCESS [8.693s]
[INFO] Apache Sling System Bundle Extension: WS APIs ..... SUCCESS [11.082s]
[INFO] Apache Sling Dynamic Class Loader Support ......... SUCCESS [23.966s]
[INFO] Apache Sling Commons Java Compiler ................ SUCCESS [17.107s]
[INFO] Apache Sling JSON Library ......................... SUCCESS [18.254s]
[INFO] Apache Sling SLF4J Implementation (Logback) ....... SUCCESS [1:08.400s]
[INFO] Apache Sling OSGi LogService Implementation ....... SUCCESS [6.093s]
[INFO] Apache Sling MIME type mapping support ............ SUCCESS [15.029s]
[INFO] Apache Sling Commons OSGi support ................. SUCCESS [11.959s]
[INFO] Apache Sling Scheduler Support .................... SUCCESS [14.627s]
[INFO] Apache Sling Testing Utilities .................... SUCCESS [38.464s]
[INFO] Apache Sling Thread Dumper ........................ SUCCESS [9.128s]
[INFO] Apache Sling Thread Support ....................... SUCCESS [6.222s]
[INFO] Apache Sling Authentication Service ............... SUCCESS [12.368s]
[INFO] Apache Sling OpenID Authentication ................ SUCCESS [15.263s]
[INFO] Apache Sling Form Based Authentication Handler .... SUCCESS [20.448s]
[INFO] Apache Sling Authentication Selector .............. SUCCESS [8.972s]
[INFO] Apache Sling Engine Implementation ................ SUCCESS [34.023s]
[INFO] Apache Sling Repository API Bundle ................ SUCCESS [5.724s]
[INFO] Apache Sling JCR Base Bundle ...................... SUCCESS [9.245s]
[INFO] Apache Sling JCR ClassLoader ...................... SUCCESS [9.019s]
[INFO] Apache Sling Initial Content Loader ............... SUCCESS [20.530s]
[INFO] Apache Sling Jackrabbit Embedded Repository ....... SUCCESS [14.736s]
[INFO] Apache Sling Jackrabbit UserManager Support ....... SUCCESS [11.408s]
[INFO] Apache Sling Jackrabbit JSR-283 Access Control Manager Support SUCCESS [6.309s]
[INFO] Apache Sling Wrapper Bundle for the JCR API ....... SUCCESS [6.492s]
[INFO] Apache Sling JCR Resource Resolver ................ SUCCESS [1:21.497s]
[INFO] Apache Sling JCR Repository Registration .......... SUCCESS [11.377s]
[INFO] Apache Sling Simple WebDAV Access to repositories . SUCCESS [9.209s]
[INFO] Apache Sling DavEx Access to repositories ......... SUCCESS [11.876s]
[INFO] Apache Sling JCR WebConsole Bundle ................ SUCCESS [6.654s]
[INFO] Apache Sling Oak Repository Server ................ SUCCESS [11.891s]
[INFO] Apache Sling SlingRepository Integration Tests .... SUCCESS [1:14.984s]
[INFO] Apache Sling Servlet Resolver ..................... SUCCESS [17.604s]
[INFO] Apache Sling Default GET Servlets ................. SUCCESS [17.824s]
[INFO] Apache Sling Default POST Servlets ................ SUCCESS [14.531s]
[INFO] Apache Sling Compat Servlets ...................... SUCCESS [6.584s]
[INFO] Apache Sling Scripting Implementation API ......... SUCCESS [8.893s]
[INFO] Apache Sling Scripting Core implementation ........ SUCCESS [40.612s]
[INFO] Apache Sling Scripting JavaScript Support ......... SUCCESS [27.926s]
[INFO] Apache Sling Scripting JSP Support ................ SUCCESS [15.395s]
[INFO] Apache Sling JSP Tag Library ...................... SUCCESS [14.998s]
[INFO] Apache Sling JSP Standard Tag Library ............. SUCCESS [3.851s]
[INFO] Apache Sling Adapter Manager Implementation ....... SUCCESS [8.717s]
[INFO] Apache Sling Bundle Resource Provider ............. SUCCESS [5.670s]
[INFO] Apache Sling Discovery API ........................ SUCCESS [5.748s]
[INFO] Apache Sling Resource-Based Discovery Service ..... SUCCESS [2:59.435s]
[INFO] Apache Sling Discovery Support Bundle ............. SUCCESS [5.983s]
[INFO] Apache Sling Discovery Standalone Implementation .. SUCCESS [6.036s]
[INFO] Apache Sling Event Support ........................ FAILURE [7:11.728s]
[INFO] Apache Sling Feature Flags ........................ SKIPPED
[INFO] Apache Sling Filesystem Resource Provider ......... SKIPPED
[INFO] Apache Sling javax.activation bundle .............. SKIPPED
[INFO] Apache Sling Service User Mapper .................. SKIPPED
[INFO] Apache Sling Settings ............................. SKIPPED
[INFO] Apache Sling Web Console Branding ................. SKIPPED
[INFO] Apache Sling Web Console Security Provider ........ SKIPPED
[INFO] Apache Sling Groovy Extensions .................... SKIPPED
[INFO] Apache Sling Explorer ............................. SKIPPED
[INFO] Apache Sling Health Check Core .................... SKIPPED
[INFO] Apache Sling Health Check Annotations ............. SKIPPED
[INFO] Apache Sling Health Check Samples ................. SKIPPED
[INFO] Apache Sling Health Check Support Components ...... SKIPPED
[INFO] Apache Sling Health Check Webconsole Plugin ....... SKIPPED
[INFO] Apache Sling Health Check JUnit Bridge ............ SKIPPED
[INFO] Apache Sling Health Check Integration Tests ....... SKIPPED
[INFO] Apache Sling Health Check Reactor POM ............. SKIPPED
[INFO] Apache Sling Resource Access Security ............. SKIPPED
[INFO] Apache Sling Launchpad Content .................... SKIPPED
[INFO] Apache Sling Launchpad Application Builder ........ SKIPPED
[INFO] Apache Sling Resource Access Security Integration Tests SKIPPED
[INFO] Sling Models API .................................. SKIPPED
[INFO] Sling Models Implementation ....................... SKIPPED
[INFO] Apache Sling Models Integration Tests ............. SKIPPED
[INFO] Apache Sling Test Tools ........................... SKIPPED
[INFO] Apache Sling JUnit Core ........................... SKIPPED
[INFO] Apache Sling JUnit Scriptable Tests Provider ...... SKIPPED
[INFO] Apache Sling JUnit Health Checks .................. SKIPPED
[INFO] Apache Sling JUnit Remote Tests Runners ........... SKIPPED
[INFO] Apache Sling JUnit Performance .................... SKIPPED
[INFO] Apache Sling Testing Resource Resolver Mock ....... SKIPPED
[INFO] Apache Sling Pax Exam Utilities ................... SKIPPED
[INFO] Apache Sling Installer ............................ SKIPPED
[INFO] Apache Sling Installer WebConsole Plugin .......... SKIPPED
[INFO] Apache Sling File Installer ....................... SKIPPED
[INFO] Apache Sling JCR Installer ........................ SKIPPED
[INFO] Apache Sling Installer Configuration Admin Support SKIPPED
[INFO] Apache Sling Deployment Package Installer ......... SKIPPED
[INFO] Apache Sling Subsystems Installer ................. SKIPPED
[INFO] Apache Sling Installer Integration Tests .......... SKIPPED
[INFO] Apache Sling Launchpad API ........................ SKIPPED
[INFO] Apache Sling Launchpad Base ....................... SKIPPED
[INFO] Apache Sling Launchpad Installer .................. SKIPPED
[INFO] Apache Sling Sample Server-Side Tests ............. SKIPPED
[INFO] Apache Sling Failing Server-Side Tests ............ SKIPPED
[INFO] Apache Sling Sample Integration Tests ............. SKIPPED
[INFO] Apache Sling Launchpad Testing Services ........... SKIPPED
[INFO] Apache Sling Launchpad Testing Services WAR ....... SKIPPED
[INFO] Apache Sling Launchpad Testing Fragment Bundle .... SKIPPED
[INFO] Apache Sling Launchpad Test Bundles ............... SKIPPED
[INFO] Apache Sling Integration Tests .................... SKIPPED
[INFO] Apache Sling Launchpad Testing .................... SKIPPED
[INFO] Apache Sling (Builder) ............................ SKIPPED
[INFO] ------------------------------------------------------------------------
[INFO] BUILD FAILURE
[INFO] ------------------------------------------------------------------------
[INFO] Total time: 30:51.610s
[INFO] Finished at: Fri Aug 08 14:02:07 UTC 2014
[INFO] Final Memory: 122M/289M
[INFO] ------------------------------------------------------------------------
[JENKINS] Archiving disabled
[JENKINS] Archiving disabled
[JENKINS] Archiving disabled
[JENKINS] Archiving disabled
[JENKINS] Archiving disabled
[JENKINS] Archiving disabled
[JENKINS] Archiving disabled
[JENKINS] Archiving disabled
[JENKINS] Archiving disabled
[JENKINS] Archiving disabled
[JENKINS] Archiving disabled
[JENKINS] Archiving disabled
[JENKINS] Archiving disabled
[JENKINS] Archiving disabled
[JENKINS] Archiving disabled
[JENKINS] Archiving disabled
[JENKINS] Archiving disabled
[JENKINS] Archiving disabled
[JENKINS] Archiving disabled
[JENKINS] Archiving disabled
[JENKINS] Archiving disabled
[JENKINS] Archiving disabled
[JENKINS] Archiving disabled
[JENKINS] Archiving disabled
[JENKINS] Archiving disabled
[JENKINS] Archiving disabled
[JENKINS] Archiving disabled
[JENKINS] Archiving disabled
[JENKINS] Archiving disabled
[JENKINS] Archiving disabled
[JENKINS] Archiving disabled
[JENKINS] Archiving disabled
[JENKINS] Archiving disabled
[JENKINS] Archiving disabled
[JENKINS] Archiving disabled
[JENKINS] Archiving disabled
[JENKINS] Archiving disabled
[JENKINS] Archiving disabled
[JENKINS] Archiving disabled
[JENKINS] Archiving disabled
[JENKINS] Archiving disabled
[JENKINS] Archiving disabled
[JENKINS] Archiving disabled
[JENKINS] Archiving disabled
[JENKINS] Archiving disabled
[JENKINS] Archiving disabled
[JENKINS] Archiving disabled
[JENKINS] Archiving disabled
[JENKINS] Archiving disabled
[JENKINS] Archiving disabled
[JENKINS] Archiving disabled
[JENKINS] Archiving disabled
[JENKINS] Archiving disabled
[JENKINS] Archiving disabled
[JENKINS] Archiving disabled
[JENKINS] Archiving disabled
[JENKINS] Archiving disabled
[JENKINS] Archiving disabled
[JENKINS] Archiving disabled
[JENKINS] Archiving disabled
[JENKINS] Archiving disabled
[JENKINS] Archiving disabled
[JENKINS] Archiving disabled
[JENKINS] Archiving disabled
[JENKINS] Archiving disabled
[JENKINS] Archiving disabled
[JENKINS] Archiving disabled
[JENKINS] Archiving disabled
[JENKINS] Archiving disabled
[JENKINS] Archiving disabled
[JENKINS] Archiving disabled
[JENKINS] Archiving disabled
[JENKINS] Archiving disabled
[JENKINS] Archiving disabled
[JENKINS] Archiving disabled
[JENKINS] Archiving disabled
[JENKINS] Archiving disabled
[JENKINS] Archiving disabled
[JENKINS] Archiving disabled
[JENKINS] Archiving disabled
[JENKINS] Archiving disabled
[JENKINS] Archiving disabled
[JENKINS] Archiving disabled
[JENKINS] Archiving disabled
[JENKINS] Archiving disabled
[JENKINS] Archiving disabled
[JENKINS] Archiving disabled
[JENKINS] Archiving disabled
[JENKINS] Archiving disabled
[JENKINS] Archiving disabled
[JENKINS] Archiving disabled
[JENKINS] Archiving disabled
[JENKINS] Archiving disabled
[JENKINS] Archiving disabled
[JENKINS] Archiving disabled
[JENKINS] Archiving disabled
[JENKINS] Archiving disabled
[JENKINS] Archiving disabled
[JENKINS] Archiving disabled
[JENKINS] Archiving disabled
[JENKINS] Archiving disabled
[JENKINS] Archiving disabled
[JENKINS] Archiving disabled
[JENKINS] Archiving disabled
[JENKINS] Archiving disabled
[JENKINS] Archiving disabled
[JENKINS] Archiving disabled
[JENKINS] Archiving disabled
[JENKINS] Archiving disabled
[JENKINS] Archiving disabled
[JENKINS] Archiving disabled
[JENKINS] Archiving disabled
[JENKINS] Archiving disabled
[JENKINS] Archiving disabled
[JENKINS] Archiving disabled
[JENKINS] Archiving disabled
[JENKINS] Archiving disabled
[JENKINS] Archiving disabled
[JENKINS] Archiving disabled
[JENKINS] Archiving disabled
[JENKINS] Archiving disabled
Waiting for Jenkins to finish collecting data[ERROR] Failed to execute goal org.apache.maven.plugins:maven-failsafe-plugin:2.16:integration-test (default) on project org.apache.sling.event: Execution default of goal org.apache.maven.plugins:maven-failsafe-plugin:2.16:integration-test failed: The forked VM terminated without saying properly goodbye. VM crash or System.exit called ?
[ERROR] Command was/bin/sh -c cd <https://builds.apache.org/job/sling-trunk-1.8/ws/trunk/bundles/extensions/event> && /home/jenkins/jenkins-slave/tools/hudson.model.JDK/jdk-1.8.0/jre/bin/java -Xmx2048m -XX:MaxPermSize=512m -jar <https://builds.apache.org/job/sling-trunk-1.8/ws/trunk/bundles/extensions/event/target/surefire/surefirebooter1680375363189322027.jar> <https://builds.apache.org/job/sling-trunk-1.8/ws/trunk/bundles/extensions/event/target/surefire/surefire91697917979234638tmp> <https://builds.apache.org/job/sling-trunk-1.8/ws/trunk/bundles/extensions/event/target/surefire/surefire_2997249548587726700tmp>
[ERROR] -> [Help 1]
[ERROR]
[ERROR] To see the full stack trace of the errors, re-run Maven with the -e switch.
[ERROR] Re-run Maven using the -X switch to enable full debug logging.
[ERROR]
[ERROR] For more information about the errors and possible solutions, please read the following articles:
[ERROR] [Help 1] http://cwiki.apache.org/confluence/display/MAVEN/PluginExecutionException
[ERROR]
[ERROR] After correcting the problems, you can resume the build with the command
[ERROR] mvn <goals> -rf :org.apache.sling.event
Sending e-mails to: dev@sling.apache.org
Sending e-mails to: dev@sling.apache.org
Sending e-mails to: dev@sling.apache.org
channel stopped
Build failed in Jenkins: sling-trunk-1.8 #28
Posted by Apache Jenkins Server <je...@builds.apache.org>.
See <https://builds.apache.org/job/sling-trunk-1.8/28/changes>
Changes:
[rombert] [maven-release-plugin] prepare for next development iteration
[rombert] [maven-release-plugin] prepare release org.apache.sling.query-2.0.0
[rombert] sling-query - remove CHANGELOG.md and bump version to 2.0.0-SNAPSHOT
See discussion at http://sling-dev.markmail.org/thread/xiruzia372scxqzb#query:+page:1+mid:mzrdqgooezpz43cz+state:results
[rombert] Added sling-query to the contrib reactor
[rombert] Use latest parent
[bdelacretaz] By default, stop intepreting the crankstart file once framework is started, except on first startup
[asanso] SLING-3815 - Add support for X-Content-Type-Options: nosniff
------------------------------------------
[...truncated 28981 lines...]
[INFO] Apache Sling System Bundle Extension: XML APIs .... SUCCESS [3.680s]
[INFO] Apache Sling System Bundle Extension: Activation API SUCCESS [3.883s]
[INFO] Apache Sling System Bundle Extension: WS APIs ..... SUCCESS [5.220s]
[INFO] Apache Sling Dynamic Class Loader Support ......... SUCCESS [17.590s]
[INFO] Apache Sling Commons Java Compiler ................ SUCCESS [8.962s]
[INFO] Apache Sling JSON Library ......................... SUCCESS [11.472s]
[INFO] Apache Sling SLF4J Implementation (Logback) ....... SUCCESS [44.677s]
[INFO] Apache Sling OSGi LogService Implementation ....... SUCCESS [5.650s]
[INFO] Apache Sling MIME type mapping support ............ SUCCESS [9.152s]
[INFO] Apache Sling Commons OSGi support ................. SUCCESS [9.120s]
[INFO] Apache Sling Scheduler Support .................... SUCCESS [6.185s]
[INFO] Apache Sling Testing Utilities .................... SUCCESS [18.484s]
[INFO] Apache Sling Thread Dumper ........................ SUCCESS [8.930s]
[INFO] Apache Sling Thread Support ....................... SUCCESS [14.802s]
[INFO] Apache Sling Authentication Service ............... SUCCESS [12.491s]
[INFO] Apache Sling OpenID Authentication ................ SUCCESS [9.008s]
[INFO] Apache Sling Form Based Authentication Handler .... SUCCESS [12.350s]
[INFO] Apache Sling Authentication Selector .............. SUCCESS [9.439s]
[INFO] Apache Sling Engine Implementation ................ SUCCESS [29.757s]
[INFO] Apache Sling Repository API Bundle ................ SUCCESS [3.607s]
[INFO] Apache Sling JCR Base Bundle ...................... SUCCESS [12.144s]
[INFO] Apache Sling JCR ClassLoader ...................... SUCCESS [5.946s]
[INFO] Apache Sling Initial Content Loader ............... SUCCESS [11.991s]
[INFO] Apache Sling Jackrabbit Embedded Repository ....... SUCCESS [14.354s]
[INFO] Apache Sling Jackrabbit UserManager Support ....... SUCCESS [9.223s]
[INFO] Apache Sling Jackrabbit JSR-283 Access Control Manager Support SUCCESS [6.175s]
[INFO] Apache Sling Wrapper Bundle for the JCR API ....... SUCCESS [8.053s]
[INFO] Apache Sling JCR Resource Resolver ................ SUCCESS [35.889s]
[INFO] Apache Sling JCR Repository Registration .......... SUCCESS [6.417s]
[INFO] Apache Sling Simple WebDAV Access to repositories . SUCCESS [6.567s]
[INFO] Apache Sling DavEx Access to repositories ......... SUCCESS [9.097s]
[INFO] Apache Sling JCR WebConsole Bundle ................ SUCCESS [3.621s]
[INFO] Apache Sling Oak Repository Server ................ SUCCESS [9.123s]
[INFO] Apache Sling SlingRepository Integration Tests .... SUCCESS [44.969s]
[INFO] Apache Sling Servlet Resolver ..................... SUCCESS [9.146s]
[INFO] Apache Sling Default GET Servlets ................. SUCCESS [9.722s]
[INFO] Apache Sling Default POST Servlets ................ SUCCESS [8.912s]
[INFO] Apache Sling Compat Servlets ...................... SUCCESS [8.698s]
[INFO] Apache Sling Scripting Implementation API ......... SUCCESS [5.764s]
[INFO] Apache Sling Scripting Core implementation ........ SUCCESS [26.516s]
[INFO] Apache Sling Scripting JavaScript Support ......... SUCCESS [12.015s]
[INFO] Apache Sling Scripting JSP Support ................ SUCCESS [14.999s]
[INFO] Apache Sling JSP Tag Library ...................... SUCCESS [20.827s]
[INFO] Apache Sling JSP Standard Tag Library ............. SUCCESS [8.755s]
[INFO] Apache Sling Adapter Manager Implementation ....... SUCCESS [6.465s]
[INFO] Apache Sling Bundle Resource Provider ............. SUCCESS [6.260s]
[INFO] Apache Sling Discovery API ........................ SUCCESS [3.632s]
[INFO] Apache Sling Resource-Based Discovery Service ..... SUCCESS [2:18.728s]
[INFO] Apache Sling Discovery Support Bundle ............. SUCCESS [5.912s]
[INFO] Apache Sling Discovery Standalone Implementation .. SUCCESS [9.672s]
[INFO] Apache Sling Event Support ........................ FAILURE [5:51.759s]
[INFO] Apache Sling Feature Flags ........................ SKIPPED
[INFO] Apache Sling Filesystem Resource Provider ......... SKIPPED
[INFO] Apache Sling javax.activation bundle .............. SKIPPED
[INFO] Apache Sling Service User Mapper .................. SKIPPED
[INFO] Apache Sling Settings ............................. SKIPPED
[INFO] Apache Sling Web Console Branding ................. SKIPPED
[INFO] Apache Sling Web Console Security Provider ........ SKIPPED
[INFO] Apache Sling Groovy Extensions .................... SKIPPED
[INFO] Apache Sling Explorer ............................. SKIPPED
[INFO] Apache Sling Health Check Core .................... SKIPPED
[INFO] Apache Sling Health Check Annotations ............. SKIPPED
[INFO] Apache Sling Health Check Samples ................. SKIPPED
[INFO] Apache Sling Health Check Support Components ...... SKIPPED
[INFO] Apache Sling Health Check Webconsole Plugin ....... SKIPPED
[INFO] Apache Sling Health Check JUnit Bridge ............ SKIPPED
[INFO] Apache Sling Health Check Integration Tests ....... SKIPPED
[INFO] Apache Sling Health Check Reactor POM ............. SKIPPED
[INFO] Apache Sling Resource Access Security ............. SKIPPED
[INFO] Apache Sling Launchpad Content .................... SKIPPED
[INFO] Apache Sling Launchpad Application Builder ........ SKIPPED
[INFO] Apache Sling Resource Access Security Integration Tests SKIPPED
[INFO] Sling Models API .................................. SKIPPED
[INFO] Sling Models Implementation ....................... SKIPPED
[INFO] Apache Sling Models Integration Tests ............. SKIPPED
[INFO] Apache Sling Test Tools ........................... SKIPPED
[INFO] Apache Sling JUnit Core ........................... SKIPPED
[INFO] Apache Sling JUnit Scriptable Tests Provider ...... SKIPPED
[INFO] Apache Sling JUnit Health Checks .................. SKIPPED
[INFO] Apache Sling JUnit Remote Tests Runners ........... SKIPPED
[INFO] Apache Sling JUnit Performance .................... SKIPPED
[INFO] Apache Sling Testing Resource Resolver Mock ....... SKIPPED
[INFO] Apache Sling Pax Exam Utilities ................... SKIPPED
[INFO] Apache Sling Installer ............................ SKIPPED
[INFO] Apache Sling Installer WebConsole Plugin .......... SKIPPED
[INFO] Apache Sling File Installer ....................... SKIPPED
[INFO] Apache Sling JCR Installer ........................ SKIPPED
[INFO] Apache Sling Installer Configuration Admin Support SKIPPED
[INFO] Apache Sling Deployment Package Installer ......... SKIPPED
[INFO] Apache Sling Subsystems Installer ................. SKIPPED
[INFO] Apache Sling Installer Integration Tests .......... SKIPPED
[INFO] Apache Sling Launchpad API ........................ SKIPPED
[INFO] Apache Sling Launchpad Base ....................... SKIPPED
[INFO] Apache Sling Launchpad Installer .................. SKIPPED
[INFO] Apache Sling Sample Server-Side Tests ............. SKIPPED
[INFO] Apache Sling Failing Server-Side Tests ............ SKIPPED
[INFO] Apache Sling Sample Integration Tests ............. SKIPPED
[INFO] Apache Sling Launchpad Testing Services ........... SKIPPED
[INFO] Apache Sling Launchpad Testing Services WAR ....... SKIPPED
[INFO] Apache Sling Launchpad Testing Fragment Bundle .... SKIPPED
[INFO] Apache Sling Launchpad Test Bundles ............... SKIPPED
[INFO] Apache Sling Integration Tests .................... SKIPPED
[INFO] Apache Sling Launchpad Testing .................... SKIPPED
[INFO] Apache Sling (Builder) ............................ SKIPPED
[INFO] ------------------------------------------------------------------------
[INFO] BUILD FAILURE
[INFO] ------------------------------------------------------------------------
[INFO] Total time: 22:41.150s
[INFO] Finished at: Fri Aug 08 10:19:57 UTC 2014
[INFO] Final Memory: 124M/293M
[INFO] ------------------------------------------------------------------------
[JENKINS] Archiving disabled
[JENKINS] Archiving disabled
[JENKINS] Archiving disabled
[JENKINS] Archiving disabled
[JENKINS] Archiving disabled
[JENKINS] Archiving disabled
[JENKINS] Archiving disabled
[JENKINS] Archiving disabled
[JENKINS] Archiving disabled
[JENKINS] Archiving disabled
[JENKINS] Archiving disabled
[JENKINS] Archiving disabled
[JENKINS] Archiving disabled
[JENKINS] Archiving disabled
[JENKINS] Archiving disabled
[JENKINS] Archiving disabled
[JENKINS] Archiving disabled
[JENKINS] Archiving disabled
[JENKINS] Archiving disabled
[JENKINS] Archiving disabled
[JENKINS] Archiving disabled
[JENKINS] Archiving disabled
[JENKINS] Archiving disabled
[JENKINS] Archiving disabled
[JENKINS] Archiving disabled
[JENKINS] Archiving disabled
[JENKINS] Archiving disabled
[JENKINS] Archiving disabled
[JENKINS] Archiving disabled
[JENKINS] Archiving disabled
[JENKINS] Archiving disabled
[JENKINS] Archiving disabled
[JENKINS] Archiving disabled
[JENKINS] Archiving disabled
[JENKINS] Archiving disabled
[JENKINS] Archiving disabled
[JENKINS] Archiving disabled
[JENKINS] Archiving disabled
[JENKINS] Archiving disabled
[JENKINS] Archiving disabled
[JENKINS] Archiving disabled
[JENKINS] Archiving disabled
[JENKINS] Archiving disabled
[JENKINS] Archiving disabled
[JENKINS] Archiving disabled
[JENKINS] Archiving disabled
[JENKINS] Archiving disabled
[JENKINS] Archiving disabled
[JENKINS] Archiving disabled
[JENKINS] Archiving disabled
[JENKINS] Archiving disabled
[JENKINS] Archiving disabled
[JENKINS] Archiving disabled
[JENKINS] Archiving disabled
[JENKINS] Archiving disabled
[JENKINS] Archiving disabled
[JENKINS] Archiving disabled
[JENKINS] Archiving disabled
[JENKINS] Archiving disabled
[JENKINS] Archiving disabled
[JENKINS] Archiving disabled
[JENKINS] Archiving disabled
[JENKINS] Archiving disabled
[JENKINS] Archiving disabled
[JENKINS] Archiving disabled
[JENKINS] Archiving disabled
[JENKINS] Archiving disabled
[JENKINS] Archiving disabled
[JENKINS] Archiving disabled
[JENKINS] Archiving disabled
[JENKINS] Archiving disabled
[JENKINS] Archiving disabled
[JENKINS] Archiving disabled
[JENKINS] Archiving disabled
[JENKINS] Archiving disabled
[JENKINS] Archiving disabled
[JENKINS] Archiving disabled
[JENKINS] Archiving disabled
[JENKINS] Archiving disabled
[JENKINS] Archiving disabled
[JENKINS] Archiving disabled
[JENKINS] Archiving disabled
[JENKINS] Archiving disabled
[JENKINS] Archiving disabled
[JENKINS] Archiving disabled
[JENKINS] Archiving disabled
[JENKINS] Archiving disabled
[JENKINS] Archiving disabled
[JENKINS] Archiving disabled
[JENKINS] Archiving disabled
[JENKINS] Archiving disabled
[JENKINS] Archiving disabled
[JENKINS] Archiving disabled
[JENKINS] Archiving disabled
[JENKINS] Archiving disabled
[JENKINS] Archiving disabled
[JENKINS] Archiving disabled
[JENKINS] Archiving disabled
[JENKINS] Archiving disabled
[JENKINS] Archiving disabled
[JENKINS] Archiving disabled
[JENKINS] Archiving disabled
[JENKINS] Archiving disabled
[JENKINS] Archiving disabled
[JENKINS] Archiving disabled
[JENKINS] Archiving disabled
[JENKINS] Archiving disabled
[JENKINS] Archiving disabled
[JENKINS] Archiving disabled
[JENKINS] Archiving disabled
[JENKINS] Archiving disabled
[JENKINS] Archiving disabled
[JENKINS] Archiving disabled
[JENKINS] Archiving disabled
[JENKINS] Archiving disabled
[JENKINS] Archiving disabled
[JENKINS] Archiving disabled
[JENKINS] Archiving disabled
[JENKINS] Archiving disabled
[JENKINS] Archiving disabled
[JENKINS] Archiving disabled
Waiting for Jenkins to finish collecting data[ERROR] Failed to execute goal org.apache.maven.plugins:maven-failsafe-plugin:2.16:integration-test (default) on project org.apache.sling.event: Execution default of goal org.apache.maven.plugins:maven-failsafe-plugin:2.16:integration-test failed: The forked VM terminated without saying properly goodbye. VM crash or System.exit called ?
[ERROR] Command was/bin/sh -c cd <https://builds.apache.org/job/sling-trunk-1.8/ws/trunk/bundles/extensions/event> && /home/jenkins/jenkins-slave/tools/hudson.model.JDK/jdk-1.8.0/jre/bin/java -Xmx2048m -XX:MaxPermSize=512m -jar <https://builds.apache.org/job/sling-trunk-1.8/ws/trunk/bundles/extensions/event/target/surefire/surefirebooter5265944833323360374.jar> <https://builds.apache.org/job/sling-trunk-1.8/ws/trunk/bundles/extensions/event/target/surefire/surefire4971457014147675903tmp> <https://builds.apache.org/job/sling-trunk-1.8/ws/trunk/bundles/extensions/event/target/surefire/surefire_29038718456189980875tmp>
[ERROR] -> [Help 1]
[ERROR]
[ERROR] To see the full stack trace of the errors, re-run Maven with the -e switch.
[ERROR] Re-run Maven using the -X switch to enable full debug logging.
[ERROR]
[ERROR] For more information about the errors and possible solutions, please read the following articles:
[ERROR] [Help 1] http://cwiki.apache.org/confluence/display/MAVEN/PluginExecutionException
[ERROR]
[ERROR] After correcting the problems, you can resume the build with the command
[ERROR] mvn <goals> -rf :org.apache.sling.event
Sending e-mails to: dev@sling.apache.org
Sending e-mails to: dev@sling.apache.org
Sending e-mails to: dev@sling.apache.org
channel stopped
Build failed in Jenkins: sling-trunk-1.8 #27
Posted by Apache Jenkins Server <je...@builds.apache.org>.
See <https://builds.apache.org/job/sling-trunk-1.8/27/>
------------------------------------------
Failed to access build log
java.io.IOException: remote file operation failed: /home/jenkins/jenkins-slave/workspace/sling-trunk-1.8 at hudson.remoting.Channel@1c7953ff:ubuntu-2
at hudson.FilePath.act(FilePath.java:910)
at hudson.FilePath.act(FilePath.java:887)
at hudson.FilePath.toURI(FilePath.java:1036)
at hudson.tasks.MailSender.createFailureMail(MailSender.java:278)
at hudson.tasks.MailSender.getMail(MailSender.java:153)
at hudson.tasks.MailSender.execute(MailSender.java:101)
at hudson.maven.MavenModuleSetBuild$MavenModuleSetBuildExecution.cleanUp(MavenModuleSetBuild.java:1058)
at hudson.model.Run.execute(Run.java:1721)
at hudson.maven.MavenModuleSetBuild.run(MavenModuleSetBuild.java:529)
at hudson.model.ResourceController.execute(ResourceController.java:88)
at hudson.model.Executor.run(Executor.java:231)
Caused by: hudson.remoting.ChannelClosedException: channel is already closed
at hudson.remoting.Channel.send(Channel.java:524)
at hudson.remoting.Request.call(Request.java:129)
at hudson.remoting.Channel.call(Channel.java:722)
at hudson.FilePath.act(FilePath.java:903)
... 10 more
Caused by: java.io.IOException
at hudson.remoting.Channel.close(Channel.java:1007)
at hudson.slaves.ChannelPinger$1.onDead(ChannelPinger.java:110)
at hudson.remoting.PingThread.ping(PingThread.java:120)
at hudson.remoting.PingThread.run(PingThread.java:81)
Caused by: java.util.concurrent.TimeoutException: Ping started on 1407471206259 hasn't completed at 1407471446259
... 2 more
Jenkins build is still unstable: sling-trunk-1.8 #26
Posted by Apache Jenkins Server <je...@builds.apache.org>.
See <https://builds.apache.org/job/sling-trunk-1.8/changes>