You are viewing a plain text version of this content. The canonical link for it is here.
Posted to builds@mesos.apache.org by Apache Jenkins Server <je...@builds.apache.org> on 2017/09/01 02:56:55 UTC
Build failed in Jenkins: Mesos-Buildbot » autotools,clang,--verbose,GLOG_v=1 MESOS_VERBOSE=1,ubuntu:14.04,(ubuntu)&&(!ubuntu-us1)&&(!ubuntu-eu2) #4178
See <https://builds.apache.org/job/Mesos-Buildbot/BUILDTOOL=autotools,COMPILER=clang,CONFIGURATION=--verbose,ENVIRONMENT=GLOG_v=1%20MESOS_VERBOSE=1,OS=ubuntu%3A14.04,label_exp=(ubuntu)&&(!ubuntu-us1)&&(!ubuntu-eu2)/4178/display/redirect?page=changes>
Changes:
[benjamin.hindman] Added an undiscardable() helper that blocks discards from propagating.
------------------------------------------
[...truncated 31.10 MB...]
I0901 02:56:48.236284 4072 slave.cpp:253] Flags at startup: --acls="" --appc_simple_discovery_uri_prefix="http://" --appc_store_dir="/tmp/Endpoint_SlaveEndpointTest_AuthorizedRequest_2_kPFtNN/store/appc" --authenticate_http_readonly="true" --authenticate_http_readwrite="true" --authenticatee="crammd5" --authentication_backoff_factor="1secs" --authorizer="local" --cgroups_cpu_enable_pids_and_tids_count="false" --cgroups_enable_cfs="false" --cgroups_hierarchy="/sys/fs/cgroup" --cgroups_limit_swap="false" --cgroups_root="mesos" --container_disk_watch_interval="15secs" --containerizers="mesos" --credential="/tmp/Endpoint_SlaveEndpointTest_AuthorizedRequest_2_kPFtNN/credential" --default_role="*" --disallow_sharing_agent_pid_namespace="false" --disk_watch_interval="1mins" --docker="docker" --docker_kill_orphans="true" --docker_registry="https://registry-1.docker.io" --docker_remove_delay="6hrs" --docker_socket="/var/run/docker.sock" --docker_stop_timeout="0ns" --docker_store_dir="/tmp/Endpoint_SlaveEndpointTest_AuthorizedRequest_2_kPFtNN/store/docker" --docker_volume_checkpoint_dir="/var/run/mesos/isolators/docker/volume" --enforce_container_disk_quota="false" --executor_registration_timeout="1mins" --executor_reregistration_timeout="2secs" --executor_shutdown_grace_period="5secs" --fetcher_cache_dir="/tmp/Endpoint_SlaveEndpointTest_AuthorizedRequest_2_kPFtNN/fetch" --fetcher_cache_size="2GB" --frameworks_home="" --gc_delay="1weeks" --gc_disk_headroom="0.1" --hadoop_home="" --help="false" --hostname_lookup="true" --http_command_executor="false" --http_credentials="/tmp/Endpoint_SlaveEndpointTest_AuthorizedRequest_2_kPFtNN/http_credentials" --http_heartbeat_interval="30secs" --initialize_driver_logging="true" --isolation="posix/cpu,posix/mem" --launcher="posix" --launcher_dir="/mesos/mesos-1.5.0/_build/src" --logbufsecs="0" --logging_level="INFO" --max_completed_executors_per_framework="150" --oversubscribed_resources_interval="15secs" --perf_duration="10secs" --perf_interval="1mins" --port="5051" --qos_correction_interval_min="0ns" --quiet="false" --recover="reconnect" --recovery_timeout="15mins" --registration_backoff_factor="10ms" --resources="cpus:2;gpus:0;mem:1024;disk:1024;ports:[31000-32000]" --revocable_cpu_low_priority="true" --runtime_dir="/tmp/Endpoint_SlaveEndpointTest_AuthorizedRequest_2_kPFtNN" --sandbox_directory="/mnt/mesos/sandbox" --strict="true" --switch_user="true" --systemd_enable_support="true" --systemd_runtime_directory="/run/systemd/system" --version="false" --work_dir="/tmp/Endpoint_SlaveEndpointTest_AuthorizedRequest_2_JyYTgE" --zk_session_timeout="10secs"
I0901 02:56:48.236912 4072 credentials.hpp:86] Loading credential for authentication from '/tmp/Endpoint_SlaveEndpointTest_AuthorizedRequest_2_kPFtNN/credential'
I0901 02:56:48.237107 4072 slave.cpp:285] Agent using credential for: test-principal
I0901 02:56:48.237139 4072 credentials.hpp:37] Loading credentials for authentication from '/tmp/Endpoint_SlaveEndpointTest_AuthorizedRequest_2_kPFtNN/http_credentials'
I0901 02:56:48.237470 4072 http.cpp:1045] Creating default 'basic' HTTP authenticator for realm 'mesos-agent-readonly'
I0901 02:56:48.237632 4072 http.cpp:1045] Creating default 'basic' HTTP authenticator for realm 'mesos-agent-readwrite'
I0901 02:56:48.238947 4072 slave.cpp:581] Agent resources: [{"name":"cpus","scalar":{"value":2.0},"type":"SCALAR"},{"name":"mem","scalar":{"value":1024.0},"type":"SCALAR"},{"name":"disk","scalar":{"value":1024.0},"type":"SCALAR"},{"name":"ports","ranges":{"range":[{"begin":31000,"end":32000}]},"type":"RANGES"}]
I0901 02:56:48.239178 4072 slave.cpp:589] Agent attributes: [ ]
I0901 02:56:48.239193 4072 slave.cpp:598] Agent hostname: b62cfd6078a9
I0901 02:56:48.239346 4078 status_update_manager.cpp:177] Pausing sending status updates
I0901 02:56:48.240731 4067 state.cpp:64] Recovering state from '/tmp/Endpoint_SlaveEndpointTest_AuthorizedRequest_2_JyYTgE/meta'
I0901 02:56:48.241047 4076 status_update_manager.cpp:203] Recovering status update manager
I0901 02:56:48.241240 4084 containerizer.cpp:646] Recovering containerizer
I0901 02:56:48.242487 4083 provisioner.cpp:416] Provisioner recovery complete
I0901 02:56:48.242812 4072 slave.cpp:6296] Finished recovery
I0901 02:56:48.243280 4072 slave.cpp:6478] Querying resource estimator for oversubscribable resources
I0901 02:56:48.243502 4069 slave.cpp:6492] Received oversubscribable resources {} from the resource estimator
I0901 02:56:48.246073 4075 process.cpp:3956] Handling HTTP event for process 'slave(809)' with path: '/slave(809)/containers'
I0901 02:56:48.247251 4080 http.cpp:1185] HTTP GET for /slave(809)/containers from 172.17.0.3:38028
I0901 02:56:48.247323 4080 http.cpp:976] Authorizing principal 'test-principal' to GET the '/containers' endpoint
I0901 02:56:48.250385 4065 slave.cpp:859] Agent terminating
[ OK ] Endpoint/SlaveEndpointTest.AuthorizedRequest/2 (28 ms)
[ RUN ] Endpoint/SlaveEndpointTest.UnauthorizedRequest/0
I0901 02:56:48.261133 4043 containerizer.cpp:290] Using isolation { environment_secret, posix/cpu, posix/mem, filesystem/posix, network/cni }
W0901 02:56:48.261615 4043 backend.cpp:76] Failed to create 'aufs' backend: AufsBackend requires root privileges
W0901 02:56:48.261734 4043 backend.cpp:76] Failed to create 'bind' backend: BindBackend requires root privileges
I0901 02:56:48.261770 4043 provisioner.cpp:255] Using default backend 'copy'
I0901 02:56:48.265203 4084 slave.cpp:252] Mesos agent started on (810)@172.17.0.3:43775
I0901 02:56:48.265239 4084 slave.cpp:253] Flags at startup: --acls="" --appc_simple_discovery_uri_prefix="http://" --appc_store_dir="/tmp/Endpoint_SlaveEndpointTest_UnauthorizedRequest_0_GsMp8p/store/appc" --authenticate_http_readonly="true" --authenticate_http_readwrite="true" --authenticatee="crammd5" --authentication_backoff_factor="1secs" --authorizer="local" --cgroups_cpu_enable_pids_and_tids_count="false" --cgroups_enable_cfs="false" --cgroups_hierarchy="/sys/fs/cgroup" --cgroups_limit_swap="false" --cgroups_root="mesos" --container_disk_watch_interval="15secs" --containerizers="mesos" --credential="/tmp/Endpoint_SlaveEndpointTest_UnauthorizedRequest_0_GsMp8p/credential" --default_role="*" --disallow_sharing_agent_pid_namespace="false" --disk_watch_interval="1mins" --docker="docker" --docker_kill_orphans="true" --docker_registry="https://registry-1.docker.io" --docker_remove_delay="6hrs" --docker_socket="/var/run/docker.sock" --docker_stop_timeout="0ns" --docker_store_dir="/tmp/Endpoint_SlaveEndpointTest_UnauthorizedRequest_0_GsMp8p/store/docker" --docker_volume_checkpoint_dir="/var/run/mesos/isolators/docker/volume" --enforce_container_disk_quota="false" --executor_registration_timeout="1mins" --executor_reregistration_timeout="2secs" --executor_shutdown_grace_period="5secs" --fetcher_cache_dir="/tmp/Endpoint_SlaveEndpointTest_UnauthorizedRequest_0_GsMp8p/fetch" --fetcher_cache_size="2GB" --frameworks_home="" --gc_delay="1weeks" --gc_disk_headroom="0.1" --hadoop_home="" --help="false" --hostname_lookup="true" --http_command_executor="false" --http_credentials="/tmp/Endpoint_SlaveEndpointTest_UnauthorizedRequest_0_GsMp8p/http_credentials" --http_heartbeat_interval="30secs" --initialize_driver_logging="true" --isolation="posix/cpu,posix/mem" --launcher="posix" --launcher_dir="/mesos/mesos-1.5.0/_build/src" --logbufsecs="0" --logging_level="INFO" --max_completed_executors_per_framework="150" --oversubscribed_resources_interval="15secs" --perf_duration="10secs" --perf_interval="1mins" --port="5051" --qos_correction_interval_min="0ns" --quiet="false" --recover="reconnect" --recovery_timeout="15mins" --registration_backoff_factor="10ms" --resources="cpus:2;gpus:0;mem:1024;disk:1024;ports:[31000-32000]" --revocable_cpu_low_priority="true" --runtime_dir="/tmp/Endpoint_SlaveEndpointTest_UnauthorizedRequest_0_GsMp8p" --sandbox_directory="/mnt/mesos/sandbox" --strict="true" --switch_user="true" --systemd_enable_support="true" --systemd_runtime_directory="/run/systemd/system" --version="false" --work_dir="/tmp/Endpoint_SlaveEndpointTest_UnauthorizedRequest_0_p7Ewxg" --zk_session_timeout="10secs"
I0901 02:56:48.265599 4084 credentials.hpp:86] Loading credential for authentication from '/tmp/Endpoint_SlaveEndpointTest_UnauthorizedRequest_0_GsMp8p/credential'
I0901 02:56:48.265748 4084 slave.cpp:285] Agent using credential for: test-principal
I0901 02:56:48.265771 4084 credentials.hpp:37] Loading credentials for authentication from '/tmp/Endpoint_SlaveEndpointTest_UnauthorizedRequest_0_GsMp8p/http_credentials'
I0901 02:56:48.265998 4084 http.cpp:1045] Creating default 'basic' HTTP authenticator for realm 'mesos-agent-readonly'
I0901 02:56:48.266157 4084 http.cpp:1045] Creating default 'basic' HTTP authenticator for realm 'mesos-agent-readwrite'
I0901 02:56:48.267474 4084 slave.cpp:581] Agent resources: [{"name":"cpus","scalar":{"value":2.0},"type":"SCALAR"},{"name":"mem","scalar":{"value":1024.0},"type":"SCALAR"},{"name":"disk","scalar":{"value":1024.0},"type":"SCALAR"},{"name":"ports","ranges":{"range":[{"begin":31000,"end":32000}]},"type":"RANGES"}]
I0901 02:56:48.267690 4084 slave.cpp:589] Agent attributes: [ ]
I0901 02:56:48.267704 4084 slave.cpp:598] Agent hostname: b62cfd6078a9
I0901 02:56:48.267837 4065 status_update_manager.cpp:177] Pausing sending status updates
I0901 02:56:48.269290 4067 state.cpp:64] Recovering state from '/tmp/Endpoint_SlaveEndpointTest_UnauthorizedRequest_0_p7Ewxg/meta'
I0901 02:56:48.269567 4063 status_update_manager.cpp:203] Recovering status update manager
I0901 02:56:48.269759 4073 containerizer.cpp:646] Recovering containerizer
I0901 02:56:48.271006 4081 provisioner.cpp:416] Provisioner recovery complete
I0901 02:56:48.271337 4072 slave.cpp:6296] Finished recovery
I0901 02:56:48.271826 4072 slave.cpp:6478] Querying resource estimator for oversubscribable resources
I0901 02:56:48.272044 4064 slave.cpp:6492] Received oversubscribable resources {} from the resource estimator
I0901 02:56:48.274618 4075 process.cpp:3956] Handling HTTP event for process 'slave(810)' with path: '/slave(810)/monitor/statistics'
I0901 02:56:48.275776 4069 http.cpp:1185] HTTP GET for /slave(810)/monitor/statistics from 172.17.0.3:38034
I0901 02:56:48.275846 4069 http.cpp:976] Authorizing principal 'test-principal' to GET the '/monitor/statistics' endpoint
I0901 02:56:48.277551 4068 slave.cpp:859] Agent terminating
[ OK ] Endpoint/SlaveEndpointTest.UnauthorizedRequest/0 (27 ms)
[ RUN ] Endpoint/SlaveEndpointTest.UnauthorizedRequest/1
I0901 02:56:48.288480 4043 containerizer.cpp:290] Using isolation { environment_secret, posix/cpu, posix/mem, filesystem/posix, network/cni }
W0901 02:56:48.288969 4043 backend.cpp:76] Failed to create 'aufs' backend: AufsBackend requires root privileges
W0901 02:56:48.289082 4043 backend.cpp:76] Failed to create 'bind' backend: BindBackend requires root privileges
I0901 02:56:48.289117 4043 provisioner.cpp:255] Using default backend 'copy'
I0901 02:56:48.292512 4082 slave.cpp:252] Mesos agent started on (811)@172.17.0.3:43775
I0901 02:56:48.292546 4082 slave.cpp:253] Flags at startup: --acls="" --appc_simple_discovery_uri_prefix="http://" --appc_store_dir="/tmp/Endpoint_SlaveEndpointTest_UnauthorizedRequest_1_0GHPJ2/store/appc" --authenticate_http_readonly="true" --authenticate_http_readwrite="true" --authenticatee="crammd5" --authentication_backoff_factor="1secs" --authorizer="local" --cgroups_cpu_enable_pids_and_tids_count="false" --cgroups_enable_cfs="false" --cgroups_hierarchy="/sys/fs/cgroup" --cgroups_limit_swap="false" --cgroups_root="mesos" --container_disk_watch_interval="15secs" --containerizers="mesos" --credential="/tmp/Endpoint_SlaveEndpointTest_UnauthorizedRequest_1_0GHPJ2/credential" --default_role="*" --disallow_sharing_agent_pid_namespace="false" --disk_watch_interval="1mins" --docker="docker" --docker_kill_orphans="true" --docker_registry="https://registry-1.docker.io" --docker_remove_delay="6hrs" --docker_socket="/var/run/docker.sock" --docker_stop_timeout="0ns" --docker_store_dir="/tmp/Endpoint_SlaveEndpointTest_UnauthorizedRequest_1_0GHPJ2/store/docker" --docker_volume_checkpoint_dir="/var/run/mesos/isolators/docker/volume" --enforce_container_disk_quota="false" --executor_registration_timeout="1mins" --executor_reregistration_timeout="2secs" --executor_shutdown_grace_period="5secs" --fetcher_cache_dir="/tmp/Endpoint_SlaveEndpointTest_UnauthorizedRequest_1_0GHPJ2/fetch" --fetcher_cache_size="2GB" --frameworks_home="" --gc_delay="1weeks" --gc_disk_headroom="0.1" --hadoop_home="" --help="false" --hostname_lookup="true" --http_command_executor="false" --http_credentials="/tmp/Endpoint_SlaveEndpointTest_UnauthorizedRequest_1_0GHPJ2/http_credentials" --http_heartbeat_interval="30secs" --initialize_driver_logging="true" --isolation="posix/cpu,posix/mem" --launcher="posix" --launcher_dir="/mesos/mesos-1.5.0/_build/src" --logbufsecs="0" --logging_level="INFO" --max_completed_executors_per_framework="150" --oversubscribed_resources_interval="15secs" --perf_duration="10secs" --perf_interval="1mins" --port="5051" --qos_correction_interval_min="0ns" --quiet="false" --recover="reconnect" --recovery_timeout="15mins" --registration_backoff_factor="10ms" --resources="cpus:2;gpus:0;mem:1024;disk:1024;ports:[31000-32000]" --revocable_cpu_low_priority="true" --runtime_dir="/tmp/Endpoint_SlaveEndpointTest_UnauthorizedRequest_1_0GHPJ2" --sandbox_directory="/mnt/mesos/sandbox" --strict="true" --switch_user="true" --systemd_enable_support="true" --systemd_runtime_directory="/run/systemd/system" --version="false" --work_dir="/tmp/Endpoint_SlaveEndpointTest_UnauthorizedRequest_1_9iUR4S" --zk_session_timeout="10secs"
I0901 02:56:48.292937 4082 credentials.hpp:86] Loading credential for authentication from '/tmp/Endpoint_SlaveEndpointTest_UnauthorizedRequest_1_0GHPJ2/credential'
I0901 02:56:48.293084 4082 slave.cpp:285] Agent using credential for: test-principal
I0901 02:56:48.293107 4082 credentials.hpp:37] Loading credentials for authentication from '/tmp/Endpoint_SlaveEndpointTest_UnauthorizedRequest_1_0GHPJ2/http_credentials'
I0901 02:56:48.293330 4082 http.cpp:1045] Creating default 'basic' HTTP authenticator for realm 'mesos-agent-readonly'
I0901 02:56:48.293490 4082 http.cpp:1045] Creating default 'basic' HTTP authenticator for realm 'mesos-agent-readwrite'
I0901 02:56:48.294826 4082 slave.cpp:581] Agent resources: [{"name":"cpus","scalar":{"value":2.0},"type":"SCALAR"},{"name":"mem","scalar":{"value":1024.0},"type":"SCALAR"},{"name":"disk","scalar":{"value":1024.0},"type":"SCALAR"},{"name":"ports","ranges":{"range":[{"begin":31000,"end":32000}]},"type":"RANGES"}]
I0901 02:56:48.295048 4082 slave.cpp:589] Agent attributes: [ ]
I0901 02:56:48.295064 4082 slave.cpp:598] Agent hostname: b62cfd6078a9
I0901 02:56:48.295213 4068 status_update_manager.cpp:177] Pausing sending status updates
I0901 02:56:48.296639 4067 state.cpp:64] Recovering state from '/tmp/Endpoint_SlaveEndpointTest_UnauthorizedRequest_1_9iUR4S/meta'
I0901 02:56:48.296912 4074 status_update_manager.cpp:203] Recovering status update manager
I0901 02:56:48.297116 4073 containerizer.cpp:646] Recovering containerizer
I0901 02:56:48.298375 4080 provisioner.cpp:416] Provisioner recovery complete
I0901 02:56:48.298684 4082 slave.cpp:6296] Finished recovery
I0901 02:56:48.299118 4082 slave.cpp:6478] Querying resource estimator for oversubscribable resources
I0901 02:56:48.299326 4078 slave.cpp:6492] Received oversubscribable resources {} from the resource estimator
I0901 02:56:48.301868 4071 process.cpp:3956] Handling HTTP event for process 'slave(811)' with path: '/slave(811)/monitor/statistics.json'
I0901 02:56:48.302994 4079 http.cpp:1185] HTTP GET for /slave(811)/monitor/statistics.json from 172.17.0.3:38040
I0901 02:56:48.303071 4079 http.cpp:976] Authorizing principal 'test-principal' to GET the '/monitor/statistics.json' endpoint
I0901 02:56:48.304767 4043 slave.cpp:859] Agent terminating
[ OK ] Endpoint/SlaveEndpointTest.UnauthorizedRequest/1 (27 ms)
[ RUN ] Endpoint/SlaveEndpointTest.UnauthorizedRequest/2
I0901 02:56:48.316114 4043 containerizer.cpp:290] Using isolation { environment_secret, posix/cpu, posix/mem, filesystem/posix, network/cni }
W0901 02:56:48.316591 4043 backend.cpp:76] Failed to create 'aufs' backend: AufsBackend requires root privileges
W0901 02:56:48.316702 4043 backend.cpp:76] Failed to create 'bind' backend: BindBackend requires root privileges
I0901 02:56:48.316736 4043 provisioner.cpp:255] Using default backend 'copy'
I0901 02:56:48.320734 4082 slave.cpp:252] Mesos agent started on (812)@172.17.0.3:43775
I0901 02:56:48.320768 4082 slave.cpp:253] Flags at startup: --acls="" --appc_simple_discovery_uri_prefix="http://" --appc_store_dir="/tmp/Endpoint_SlaveEndpointTest_UnauthorizedRequest_2_cuEFBF/store/appc" --authenticate_http_readonly="true" --authenticate_http_readwrite="true" --authenticatee="crammd5" --authentication_backoff_factor="1secs" --authorizer="local" --cgroups_cpu_enable_pids_and_tids_count="false" --cgroups_enable_cfs="false" --cgroups_hierarchy="/sys/fs/cgroup" --cgroups_limit_swap="false" --cgroups_root="mesos" --container_disk_watch_interval="15secs" --containerizers="mesos" --credential="/tmp/Endpoint_SlaveEndpointTest_UnauthorizedRequest_2_cuEFBF/credential" --default_role="*" --disallow_sharing_agent_pid_namespace="false" --disk_watch_interval="1mins" --docker="docker" --docker_kill_orphans="true" --docker_registry="https://registry-1.docker.io" --docker_remove_delay="6hrs" --docker_socket="/var/run/docker.sock" --docker_stop_timeout="0ns" --docker_store_dir="/tmp/Endpoint_SlaveEndpointTest_UnauthorizedRequest_2_cuEFBF/store/docker" --docker_volume_checkpoint_dir="/var/run/mesos/isolators/docker/volume" --enforce_container_disk_quota="false" --executor_registration_timeout="1mins" --executor_reregistration_timeout="2secs" --executor_shutdown_grace_period="5secs" --fetcher_cache_dir="/tmp/Endpoint_SlaveEndpointTest_UnauthorizedRequest_2_cuEFBF/fetch" --fetcher_cache_size="2GB" --frameworks_home="" --gc_delay="1weeks" --gc_disk_headroom="0.1" --hadoop_home="" --help="false" --hostname_lookup="true" --http_command_executor="false" --http_credentials="/tmp/Endpoint_SlaveEndpointTest_UnauthorizedRequest_2_cuEFBF/http_credentials" --http_heartbeat_interval="30secs" --initialize_driver_logging="true" --isolation="posix/cpu,posix/mem" --launcher="posix" --launcher_dir="/mesos/mesos-1.5.0/_build/src" --logbufsecs="0" --logging_level="INFO" --max_completed_executors_per_framework="150" --oversubscribed_resources_interval="15secs" --perf_duration="10secs" --perf_interval="1mins" --port="5051" --qos_correction_interval_min="0ns" --quiet="false" --recover="reconnect" --recovery_timeout="15mins" --registration_backoff_factor="10ms" --resources="cpus:2;gpus:0;mem:1024;disk:1024;ports:[31000-32000]" --revocable_cpu_low_priority="true" --runtime_dir="/tmp/Endpoint_SlaveEndpointTest_UnauthorizedRequest_2_cuEFBF" --sandbox_directory="/mnt/mesos/sandbox" --strict="true" --switch_user="true" --systemd_enable_support="true" --systemd_runtime_directory="/run/systemd/system" --version="false" --work_dir="/tmp/Endpoint_SlaveEndpointTest_UnauthorizedRequest_2_nnzASv" --zk_session_timeout="10secs"
I0901 02:56:48.321135 4082 credentials.hpp:86] Loading credential for authentication from '/tmp/Endpoint_SlaveEndpointTest_UnauthorizedRequest_2_cuEFBF/credential'
I0901 02:56:48.321291 4082 slave.cpp:285] Agent using credential for: test-principal
I0901 02:56:48.321316 4082 credentials.hpp:37] Loading credentials for authentication from '/tmp/Endpoint_SlaveEndpointTest_UnauthorizedRequest_2_cuEFBF/http_credentials'
I0901 02:56:48.321542 4082 http.cpp:1045] Creating default 'basic' HTTP authenticator for realm 'mesos-agent-readonly'
I0901 02:56:48.321705 4082 http.cpp:1045] Creating default 'basic' HTTP authenticator for realm 'mesos-agent-readwrite'
I0901 02:56:48.323048 4082 slave.cpp:581] Agent resources: [{"name":"cpus","scalar":{"value":2.0},"type":"SCALAR"},{"name":"mem","scalar":{"value":1024.0},"type":"SCALAR"},{"name":"disk","scalar":{"value":1024.0},"type":"SCALAR"},{"name":"ports","ranges":{"range":[{"begin":31000,"end":32000}]},"type":"RANGES"}]
I0901 02:56:48.323269 4082 slave.cpp:589] Agent attributes: [ ]
I0901 02:56:48.323285 4082 slave.cpp:598] Agent hostname: b62cfd6078a9
I0901 02:56:48.323410 4074 status_update_manager.cpp:177] Pausing sending status updates
I0901 02:56:48.324858 4076 state.cpp:64] Recovering state from '/tmp/Endpoint_SlaveEndpointTest_UnauthorizedRequest_2_nnzASv/meta'
I0901 02:56:48.325084 4062 status_update_manager.cpp:203] Recovering status update manager
I0901 02:56:48.325247 4071 containerizer.cpp:646] Recovering containerizer
I0901 02:56:48.326496 4075 provisioner.cpp:416] Provisioner recovery complete
I0901 02:56:48.326815 4082 slave.cpp:6296] Finished recovery
I0901 02:56:48.327263 4082 slave.cpp:6478] Querying resource estimator for oversubscribable resources
I0901 02:56:48.327499 4077 slave.cpp:6492] Received oversubscribable resources {} from the resource estimator
I0901 02:56:48.330000 4080 process.cpp:3956] Handling HTTP event for process 'slave(812)' with path: '/slave(812)/containers'
I0901 02:56:48.331194 4084 http.cpp:1185] HTTP GET for /slave(812)/containers from 172.17.0.3:38044
I0901 02:56:48.331269 4084 http.cpp:976] Authorizing principal 'test-principal' to GET the '/containers' endpoint
I0901 02:56:48.332981 4084 slave.cpp:859] Agent terminating
[ OK ] Endpoint/SlaveEndpointTest.UnauthorizedRequest/2 (27 ms)
[ RUN ] Endpoint/SlaveEndpointTest.NoAuthorizer/0
I0901 02:56:48.344094 4043 containerizer.cpp:290] Using isolation { environment_secret, posix/cpu, posix/mem, filesystem/posix, network/cni }
W0901 02:56:48.344570 4043 backend.cpp:76] Failed to create 'aufs' backend: AufsBackend requires root privileges
W0901 02:56:48.344714 4043 backend.cpp:76] Failed to create 'bind' backend: BindBackend requires root privileges
I0901 02:56:48.344748 4043 provisioner.cpp:255] Using default backend 'copy'
I0901 02:56:48.346390 4043 cluster.cpp:448] Creating default 'local' authorizer
I0901 02:56:48.348948 4070 slave.cpp:252] Mesos agent started on (813)@172.17.0.3:43775
I0901 02:56:48.348994 4070 slave.cpp:253] Flags at startup: --acls="" --appc_simple_discovery_uri_prefix="http://" --appc_store_dir="/tmp/Endpoint_SlaveEndpointTest_NoAuthorizer_0_svG4Ji/store/appc" --authenticate_http_readonly="true" --authenticate_http_readwrite="true" --authenticatee="crammd5" --authentication_backoff_factor="1secs" --authorizer="local" --cgroups_cpu_enable_pids_and_tids_count="false" --cgroups_enable_cfs="false" --cgroups_hierarchy="/sys/fs/cgroup" --cgroups_limit_swap="false" --cgroups_root="mesos" --container_disk_watch_interval="15secs" --containerizers="mesos" --credential="/tmp/Endpoint_SlaveEndpointTest_NoAuthorizer_0_svG4Ji/credential" --default_role="*" --disallow_sharing_agent_pid_namespace="false" --disk_watch_interval="1mins" --docker="docker" --docker_kill_orphans="true" --docker_registry="https://registry-1.docker.io" --docker_remove_delay="6hrs" --docker_socket="/var/run/docker.sock" --docker_stop_timeout="0ns" --docker_store_dir="/tmp/Endpoint_SlaveEndpointTest_NoAuthorizer_0_svG4Ji/store/docker" --docker_volume_checkpoint_dir="/var/run/mesos/isolators/docker/volume" --enforce_container_disk_quota="false" --executor_registration_timeout="1mins" --executor_reregistration_timeout="2secs" --executor_shutdown_grace_period="5secs" --fetcher_cache_dir="/tmp/Endpoint_SlaveEndpointTest_NoAuthorizer_0_svG4Ji/fetch" --fetcher_cache_size="2GB" --frameworks_home="" --gc_delay="1weeks" --gc_disk_headroom="0.1" --hadoop_home="" --help="false" --hostname_lookup="true" --http_command_executor="false" --http_credentials="/tmp/Endpoint_SlaveEndpointTest_NoAuthorizer_0_svG4Ji/http_credentials" --http_heartbeat_interval="30secs" --initialize_driver_logging="true" --isolation="posix/cpu,posix/mem" --launcher="posix" --launcher_dir="/mesos/mesos-1.5.0/_build/src" --logbufsecs="0" --logging_level="INFO" --max_completed_executors_per_framework="150" --oversubscribed_resources_interval="15secs" --perf_duration="10secs" --perf_interval="1mins" --port="5051" --qos_correction_interval_min="0ns" --quiet="false" --recover="reconnect" --recovery_timeout="15mins" --registration_backoff_factor="10ms" --resources="cpus:2;gpus:0;mem:1024;disk:1024;ports:[31000-32000]" --revocable_cpu_low_priority="true" --runtime_dir="/tmp/Endpoint_SlaveEndpointTest_NoAuthorizer_0_svG4Ji" --sandbox_directory="/mnt/mesos/sandbox" --strict="true" --switch_user="true" --systemd_enable_support="true" --systemd_runtime_directory="/run/systemd/system" --version="false" --work_dir="/tmp/Endpoint_SlaveEndpointTest_NoAuthorizer_0_D6XRW8" --zk_session_timeout="10secs"
I0901 02:56:48.349381 4070 credentials.hpp:86] Loading credential for authentication from '/tmp/Endpoint_SlaveEndpointTest_NoAuthorizer_0_svG4Ji/credential'
I0901 02:56:48.349552 4070 slave.cpp:285] Agent using credential for: test-principal
I0901 02:56:48.349581 4070 credentials.hpp:37] Loading credentials for authentication from '/tmp/Endpoint_SlaveEndpointTest_NoAuthorizer_0_svG4Ji/http_credentials'
I0901 02:56:48.349822 4070 http.cpp:1045] Creating default 'basic' HTTP authenticator for realm 'mesos-agent-readonly'
I0901 02:56:48.349997 4070 http.cpp:1045] Creating default 'basic' HTTP authenticator for realm 'mesos-agent-readwrite'
I0901 02:56:48.351392 4070 slave.cpp:581] Agent resources: [{"name":"cpus","scalar":{"value":2.0},"type":"SCALAR"},{"name":"mem","scalar":{"value":1024.0},"type":"SCALAR"},{"name":"disk","scalar":{"value":1024.0},"type":"SCALAR"},{"name":"ports","ranges":{"range":[{"begin":31000,"end":32000}]},"type":"RANGES"}]
I0901 02:56:48.351616 4070 slave.cpp:589] Agent attributes: [ ]
I0901 02:56:48.351639 4070 slave.cpp:598] Agent hostname: b62cfd6078a9
I0901 02:56:48.351760 4064 status_update_manager.cpp:177] Pausing sending status updates
I0901 02:56:48.353308 4069 state.cpp:64] Recovering state from '/tmp/Endpoint_SlaveEndpointTest_NoAuthorizer_0_D6XRW8/meta'
I0901 02:56:48.353618 4069 status_update_manager.cpp:203] Recovering status update manager
I0901 02:56:48.353819 4079 containerizer.cpp:646] Recovering containerizer
I0901 02:56:48.355125 4075 provisioner.cpp:416] Provisioner recovery complete
I0901 02:56:48.355465 4070 slave.cpp:6296] Finished recovery
I0901 02:56:48.356031 4070 slave.cpp:6478] Querying resource estimator for oversubscribable resources
I0901 02:56:48.356288 4066 slave.cpp:6492] Received oversubscribable resources {} from the resource estimator
I0901 02:56:48.359256 4068 process.cpp:3956] Handling HTTP event for process 'slave(813)' with path: '/slave(813)/monitor/statistics'
I0901 02:56:48.360507 4082 http.cpp:1185] HTTP GET for /slave(813)/monitor/statistics from 172.17.0.3:38046
I0901 02:56:48.360612 4082 http.cpp:976] Authorizing principal 'test-principal' to GET the '/monitor/statistics' endpoint
I0901 02:56:48.363451 4081 slave.cpp:859] Agent terminating
[ OK ] Endpoint/SlaveEndpointTest.NoAuthorizer/0 (30 ms)
[ RUN ] Endpoint/SlaveEndpointTest.NoAuthorizer/1
I0901 02:56:48.375236 4043 containerizer.cpp:290] Using isolation { environment_secret, posix/cpu, posix/mem, filesystem/posix, network/cni }
W0901 02:56:48.375725 4043 backend.cpp:76] Failed to create 'aufs' backend: AufsBackend requires root privileges
W0901 02:56:48.375843 4043 backend.cpp:76] Failed to create 'bind' backend: BindBackend requires root privileges
I0901 02:56:48.375879 4043 provisioner.cpp:255] Using default backend 'copy'
I0901 02:56:48.377612 4043 cluster.cpp:448] Creating default 'local' authorizer
I0901 02:56:48.379518 4077 slave.cpp:252] Mesos agent started on (814)@172.17.0.3:43775
I0901 02:56:48.379564 4077 slave.cpp:253] Flags at startup: --acls="" --appc_simple_discovery_uri_prefix="http://" --appc_store_dir="/tmp/Endpoint_SlaveEndpointTest_NoAuthorizer_1_W7IxaW/store/appc" --authenticate_http_readonly="true" --authenticate_http_readwrite="true" --authenticatee="crammd5" --authentication_backoff_factor="1secs" --authorizer="local" --cgroups_cpu_enable_pids_and_tids_count="false" --cgroups_enable_cfs="false" --cgroups_hierarchy="/sys/fs/cgroup" --cgroups_limit_swap="false" --cgroups_root="mesos" --container_disk_watch_interval="15secs" --containerizers="mesos" --credential="/tmp/Endpoint_SlaveEndpointTest_NoAuthorizer_1_W7IxaW/credential" --default_role="*" --disallow_sharing_agent_pid_namespace="false" --disk_watch_interval="1mins" --docker="docker" --docker_kill_orphans="true" --docker_registry="https://registry-1.docker.io" --docker_remove_delay="6hrs" --docker_socket="/var/run/docker.sock" --docker_stop_timeout="0ns" --docker_store_dir="/tmp/Endpoint_SlaveEndpointTest_NoAuthorizer_1_W7IxaW/store/docker" --docker_volume_checkpoint_dir="/var/run/mesos/isolators/docker/volume" --enforce_container_disk_quota="false" --executor_registration_timeout="1mins" --executor_reregistration_timeout="2secs" --executor_shutdown_grace_period="5secs" --fetcher_cache_dir="/tmp/Endpoint_SlaveEndpointTest_NoAuthorizer_1_W7IxaW/fetch" --fetcher_cache_size="2GB" --frameworks_home="" --gc_delay="1weeks" --gc_disk_headroom="0.1" --hadoop_home="" --help="false" --hostname_lookup="true" --http_command_executor="false" --http_credentials="/tmp/Endpoint_SlaveEndpointTest_NoAuthorizer_1_W7IxaW/http_credentials" --http_heartbeat_interval="30secs" --initialize_driver_logging="true" --isolation="posix/cpu,posix/mem" --launcher="posix" --launcher_dir="/mesos/mesos-1.5.0/_build/src" --logbufsecs="0" --logging_level="INFO" --max_completed_executors_per_framework="150" --oversubscribed_resources_interval="15secs" --perf_duration="10secs" --perf_interval="1mins" --port="5051" --qos_correction_interval_min="0ns" --quiet="false" --recover="reconnect" --recovery_timeout="15mins" --registration_backoff_factor="10ms" --resources="cpus:2;gpus:0;mem:1024;disk:1024;ports:[31000-32000]" --revocable_cpu_low_priority="true" --runtime_dir="/tmp/Endpoint_SlaveEndpointTest_NoAuthorizer_1_W7IxaW" --sandbox_directory="/mnt/mesos/sandbox" --strict="true" --switch_user="true" --systemd_enable_support="true" --systemd_runtime_directory="/run/systemd/system" --version="false" --work_dir="/tmp/Endpoint_SlaveEndpointTest_NoAuthorizer_1_Z2MJiM" --zk_session_timeout="10secs"
I0901 02:56:48.380162 4077 credentials.hpp:86] Loading credential for authentication from '/tmp/Endpoint_SlaveEndpointTest_NoAuthorizer_1_W7IxaW/credential'
I0901 02:56:48.380342 4077 slave.cpp:285] Agent using credential for: test-principal
I0901 02:56:48.380367 4077 credentials.hpp:37] Loading credentials for authentication from '/tmp/Endpoint_SlaveEndpointTest_NoAuthorizer_1_W7IxaW/http_credentials'
I0901 02:56:48.380619 4077 http.cpp:1045] Creating default 'basic' HTTP authenticator for realm 'mesos-agent-readonly'
I0901 02:56:48.380786 4077 http.cpp:1045] Creating default 'basic' HTTP authenticator for realm 'mesos-agent-readwrite'
I0901 02:56:48.382133 4077 slave.cpp:581] Agent resources: [{"name":"cpus","scalar":{"value":2.0},"type":"SCALAR"},{"name":"mem","scalar":{"value":1024.0},"type":"SCALAR"},{"name":"disk","scalar":{"value":1024.0},"type":"SCALAR"},{"name":"ports","ranges":{"range":[{"begin":31000,"end":32000}]},"type":"RANGES"}]
I0901 02:56:48.382354 4077 slave.cpp:589] Agent attributes: [ ]
I0901 02:56:48.382369 4077 slave.cpp:598] Agent hostname: b62cfd6078a9
I0901 02:56:48.382529 4066 status_update_manager.cpp:177] Pausing sending status updates
I0901 02:56:48.383965 4083 state.cpp:64] Recovering state from '/tmp/Endpoint_SlaveEndpointTest_NoAuthorizer_1_Z2MJiM/meta'
I0901 02:56:48.384274 4068 status_update_manager.cpp:203] Recovering status update manager
I0901 02:56:48.384470 4071 containerizer.cpp:646] Recovering containerizer
I0901 02:56:48.385823 4084 provisioner.cpp:416] Provisioner recovery complete
I0901 02:56:48.386147 4077 slave.cpp:6296] Finished recovery
I0901 02:56:48.386675 4077 slave.cpp:6478] Querying resource estimator for oversubscribable resources
I0901 02:56:48.386909 4065 slave.cpp:6492] Received oversubscribable resources {} from the resource estimator
I0901 02:56:48.389787 4080 process.cpp:3956] Handling HTTP event for process 'slave(814)' with path: '/slave(814)/monitor/statistics.json'
I0901 02:56:48.391054 4063 http.cpp:1185] HTTP GET for /slave(814)/monitor/statistics.json from 172.17.0.3:38048
I0901 02:56:48.391135 4063 http.cpp:976] Authorizing principal 'test-principal' to GET the '/monitor/statistics.json' endpoint
I0901 02:56:48.393963 4043 slave.cpp:859] Agent terminating
[ OK ] Endpoint/SlaveEndpointTest.NoAuthorizer/1 (30 ms)
[ RUN ] Endpoint/SlaveEndpointTest.NoAuthorizer/2
I0901 02:56:48.405797 4043 containerizer.cpp:290] Using isolation { environment_secret, posix/cpu, posix/mem, filesystem/posix, network/cni }
W0901 02:56:48.406308 4043 backend.cpp:76] Failed to create 'aufs' backend: AufsBackend requires root privileges
W0901 02:56:48.406428 4043 backend.cpp:76] Failed to create 'bind' backend: BindBackend requires root privileges
I0901 02:56:48.406466 4043 provisioner.cpp:255] Using default backend 'copy'
I0901 02:56:48.408350 4043 cluster.cpp:448] Creating default 'local' authorizer
I0901 02:56:48.410357 4075 slave.cpp:252] Mesos agent started on (815)@172.17.0.3:43775
I0901 02:56:48.410405 4075 slave.cpp:253] Flags at startup: --acls="" --appc_simple_discovery_uri_prefix="http://" --appc_store_dir="/tmp/Endpoint_SlaveEndpointTest_NoAuthorizer_2_kzpdTz/store/appc" --authenticate_http_readonly="true" --authenticate_http_readwrite="true" --authenticatee="crammd5" --authentication_backoff_factor="1secs" --authorizer="local" --cgroups_cpu_enable_pids_and_tids_count="false" --cgroups_enable_cfs="false" --cgroups_hierarchy="/sys/fs/cgroup" --cgroups_limit_swap="false" --cgroups_root="mesos" --container_disk_watch_interval="15secs" --containerizers="mesos" --credential="/tmp/Endpoint_SlaveEndpointTest_NoAuthorizer_2_kzpdTz/credential" --default_role="*" --disallow_sharing_agent_pid_namespace="false" --disk_watch_interval="1mins" --docker="docker" --docker_kill_orphans="true" --docker_registry="https://registry-1.docker.io" --docker_remove_delay="6hrs" --docker_socket="/var/run/docker.sock" --docker_stop_timeout="0ns" --docker_store_dir="/tmp/Endpoint_SlaveEndpointTest_NoAuthorizer_2_kzpdTz/store/docker" --docker_volume_checkpoint_dir="/var/run/mesos/isolators/docker/volume" --enforce_container_disk_quota="false" --executor_registration_timeout="1mins" --executor_reregistration_timeout="2secs" --executor_shutdown_grace_period="5secs" --fetcher_cache_dir="/tmp/Endpoint_SlaveEndpointTest_NoAuthorizer_2_kzpdTz/fetch" --fetcher_cache_size="2GB" --frameworks_home="" --gc_delay="1weeks" --gc_disk_headroom="0.1" --hadoop_home="" --help="false" --hostname_lookup="true" --http_command_executor="false" --http_credentials="/tmp/Endpoint_SlaveEndpointTest_NoAuthorizer_2_kzpdTz/http_credentials" --http_heartbeat_interval="30secs" --initialize_driver_logging="true" --isolation="posix/cpu,posix/mem" --launcher="posix" --launcher_dir="/mesos/mesos-1.5.0/_build/src" --logbufsecs="0" --logging_level="INFO" --max_completed_executors_per_framework="150" --oversubscribed_resources_interval="15secs" --perf_duration="10secs" --perf_interval="1mins" --port="5051" --qos_correction_interval_min="0ns" --quiet="false" --recover="reconnect" --recovery_timeout="15mins" --registration_backoff_factor="10ms" --resources="cpus:2;gpus:0;mem:1024;disk:1024;ports:[31000-32000]" --revocable_cpu_low_priority="true" --runtime_dir="/tmp/Endpoint_SlaveEndpointTest_NoAuthorizer_2_kzpdTz" --sandbox_directory="/mnt/mesos/sandbox" --strict="true" --switch_user="true" --systemd_enable_support="true" --systemd_runtime_directory="/run/systemd/system" --version="false" --work_dir="/tmp/Endpoint_SlaveEndpointTest_NoAuthorizer_2_d3nRWp" --zk_session_timeout="10secs"
I0901 02:56:48.411041 4075 credentials.hpp:86] Loading credential for authentication from '/tmp/Endpoint_SlaveEndpointTest_NoAuthorizer_2_kzpdTz/credential'
I0901 02:56:48.411238 4075 slave.cpp:285] Agent using credential for: test-principal
I0901 02:56:48.411263 4075 credentials.hpp:37] Loading credentials for authentication from '/tmp/Endpoint_SlaveEndpointTest_NoAuthorizer_2_kzpdTz/http_credentials'
I0901 02:56:48.411499 4075 http.cpp:1045] Creating default 'basic' HTTP authenticator for realm 'mesos-agent-readonly'
I0901 02:56:48.411670 4075 http.cpp:1045] Creating default 'basic' HTTP authenticator for realm 'mesos-agent-readwrite'
I0901 02:56:48.413066 4075 slave.cpp:581] Agent resources: [{"name":"cpus","scalar":{"value":2.0},"type":"SCALAR"},{"name":"mem","scalar":{"value":1024.0},"type":"SCALAR"},{"name":"disk","scalar":{"value":1024.0},"type":"SCALAR"},{"name":"ports","ranges":{"range":[{"begin":31000,"end":32000}]},"type":"RANGES"}]
I0901 02:56:48.413290 4075 slave.cpp:589] Agent attributes: [ ]
I0901 02:56:48.413308 4075 slave.cpp:598] Agent hostname: b62cfd6078a9
I0901 02:56:48.413453 4068 status_update_manager.cpp:177] Pausing sending status updates
I0901 02:56:48.415009 4078 state.cpp:64] Recovering state from '/tmp/Endpoint_SlaveEndpointTest_NoAuthorizer_2_d3nRWp/meta'
I0901 02:56:48.415354 4064 status_update_manager.cpp:203] Recovering status update manager
I0901 02:56:48.415551 4084 containerizer.cpp:646] Recovering containerizer
I0901 02:56:48.416875 4065 provisioner.cpp:416] Provisioner recovery complete
I0901 02:56:48.417193 4075 slave.cpp:6296] Finished recovery
I0901 02:56:48.417707 4075 slave.cpp:6478] Querying resource estimator for oversubscribable resources
I0901 02:56:48.417939 4066 slave.cpp:6492] Received oversubscribable resources {} from the resource estimator
I0901 02:56:48.420683 4081 process.cpp:3956] Handling HTTP event for process 'slave(815)' with path: '/slave(815)/containers'
I0901 02:56:48.422035 4064 http.cpp:1185] HTTP GET for /slave(815)/containers from 172.17.0.3:38050
I0901 02:56:48.422163 4064 http.cpp:976] Authorizing principal 'test-principal' to GET the '/containers' endpoint
I0901 02:56:48.425473 4063 slave.cpp:859] Agent terminating
[ OK ] Endpoint/SlaveEndpointTest.NoAuthorizer/2 (31 ms)
[----------] 9 tests from Endpoint/SlaveEndpointTest (262 ms total)
[----------] 2 tests from ContainerizerType/DefaultContainerDNSFlagTest
[ RUN ] ContainerizerType/DefaultContainerDNSFlagTest.ValidateFlag/0
[ OK ] ContainerizerType/DefaultContainerDNSFlagTest.ValidateFlag/0 (10 ms)
[ RUN ] ContainerizerType/DefaultContainerDNSFlagTest.ValidateFlag/1
[ OK ] ContainerizerType/DefaultContainerDNSFlagTest.ValidateFlag/1 (9 ms)
[----------] 2 tests from ContainerizerType/DefaultContainerDNSFlagTest (19 ms total)
[----------] Global test environment tear-down
[==========] 1666 tests from 183 test cases ran. (594380 ms total)
[ PASSED ] 1665 tests.
[ FAILED ] 1 test, listed below:
[ FAILED ] ExamplesTest.DynamicReservationFramework
1 FAILED TEST
YOU HAVE 20 DISABLED TESTS
I0901 02:56:48.513584 4085 process.cpp:1072] Failed to accept socket: future discarded
make[4]: *** [check-local] Error 1
make[4]: Leaving directory `/mesos/mesos-1.5.0/_build/src'
make[3]: *** [check-am] Error 2
make[3]: Leaving directory `/mesos/mesos-1.5.0/_build/src'
make[2]: *** [check] Error 2
make[2]: Leaving directory `/mesos/mesos-1.5.0/_build/src'
make[1]: *** [check-recursive] Error 1
make[1]: Leaving directory `/mesos/mesos-1.5.0/_build'
make: *** [distcheck] Error 1
+ docker rmi mesos-1504231549-19226
Untagged: mesos-1504231549-19226:latest
Deleted: sha256:dd7a31a78cc5dc5d29e4e87789e7358fdc507e220dcc7fb24c68711cf596587d
Deleted: sha256:2d1569811b297ac12756f6cecf27b896de1ce3830c7efce093c77487a31072bb
Deleted: sha256:df8ff2d28774b389b2d0733362ef5ae47c5f8afd20822c78195ba5e433bda2b5
Deleted: sha256:31932ec4a02638440897948c69bfd79f4ca4e0a3a697c66815e901f821593923
Deleted: sha256:d46a8647e06c71dbad0e581dbd5a694adb14616d577027cc5223f15a18560e68
Deleted: sha256:db0b19db303b8875a5f380010a19d2972916fa94cb86b9d3442676fedbb2d700
Deleted: sha256:ccb2cbf6dd367cf4a59009b4b730fd632df788f019d91e54d489c26c21cd7a5d
Deleted: sha256:a3f843c330f8e9951024e0b5359fd8ab651bff02322090e89e35be388cdefb2f
Deleted: sha256:c6bddb141692fb453122fcdb49d6d0199b8810ff09162ec274d104168818a53f
Deleted: sha256:f89d57814a9937b63733ee4a161dee9b277c2d466b781b5a4afec7c32bae12a4
Deleted: sha256:c3691d517d40f8450f99d5ff41f9c3b68917faddd6e202f07ae02ce4e4aa1d1f
Deleted: sha256:8230458f7f26905d2b0fdcbee74f090e319f3ecd5037ff385bcc27480393b17a
Deleted: sha256:6d12ceed1b435e8dd7a8809414a0d9af524472cc7302b0d9b049c0092aa541c4
Deleted: sha256:ae7619f122792acc55d4957296a2fa5a2e485ad56b90b09d179bfb7904906eb1
Deleted: sha256:afbf160732fae5b8bbcfdb060b79bdf1156b7012ff67ad047a5e32b61b0e3607
Deleted: sha256:0b7a31be78a5c77a0f38e1cd9a0a39f2fa1d393c75d9f9d9dd97385b1db96165
Deleted: sha256:61f1e0a147a5bdffb1d0d2e42f15db6c0a645ca8190b943af5d9eec7f7c7d96e
Deleted: sha256:51b0ed2334963f7f6979454a3cfb80f111c2791379ef8908d4b404534fc03dd8
Deleted: sha256:a7be4816302fb10d1105367309502ddaf1379d77cbdd4dda98abf5a4d99492de
Deleted: sha256:791507a013cc757c60e3c7905acd187b1a628c9e77fb839a06222faedc3c3b89
Deleted: sha256:9270338d2d09eec210b44ef47f5d7ca3ec1413389d8daa625798a388083a9cac
Deleted: sha256:85786a6fb1310cb5138cc405e849739eafe2393b0448fb7ee5f24c6e3cad7217
Deleted: sha256:da0a374679a4e9ccd40e66b932613d55b512d17b646de200524ebc146eddfaeb
Deleted: sha256:162225969a625e82561c5f1e31f3ffa7e47653c329245bda2965331c33142f4b
Build step 'Execute shell' marked build as failure
Not sending mail to unregistered user benjamin.hindman@gmail.com
Jenkins build is back to normal : Mesos-Buildbot » autotools,clang,--verbose,GLOG_v=1 MESOS_VERBOSE=1,ubuntu:14.04,(ubuntu)&&(!ubuntu-us1)&&(!ubuntu-eu2) #4180
Posted by Apache Jenkins Server <je...@builds.apache.org>.
See <https://builds.apache.org/job/Mesos-Buildbot/BUILDTOOL=autotools,COMPILER=clang,CONFIGURATION=--verbose,ENVIRONMENT=GLOG_v=1%20MESOS_VERBOSE=1,OS=ubuntu%3A14.04,label_exp=(ubuntu)&&(!ubuntu-us1)&&(!ubuntu-eu2)/4180/display/redirect?page=changes>
Build failed in Jenkins: Mesos-Buildbot » autotools,clang,--verbose,GLOG_v=1 MESOS_VERBOSE=1,ubuntu:14.04,(ubuntu)&&(!ubuntu-us1)&&(!ubuntu-eu2) #4179
Posted by Apache Jenkins Server <je...@builds.apache.org>.
See <https://builds.apache.org/job/Mesos-Buildbot/BUILDTOOL=autotools,COMPILER=clang,CONFIGURATION=--verbose,ENVIRONMENT=GLOG_v=1%20MESOS_VERBOSE=1,OS=ubuntu%3A14.04,label_exp=(ubuntu)&&(!ubuntu-us1)&&(!ubuntu-eu2)/4179/display/redirect?page=changes>
Changes:
[yujie.jay] Used 'undiscardable' to protect a future in MesosContainerizer.
[yujie.jay] Added MESOS-7926 to 1.3.2 CHANGELOG.
[yujie.jay] Added MESOS-7926 to 1.2.3 CHANGELOG.
------------------------------------------
[...truncated 31.06 MB...]
I0901 05:04:23.962137 4071 slave.cpp:285] Agent using credential for: test-principal
I0901 05:04:23.962160 4071 credentials.hpp:37] Loading credentials for authentication from '/tmp/Endpoint_SlaveEndpointTest_AuthorizedRequest_2_tWGx6a/http_credentials'
I0901 05:04:23.962446 4071 http.cpp:1045] Creating default 'basic' HTTP authenticator for realm 'mesos-agent-readonly'
I0901 05:04:23.962599 4071 http.cpp:1045] Creating default 'basic' HTTP authenticator for realm 'mesos-agent-readwrite'
I0901 05:04:23.963879 4071 slave.cpp:581] Agent resources: [{"name":"cpus","scalar":{"value":2.0},"type":"SCALAR"},{"name":"mem","scalar":{"value":1024.0},"type":"SCALAR"},{"name":"disk","scalar":{"value":1024.0},"type":"SCALAR"},{"name":"ports","ranges":{"range":[{"begin":31000,"end":32000}]},"type":"RANGES"}]
I0901 05:04:23.964089 4071 slave.cpp:589] Agent attributes: [ ]
I0901 05:04:23.964102 4071 slave.cpp:598] Agent hostname: 006d916ace57
I0901 05:04:23.964216 4074 status_update_manager.cpp:177] Pausing sending status updates
I0901 05:04:23.965571 4069 state.cpp:64] Recovering state from '/tmp/Endpoint_SlaveEndpointTest_AuthorizedRequest_2_8meefv/meta'
I0901 05:04:23.965848 4082 status_update_manager.cpp:203] Recovering status update manager
I0901 05:04:23.966012 4072 containerizer.cpp:646] Recovering containerizer
I0901 05:04:23.967087 4063 provisioner.cpp:416] Provisioner recovery complete
I0901 05:04:23.967356 4071 slave.cpp:6296] Finished recovery
I0901 05:04:23.967797 4071 slave.cpp:6478] Querying resource estimator for oversubscribable resources
I0901 05:04:23.967983 4083 slave.cpp:6492] Received oversubscribable resources {} from the resource estimator
I0901 05:04:23.970088 4075 process.cpp:3956] Handling HTTP event for process 'slave(809)' with path: '/slave(809)/containers'
I0901 05:04:23.971210 4066 http.cpp:1185] HTTP GET for /slave(809)/containers from 172.17.0.3:57034
I0901 05:04:23.971325 4066 http.cpp:976] Authorizing principal 'test-principal' to GET the '/containers' endpoint
I0901 05:04:23.974489 4082 slave.cpp:859] Agent terminating
[ OK ] Endpoint/SlaveEndpointTest.AuthorizedRequest/2 (27 ms)
[ RUN ] Endpoint/SlaveEndpointTest.UnauthorizedRequest/0
I0901 05:04:23.985000 4043 containerizer.cpp:290] Using isolation { environment_secret, posix/cpu, posix/mem, filesystem/posix, network/cni }
W0901 05:04:23.985463 4043 backend.cpp:76] Failed to create 'aufs' backend: AufsBackend requires root privileges
W0901 05:04:23.985570 4043 backend.cpp:76] Failed to create 'bind' backend: BindBackend requires root privileges
I0901 05:04:23.985602 4043 provisioner.cpp:255] Using default backend 'copy'
I0901 05:04:23.988976 4066 slave.cpp:252] Mesos agent started on (810)@172.17.0.3:39457
I0901 05:04:23.989009 4066 slave.cpp:253] Flags at startup: --acls="" --appc_simple_discovery_uri_prefix="http://" --appc_store_dir="/tmp/Endpoint_SlaveEndpointTest_UnauthorizedRequest_0_VO5GLS/store/appc" --authenticate_http_readonly="true" --authenticate_http_readwrite="true" --authenticatee="crammd5" --authentication_backoff_factor="1secs" --authorizer="local" --cgroups_cpu_enable_pids_and_tids_count="false" --cgroups_enable_cfs="false" --cgroups_hierarchy="/sys/fs/cgroup" --cgroups_limit_swap="false" --cgroups_root="mesos" --container_disk_watch_interval="15secs" --containerizers="mesos" --credential="/tmp/Endpoint_SlaveEndpointTest_UnauthorizedRequest_0_VO5GLS/credential" --default_role="*" --disallow_sharing_agent_pid_namespace="false" --disk_watch_interval="1mins" --docker="docker" --docker_kill_orphans="true" --docker_registry="https://registry-1.docker.io" --docker_remove_delay="6hrs" --docker_socket="/var/run/docker.sock" --docker_stop_timeout="0ns" --docker_store_dir="/tmp/Endpoint_SlaveEndpointTest_UnauthorizedRequest_0_VO5GLS/store/docker" --docker_volume_checkpoint_dir="/var/run/mesos/isolators/docker/volume" --enforce_container_disk_quota="false" --executor_registration_timeout="1mins" --executor_reregistration_timeout="2secs" --executor_shutdown_grace_period="5secs" --fetcher_cache_dir="/tmp/Endpoint_SlaveEndpointTest_UnauthorizedRequest_0_VO5GLS/fetch" --fetcher_cache_size="2GB" --frameworks_home="" --gc_delay="1weeks" --gc_disk_headroom="0.1" --hadoop_home="" --help="false" --hostname_lookup="true" --http_command_executor="false" --http_credentials="/tmp/Endpoint_SlaveEndpointTest_UnauthorizedRequest_0_VO5GLS/http_credentials" --http_heartbeat_interval="30secs" --initialize_driver_logging="true" --isolation="posix/cpu,posix/mem" --launcher="posix" --launcher_dir="/mesos/mesos-1.5.0/_build/src" --logbufsecs="0" --logging_level="INFO" --max_completed_executors_per_framework="150" --oversubscribed_resources_interval="15secs" --perf_duration="10secs" --perf_interval="1mins" --port="5051" --qos_correction_interval_min="0ns" --quiet="false" --recover="reconnect" --recovery_timeout="15mins" --registration_backoff_factor="10ms" --resources="cpus:2;gpus:0;mem:1024;disk:1024;ports:[31000-32000]" --revocable_cpu_low_priority="true" --runtime_dir="/tmp/Endpoint_SlaveEndpointTest_UnauthorizedRequest_0_VO5GLS" --sandbox_directory="/mnt/mesos/sandbox" --strict="true" --switch_user="true" --systemd_enable_support="true" --systemd_runtime_directory="/run/systemd/system" --version="false" --work_dir="/tmp/Endpoint_SlaveEndpointTest_UnauthorizedRequest_0_IHohQc" --zk_session_timeout="10secs"
I0901 05:04:23.989367 4066 credentials.hpp:86] Loading credential for authentication from '/tmp/Endpoint_SlaveEndpointTest_UnauthorizedRequest_0_VO5GLS/credential'
I0901 05:04:23.989509 4066 slave.cpp:285] Agent using credential for: test-principal
I0901 05:04:23.989537 4066 credentials.hpp:37] Loading credentials for authentication from '/tmp/Endpoint_SlaveEndpointTest_UnauthorizedRequest_0_VO5GLS/http_credentials'
I0901 05:04:23.989764 4066 http.cpp:1045] Creating default 'basic' HTTP authenticator for realm 'mesos-agent-readonly'
I0901 05:04:23.989919 4066 http.cpp:1045] Creating default 'basic' HTTP authenticator for realm 'mesos-agent-readwrite'
I0901 05:04:23.991195 4066 slave.cpp:581] Agent resources: [{"name":"cpus","scalar":{"value":2.0},"type":"SCALAR"},{"name":"mem","scalar":{"value":1024.0},"type":"SCALAR"},{"name":"disk","scalar":{"value":1024.0},"type":"SCALAR"},{"name":"ports","ranges":{"range":[{"begin":31000,"end":32000}]},"type":"RANGES"}]
I0901 05:04:23.991415 4066 slave.cpp:589] Agent attributes: [ ]
I0901 05:04:23.991435 4066 slave.cpp:598] Agent hostname: 006d916ace57
I0901 05:04:23.991592 4077 status_update_manager.cpp:177] Pausing sending status updates
I0901 05:04:23.992930 4081 state.cpp:64] Recovering state from '/tmp/Endpoint_SlaveEndpointTest_UnauthorizedRequest_0_IHohQc/meta'
I0901 05:04:23.993191 4064 status_update_manager.cpp:203] Recovering status update manager
I0901 05:04:23.993356 4062 containerizer.cpp:646] Recovering containerizer
I0901 05:04:23.994534 4063 provisioner.cpp:416] Provisioner recovery complete
I0901 05:04:23.994850 4066 slave.cpp:6296] Finished recovery
I0901 05:04:23.995271 4066 slave.cpp:6478] Querying resource estimator for oversubscribable resources
I0901 05:04:23.995472 4080 slave.cpp:6492] Received oversubscribable resources {} from the resource estimator
I0901 05:04:23.997566 4068 process.cpp:3956] Handling HTTP event for process 'slave(810)' with path: '/slave(810)/monitor/statistics'
I0901 05:04:23.998805 4064 http.cpp:1185] HTTP GET for /slave(810)/monitor/statistics from 172.17.0.3:57038
I0901 05:04:23.998929 4064 http.cpp:976] Authorizing principal 'test-principal' to GET the '/monitor/statistics' endpoint
I0901 05:04:24.000869 4070 slave.cpp:859] Agent terminating
[ OK ] Endpoint/SlaveEndpointTest.UnauthorizedRequest/0 (25 ms)
[ RUN ] Endpoint/SlaveEndpointTest.UnauthorizedRequest/1
I0901 05:04:24.011027 4043 containerizer.cpp:290] Using isolation { environment_secret, posix/cpu, posix/mem, filesystem/posix, network/cni }
W0901 05:04:24.011478 4043 backend.cpp:76] Failed to create 'aufs' backend: AufsBackend requires root privileges
W0901 05:04:24.011584 4043 backend.cpp:76] Failed to create 'bind' backend: BindBackend requires root privileges
I0901 05:04:24.011616 4043 provisioner.cpp:255] Using default backend 'copy'
I0901 05:04:24.014938 4068 slave.cpp:252] Mesos agent started on (811)@172.17.0.3:39457
I0901 05:04:24.014976 4068 slave.cpp:253] Flags at startup: --acls="" --appc_simple_discovery_uri_prefix="http://" --appc_store_dir="/tmp/Endpoint_SlaveEndpointTest_UnauthorizedRequest_1_FzGAGA/store/appc" --authenticate_http_readonly="true" --authenticate_http_readwrite="true" --authenticatee="crammd5" --authentication_backoff_factor="1secs" --authorizer="local" --cgroups_cpu_enable_pids_and_tids_count="false" --cgroups_enable_cfs="false" --cgroups_hierarchy="/sys/fs/cgroup" --cgroups_limit_swap="false" --cgroups_root="mesos" --container_disk_watch_interval="15secs" --containerizers="mesos" --credential="/tmp/Endpoint_SlaveEndpointTest_UnauthorizedRequest_1_FzGAGA/credential" --default_role="*" --disallow_sharing_agent_pid_namespace="false" --disk_watch_interval="1mins" --docker="docker" --docker_kill_orphans="true" --docker_registry="https://registry-1.docker.io" --docker_remove_delay="6hrs" --docker_socket="/var/run/docker.sock" --docker_stop_timeout="0ns" --docker_store_dir="/tmp/Endpoint_SlaveEndpointTest_UnauthorizedRequest_1_FzGAGA/store/docker" --docker_volume_checkpoint_dir="/var/run/mesos/isolators/docker/volume" --enforce_container_disk_quota="false" --executor_registration_timeout="1mins" --executor_reregistration_timeout="2secs" --executor_shutdown_grace_period="5secs" --fetcher_cache_dir="/tmp/Endpoint_SlaveEndpointTest_UnauthorizedRequest_1_FzGAGA/fetch" --fetcher_cache_size="2GB" --frameworks_home="" --gc_delay="1weeks" --gc_disk_headroom="0.1" --hadoop_home="" --help="false" --hostname_lookup="true" --http_command_executor="false" --http_credentials="/tmp/Endpoint_SlaveEndpointTest_UnauthorizedRequest_1_FzGAGA/http_credentials" --http_heartbeat_interval="30secs" --initialize_driver_logging="true" --isolation="posix/cpu,posix/mem" --launcher="posix" --launcher_dir="/mesos/mesos-1.5.0/_build/src" --logbufsecs="0" --logging_level="INFO" --max_completed_executors_per_framework="150" --oversubscribed_resources_interval="15secs" --perf_duration="10secs" --perf_interval="1mins" --port="5051" --qos_correction_interval_min="0ns" --quiet="false" --recover="reconnect" --recovery_timeout="15mins" --registration_backoff_factor="10ms" --resources="cpus:2;gpus:0;mem:1024;disk:1024;ports:[31000-32000]" --revocable_cpu_low_priority="true" --runtime_dir="/tmp/Endpoint_SlaveEndpointTest_UnauthorizedRequest_1_FzGAGA" --sandbox_directory="/mnt/mesos/sandbox" --strict="true" --switch_user="true" --systemd_enable_support="true" --systemd_runtime_directory="/run/systemd/system" --version="false" --work_dir="/tmp/Endpoint_SlaveEndpointTest_UnauthorizedRequest_1_m4riHU" --zk_session_timeout="10secs"
I0901 05:04:24.015404 4068 credentials.hpp:86] Loading credential for authentication from '/tmp/Endpoint_SlaveEndpointTest_UnauthorizedRequest_1_FzGAGA/credential'
I0901 05:04:24.015552 4068 slave.cpp:285] Agent using credential for: test-principal
I0901 05:04:24.015578 4068 credentials.hpp:37] Loading credentials for authentication from '/tmp/Endpoint_SlaveEndpointTest_UnauthorizedRequest_1_FzGAGA/http_credentials'
I0901 05:04:24.015805 4068 http.cpp:1045] Creating default 'basic' HTTP authenticator for realm 'mesos-agent-readonly'
I0901 05:04:24.015959 4068 http.cpp:1045] Creating default 'basic' HTTP authenticator for realm 'mesos-agent-readwrite'
I0901 05:04:24.017944 4068 slave.cpp:581] Agent resources: [{"name":"cpus","scalar":{"value":2.0},"type":"SCALAR"},{"name":"mem","scalar":{"value":1024.0},"type":"SCALAR"},{"name":"disk","scalar":{"value":1024.0},"type":"SCALAR"},{"name":"ports","ranges":{"range":[{"begin":31000,"end":32000}]},"type":"RANGES"}]
I0901 05:04:24.018162 4068 slave.cpp:589] Agent attributes: [ ]
I0901 05:04:24.018182 4068 slave.cpp:598] Agent hostname: 006d916ace57
I0901 05:04:24.018298 4073 status_update_manager.cpp:177] Pausing sending status updates
I0901 05:04:24.019645 4080 state.cpp:64] Recovering state from '/tmp/Endpoint_SlaveEndpointTest_UnauthorizedRequest_1_m4riHU/meta'
I0901 05:04:24.019911 4065 status_update_manager.cpp:203] Recovering status update manager
I0901 05:04:24.020074 4063 containerizer.cpp:646] Recovering containerizer
I0901 05:04:24.021250 4076 provisioner.cpp:416] Provisioner recovery complete
I0901 05:04:24.021513 4070 slave.cpp:6296] Finished recovery
I0901 05:04:24.021921 4070 slave.cpp:6478] Querying resource estimator for oversubscribable resources
I0901 05:04:24.022142 4077 slave.cpp:6492] Received oversubscribable resources {} from the resource estimator
I0901 05:04:24.024106 4061 process.cpp:3956] Handling HTTP event for process 'slave(811)' with path: '/slave(811)/monitor/statistics.json'
I0901 05:04:24.025132 4082 http.cpp:1185] HTTP GET for /slave(811)/monitor/statistics.json from 172.17.0.3:57040
I0901 05:04:24.025195 4082 http.cpp:976] Authorizing principal 'test-principal' to GET the '/monitor/statistics.json' endpoint
I0901 05:04:24.026916 4080 slave.cpp:859] Agent terminating
[ OK ] Endpoint/SlaveEndpointTest.UnauthorizedRequest/1 (26 ms)
[ RUN ] Endpoint/SlaveEndpointTest.UnauthorizedRequest/2
I0901 05:04:24.037183 4043 containerizer.cpp:290] Using isolation { environment_secret, posix/cpu, posix/mem, filesystem/posix, network/cni }
W0901 05:04:24.037634 4043 backend.cpp:76] Failed to create 'aufs' backend: AufsBackend requires root privileges
W0901 05:04:24.037739 4043 backend.cpp:76] Failed to create 'bind' backend: BindBackend requires root privileges
I0901 05:04:24.037770 4043 provisioner.cpp:255] Using default backend 'copy'
I0901 05:04:24.041071 4084 slave.cpp:252] Mesos agent started on (812)@172.17.0.3:39457
I0901 05:04:24.041106 4084 slave.cpp:253] Flags at startup: --acls="" --appc_simple_discovery_uri_prefix="http://" --appc_store_dir="/tmp/Endpoint_SlaveEndpointTest_UnauthorizedRequest_2_VNnaRi/store/appc" --authenticate_http_readonly="true" --authenticate_http_readwrite="true" --authenticatee="crammd5" --authentication_backoff_factor="1secs" --authorizer="local" --cgroups_cpu_enable_pids_and_tids_count="false" --cgroups_enable_cfs="false" --cgroups_hierarchy="/sys/fs/cgroup" --cgroups_limit_swap="false" --cgroups_root="mesos" --container_disk_watch_interval="15secs" --containerizers="mesos" --credential="/tmp/Endpoint_SlaveEndpointTest_UnauthorizedRequest_2_VNnaRi/credential" --default_role="*" --disallow_sharing_agent_pid_namespace="false" --disk_watch_interval="1mins" --docker="docker" --docker_kill_orphans="true" --docker_registry="https://registry-1.docker.io" --docker_remove_delay="6hrs" --docker_socket="/var/run/docker.sock" --docker_stop_timeout="0ns" --docker_store_dir="/tmp/Endpoint_SlaveEndpointTest_UnauthorizedRequest_2_VNnaRi/store/docker" --docker_volume_checkpoint_dir="/var/run/mesos/isolators/docker/volume" --enforce_container_disk_quota="false" --executor_registration_timeout="1mins" --executor_reregistration_timeout="2secs" --executor_shutdown_grace_period="5secs" --fetcher_cache_dir="/tmp/Endpoint_SlaveEndpointTest_UnauthorizedRequest_2_VNnaRi/fetch" --fetcher_cache_size="2GB" --frameworks_home="" --gc_delay="1weeks" --gc_disk_headroom="0.1" --hadoop_home="" --help="false" --hostname_lookup="true" --http_command_executor="false" --http_credentials="/tmp/Endpoint_SlaveEndpointTest_UnauthorizedRequest_2_VNnaRi/http_credentials" --http_heartbeat_interval="30secs" --initialize_driver_logging="true" --isolation="posix/cpu,posix/mem" --launcher="posix" --launcher_dir="/mesos/mesos-1.5.0/_build/src" --logbufsecs="0" --logging_level="INFO" --max_completed_executors_per_framework="150" --oversubscribed_resources_interval="15secs" --perf_duration="10secs" --perf_interval="1mins" --port="5051" --qos_correction_interval_min="0ns" --quiet="false" --recover="reconnect" --recovery_timeout="15mins" --registration_backoff_factor="10ms" --resources="cpus:2;gpus:0;mem:1024;disk:1024;ports:[31000-32000]" --revocable_cpu_low_priority="true" --runtime_dir="/tmp/Endpoint_SlaveEndpointTest_UnauthorizedRequest_2_VNnaRi" --sandbox_directory="/mnt/mesos/sandbox" --strict="true" --switch_user="true" --systemd_enable_support="true" --systemd_runtime_directory="/run/systemd/system" --version="false" --work_dir="/tmp/Endpoint_SlaveEndpointTest_UnauthorizedRequest_2_OLdYNC" --zk_session_timeout="10secs"
I0901 05:04:24.041525 4084 credentials.hpp:86] Loading credential for authentication from '/tmp/Endpoint_SlaveEndpointTest_UnauthorizedRequest_2_VNnaRi/credential'
I0901 05:04:24.041676 4084 slave.cpp:285] Agent using credential for: test-principal
I0901 05:04:24.041699 4084 credentials.hpp:37] Loading credentials for authentication from '/tmp/Endpoint_SlaveEndpointTest_UnauthorizedRequest_2_VNnaRi/http_credentials'
I0901 05:04:24.041954 4084 http.cpp:1045] Creating default 'basic' HTTP authenticator for realm 'mesos-agent-readonly'
I0901 05:04:24.042135 4084 http.cpp:1045] Creating default 'basic' HTTP authenticator for realm 'mesos-agent-readwrite'
I0901 05:04:24.043426 4084 slave.cpp:581] Agent resources: [{"name":"cpus","scalar":{"value":2.0},"type":"SCALAR"},{"name":"mem","scalar":{"value":1024.0},"type":"SCALAR"},{"name":"disk","scalar":{"value":1024.0},"type":"SCALAR"},{"name":"ports","ranges":{"range":[{"begin":31000,"end":32000}]},"type":"RANGES"}]
I0901 05:04:24.043635 4084 slave.cpp:589] Agent attributes: [ ]
I0901 05:04:24.043650 4084 slave.cpp:598] Agent hostname: 006d916ace57
I0901 05:04:24.043779 4081 status_update_manager.cpp:177] Pausing sending status updates
I0901 05:04:24.045451 4070 state.cpp:64] Recovering state from '/tmp/Endpoint_SlaveEndpointTest_UnauthorizedRequest_2_OLdYNC/meta'
I0901 05:04:24.045701 4077 status_update_manager.cpp:203] Recovering status update manager
I0901 05:04:24.045876 4071 containerizer.cpp:646] Recovering containerizer
I0901 05:04:24.047178 4080 provisioner.cpp:416] Provisioner recovery complete
I0901 05:04:24.047631 4084 slave.cpp:6296] Finished recovery
I0901 05:04:24.048051 4084 slave.cpp:6478] Querying resource estimator for oversubscribable resources
I0901 05:04:24.048228 4078 slave.cpp:6492] Received oversubscribable resources {} from the resource estimator
I0901 05:04:24.050204 4067 process.cpp:3956] Handling HTTP event for process 'slave(812)' with path: '/slave(812)/containers'
I0901 05:04:24.051214 4066 http.cpp:1185] HTTP GET for /slave(812)/containers from 172.17.0.3:57042
I0901 05:04:24.051306 4066 http.cpp:976] Authorizing principal 'test-principal' to GET the '/containers' endpoint
I0901 05:04:24.053213 4043 slave.cpp:859] Agent terminating
[ OK ] Endpoint/SlaveEndpointTest.UnauthorizedRequest/2 (26 ms)
[ RUN ] Endpoint/SlaveEndpointTest.NoAuthorizer/0
I0901 05:04:24.064047 4043 containerizer.cpp:290] Using isolation { environment_secret, posix/cpu, posix/mem, filesystem/posix, network/cni }
W0901 05:04:24.064587 4043 backend.cpp:76] Failed to create 'aufs' backend: AufsBackend requires root privileges
W0901 05:04:24.064723 4043 backend.cpp:76] Failed to create 'bind' backend: BindBackend requires root privileges
I0901 05:04:24.064759 4043 provisioner.cpp:255] Using default backend 'copy'
I0901 05:04:24.066390 4043 cluster.cpp:448] Creating default 'local' authorizer
I0901 05:04:24.068362 4064 slave.cpp:252] Mesos agent started on (813)@172.17.0.3:39457
I0901 05:04:24.068405 4064 slave.cpp:253] Flags at startup: --acls="" --appc_simple_discovery_uri_prefix="http://" --appc_store_dir="/tmp/Endpoint_SlaveEndpointTest_NoAuthorizer_0_dWBmh1/store/appc" --authenticate_http_readonly="true" --authenticate_http_readwrite="true" --authenticatee="crammd5" --authentication_backoff_factor="1secs" --authorizer="local" --cgroups_cpu_enable_pids_and_tids_count="false" --cgroups_enable_cfs="false" --cgroups_hierarchy="/sys/fs/cgroup" --cgroups_limit_swap="false" --cgroups_root="mesos" --container_disk_watch_interval="15secs" --containerizers="mesos" --credential="/tmp/Endpoint_SlaveEndpointTest_NoAuthorizer_0_dWBmh1/credential" --default_role="*" --disallow_sharing_agent_pid_namespace="false" --disk_watch_interval="1mins" --docker="docker" --docker_kill_orphans="true" --docker_registry="https://registry-1.docker.io" --docker_remove_delay="6hrs" --docker_socket="/var/run/docker.sock" --docker_stop_timeout="0ns" --docker_store_dir="/tmp/Endpoint_SlaveEndpointTest_NoAuthorizer_0_dWBmh1/store/docker" --docker_volume_checkpoint_dir="/var/run/mesos/isolators/docker/volume" --enforce_container_disk_quota="false" --executor_registration_timeout="1mins" --executor_reregistration_timeout="2secs" --executor_shutdown_grace_period="5secs" --fetcher_cache_dir="/tmp/Endpoint_SlaveEndpointTest_NoAuthorizer_0_dWBmh1/fetch" --fetcher_cache_size="2GB" --frameworks_home="" --gc_delay="1weeks" --gc_disk_headroom="0.1" --hadoop_home="" --help="false" --hostname_lookup="true" --http_command_executor="false" --http_credentials="/tmp/Endpoint_SlaveEndpointTest_NoAuthorizer_0_dWBmh1/http_credentials" --http_heartbeat_interval="30secs" --initialize_driver_logging="true" --isolation="posix/cpu,posix/mem" --launcher="posix" --launcher_dir="/mesos/mesos-1.5.0/_build/src" --logbufsecs="0" --logging_level="INFO" --max_completed_executors_per_framework="150" --oversubscribed_resources_interval="15secs" --perf_duration="10secs" --perf_interval="1mins" --port="5051" --qos_correction_interval_min="0ns" --quiet="false" --recover="reconnect" --recovery_timeout="15mins" --registration_backoff_factor="10ms" --resources="cpus:2;gpus:0;mem:1024;disk:1024;ports:[31000-32000]" --revocable_cpu_low_priority="true" --runtime_dir="/tmp/Endpoint_SlaveEndpointTest_NoAuthorizer_0_dWBmh1" --sandbox_directory="/mnt/mesos/sandbox" --strict="true" --switch_user="true" --systemd_enable_support="true" --systemd_runtime_directory="/run/systemd/system" --version="false" --work_dir="/tmp/Endpoint_SlaveEndpointTest_NoAuthorizer_0_Srpfal" --zk_session_timeout="10secs"
I0901 05:04:24.069011 4064 credentials.hpp:86] Loading credential for authentication from '/tmp/Endpoint_SlaveEndpointTest_NoAuthorizer_0_dWBmh1/credential'
I0901 05:04:24.069192 4064 slave.cpp:285] Agent using credential for: test-principal
I0901 05:04:24.069223 4064 credentials.hpp:37] Loading credentials for authentication from '/tmp/Endpoint_SlaveEndpointTest_NoAuthorizer_0_dWBmh1/http_credentials'
I0901 05:04:24.069542 4064 http.cpp:1045] Creating default 'basic' HTTP authenticator for realm 'mesos-agent-readonly'
I0901 05:04:24.069694 4064 http.cpp:1045] Creating default 'basic' HTTP authenticator for realm 'mesos-agent-readwrite'
I0901 05:04:24.071729 4064 slave.cpp:581] Agent resources: [{"name":"cpus","scalar":{"value":2.0},"type":"SCALAR"},{"name":"mem","scalar":{"value":1024.0},"type":"SCALAR"},{"name":"disk","scalar":{"value":1024.0},"type":"SCALAR"},{"name":"ports","ranges":{"range":[{"begin":31000,"end":32000}]},"type":"RANGES"}]
I0901 05:04:24.072113 4064 slave.cpp:589] Agent attributes: [ ]
I0901 05:04:24.072139 4064 slave.cpp:598] Agent hostname: 006d916ace57
I0901 05:04:24.072263 4061 status_update_manager.cpp:177] Pausing sending status updates
I0901 05:04:24.073642 4074 state.cpp:64] Recovering state from '/tmp/Endpoint_SlaveEndpointTest_NoAuthorizer_0_Srpfal/meta'
I0901 05:04:24.073899 4082 status_update_manager.cpp:203] Recovering status update manager
I0901 05:04:24.074050 4070 containerizer.cpp:646] Recovering containerizer
I0901 05:04:24.075191 4084 provisioner.cpp:416] Provisioner recovery complete
I0901 05:04:24.075497 4064 slave.cpp:6296] Finished recovery
I0901 05:04:24.075901 4064 slave.cpp:6478] Querying resource estimator for oversubscribable resources
I0901 05:04:24.076082 4071 slave.cpp:6492] Received oversubscribable resources {} from the resource estimator
I0901 05:04:24.078135 4075 process.cpp:3956] Handling HTTP event for process 'slave(813)' with path: '/slave(813)/monitor/statistics'
I0901 05:04:24.079167 4068 http.cpp:1185] HTTP GET for /slave(813)/monitor/statistics from 172.17.0.3:57044
I0901 05:04:24.079234 4068 http.cpp:976] Authorizing principal 'test-principal' to GET the '/monitor/statistics' endpoint
I0901 05:04:24.082057 4080 slave.cpp:859] Agent terminating
[ OK ] Endpoint/SlaveEndpointTest.NoAuthorizer/0 (29 ms)
[ RUN ] Endpoint/SlaveEndpointTest.NoAuthorizer/1
I0901 05:04:24.092734 4043 containerizer.cpp:290] Using isolation { environment_secret, posix/cpu, posix/mem, filesystem/posix, network/cni }
W0901 05:04:24.093194 4043 backend.cpp:76] Failed to create 'aufs' backend: AufsBackend requires root privileges
W0901 05:04:24.093302 4043 backend.cpp:76] Failed to create 'bind' backend: BindBackend requires root privileges
I0901 05:04:24.093333 4043 provisioner.cpp:255] Using default backend 'copy'
I0901 05:04:24.094938 4043 cluster.cpp:448] Creating default 'local' authorizer
I0901 05:04:24.096776 4079 slave.cpp:252] Mesos agent started on (814)@172.17.0.3:39457
I0901 05:04:24.096814 4079 slave.cpp:253] Flags at startup: --acls="" --appc_simple_discovery_uri_prefix="http://" --appc_store_dir="/tmp/Endpoint_SlaveEndpointTest_NoAuthorizer_1_fmtCYJ/store/appc" --authenticate_http_readonly="true" --authenticate_http_readwrite="true" --authenticatee="crammd5" --authentication_backoff_factor="1secs" --authorizer="local" --cgroups_cpu_enable_pids_and_tids_count="false" --cgroups_enable_cfs="false" --cgroups_hierarchy="/sys/fs/cgroup" --cgroups_limit_swap="false" --cgroups_root="mesos" --container_disk_watch_interval="15secs" --containerizers="mesos" --credential="/tmp/Endpoint_SlaveEndpointTest_NoAuthorizer_1_fmtCYJ/credential" --default_role="*" --disallow_sharing_agent_pid_namespace="false" --disk_watch_interval="1mins" --docker="docker" --docker_kill_orphans="true" --docker_registry="https://registry-1.docker.io" --docker_remove_delay="6hrs" --docker_socket="/var/run/docker.sock" --docker_stop_timeout="0ns" --docker_store_dir="/tmp/Endpoint_SlaveEndpointTest_NoAuthorizer_1_fmtCYJ/store/docker" --docker_volume_checkpoint_dir="/var/run/mesos/isolators/docker/volume" --enforce_container_disk_quota="false" --executor_registration_timeout="1mins" --executor_reregistration_timeout="2secs" --executor_shutdown_grace_period="5secs" --fetcher_cache_dir="/tmp/Endpoint_SlaveEndpointTest_NoAuthorizer_1_fmtCYJ/fetch" --fetcher_cache_size="2GB" --frameworks_home="" --gc_delay="1weeks" --gc_disk_headroom="0.1" --hadoop_home="" --help="false" --hostname_lookup="true" --http_command_executor="false" --http_credentials="/tmp/Endpoint_SlaveEndpointTest_NoAuthorizer_1_fmtCYJ/http_credentials" --http_heartbeat_interval="30secs" --initialize_driver_logging="true" --isolation="posix/cpu,posix/mem" --launcher="posix" --launcher_dir="/mesos/mesos-1.5.0/_build/src" --logbufsecs="0" --logging_level="INFO" --max_completed_executors_per_framework="150" --oversubscribed_resources_interval="15secs" --perf_duration="10secs" --perf_interval="1mins" --port="5051" --qos_correction_interval_min="0ns" --quiet="false" --recover="reconnect" --recovery_timeout="15mins" --registration_backoff_factor="10ms" --resources="cpus:2;gpus:0;mem:1024;disk:1024;ports:[31000-32000]" --revocable_cpu_low_priority="true" --runtime_dir="/tmp/Endpoint_SlaveEndpointTest_NoAuthorizer_1_fmtCYJ" --sandbox_directory="/mnt/mesos/sandbox" --strict="true" --switch_user="true" --systemd_enable_support="true" --systemd_runtime_directory="/run/systemd/system" --version="false" --work_dir="/tmp/Endpoint_SlaveEndpointTest_NoAuthorizer_1_aGTcN3" --zk_session_timeout="10secs"
I0901 05:04:24.097174 4079 credentials.hpp:86] Loading credential for authentication from '/tmp/Endpoint_SlaveEndpointTest_NoAuthorizer_1_fmtCYJ/credential'
I0901 05:04:24.097321 4079 slave.cpp:285] Agent using credential for: test-principal
I0901 05:04:24.097344 4079 credentials.hpp:37] Loading credentials for authentication from '/tmp/Endpoint_SlaveEndpointTest_NoAuthorizer_1_fmtCYJ/http_credentials'
I0901 05:04:24.097558 4079 http.cpp:1045] Creating default 'basic' HTTP authenticator for realm 'mesos-agent-readonly'
I0901 05:04:24.097744 4079 http.cpp:1045] Creating default 'basic' HTTP authenticator for realm 'mesos-agent-readwrite'
I0901 05:04:24.099076 4079 slave.cpp:581] Agent resources: [{"name":"cpus","scalar":{"value":2.0},"type":"SCALAR"},{"name":"mem","scalar":{"value":1024.0},"type":"SCALAR"},{"name":"disk","scalar":{"value":1024.0},"type":"SCALAR"},{"name":"ports","ranges":{"range":[{"begin":31000,"end":32000}]},"type":"RANGES"}]
I0901 05:04:24.099289 4079 slave.cpp:589] Agent attributes: [ ]
I0901 05:04:24.099303 4079 slave.cpp:598] Agent hostname: 006d916ace57
I0901 05:04:24.099447 4063 status_update_manager.cpp:177] Pausing sending status updates
I0901 05:04:24.100816 4071 state.cpp:64] Recovering state from '/tmp/Endpoint_SlaveEndpointTest_NoAuthorizer_1_aGTcN3/meta'
I0901 05:04:24.101058 4077 status_update_manager.cpp:203] Recovering status update manager
I0901 05:04:24.101234 4081 containerizer.cpp:646] Recovering containerizer
I0901 05:04:24.102461 4083 provisioner.cpp:416] Provisioner recovery complete
I0901 05:04:24.102777 4079 slave.cpp:6296] Finished recovery
I0901 05:04:24.103183 4079 slave.cpp:6478] Querying resource estimator for oversubscribable resources
I0901 05:04:24.103374 4074 slave.cpp:6492] Received oversubscribable resources {} from the resource estimator
I0901 05:04:24.105417 4082 process.cpp:3956] Handling HTTP event for process 'slave(814)' with path: '/slave(814)/monitor/statistics.json'
I0901 05:04:24.106415 4077 http.cpp:1185] HTTP GET for /slave(814)/monitor/statistics.json from 172.17.0.3:57048
I0901 05:04:24.106482 4077 http.cpp:976] Authorizing principal 'test-principal' to GET the '/monitor/statistics.json' endpoint
I0901 05:04:24.109155 4079 slave.cpp:859] Agent terminating
[ OK ] Endpoint/SlaveEndpointTest.NoAuthorizer/1 (27 ms)
[ RUN ] Endpoint/SlaveEndpointTest.NoAuthorizer/2
I0901 05:04:24.120137 4043 containerizer.cpp:290] Using isolation { environment_secret, posix/cpu, posix/mem, filesystem/posix, network/cni }
W0901 05:04:24.120642 4043 backend.cpp:76] Failed to create 'aufs' backend: AufsBackend requires root privileges
W0901 05:04:24.120759 4043 backend.cpp:76] Failed to create 'bind' backend: BindBackend requires root privileges
I0901 05:04:24.120803 4043 provisioner.cpp:255] Using default backend 'copy'
I0901 05:04:24.122459 4043 cluster.cpp:448] Creating default 'local' authorizer
I0901 05:04:24.124307 4062 slave.cpp:252] Mesos agent started on (815)@172.17.0.3:39457
I0901 05:04:24.124339 4062 slave.cpp:253] Flags at startup: --acls="" --appc_simple_discovery_uri_prefix="http://" --appc_store_dir="/tmp/Endpoint_SlaveEndpointTest_NoAuthorizer_2_Vy75Vs/store/appc" --authenticate_http_readonly="true" --authenticate_http_readwrite="true" --authenticatee="crammd5" --authentication_backoff_factor="1secs" --authorizer="local" --cgroups_cpu_enable_pids_and_tids_count="false" --cgroups_enable_cfs="false" --cgroups_hierarchy="/sys/fs/cgroup" --cgroups_limit_swap="false" --cgroups_root="mesos" --container_disk_watch_interval="15secs" --containerizers="mesos" --credential="/tmp/Endpoint_SlaveEndpointTest_NoAuthorizer_2_Vy75Vs/credential" --default_role="*" --disallow_sharing_agent_pid_namespace="false" --disk_watch_interval="1mins" --docker="docker" --docker_kill_orphans="true" --docker_registry="https://registry-1.docker.io" --docker_remove_delay="6hrs" --docker_socket="/var/run/docker.sock" --docker_stop_timeout="0ns" --docker_store_dir="/tmp/Endpoint_SlaveEndpointTest_NoAuthorizer_2_Vy75Vs/store/docker" --docker_volume_checkpoint_dir="/var/run/mesos/isolators/docker/volume" --enforce_container_disk_quota="false" --executor_registration_timeout="1mins" --executor_reregistration_timeout="2secs" --executor_shutdown_grace_period="5secs" --fetcher_cache_dir="/tmp/Endpoint_SlaveEndpointTest_NoAuthorizer_2_Vy75Vs/fetch" --fetcher_cache_size="2GB" --frameworks_home="" --gc_delay="1weeks" --gc_disk_headroom="0.1" --hadoop_home="" --help="false" --hostname_lookup="true" --http_command_executor="false" --http_credentials="/tmp/Endpoint_SlaveEndpointTest_NoAuthorizer_2_Vy75Vs/http_credentials" --http_heartbeat_interval="30secs" --initialize_driver_logging="true" --isolation="posix/cpu,posix/mem" --launcher="posix" --launcher_dir="/mesos/mesos-1.5.0/_build/src" --logbufsecs="0" --logging_level="INFO" --max_completed_executors_per_framework="150" --oversubscribed_resources_interval="15secs" --perf_duration="10secs" --perf_interval="1mins" --port="5051" --qos_correction_interval_min="0ns" --quiet="false" --recover="reconnect" --recovery_timeout="15mins" --registration_backoff_factor="10ms" --resources="cpus:2;gpus:0;mem:1024;disk:1024;ports:[31000-32000]" --revocable_cpu_low_priority="true" --runtime_dir="/tmp/Endpoint_SlaveEndpointTest_NoAuthorizer_2_Vy75Vs" --sandbox_directory="/mnt/mesos/sandbox" --strict="true" --switch_user="true" --systemd_enable_support="true" --systemd_runtime_directory="/run/systemd/system" --version="false" --work_dir="/tmp/Endpoint_SlaveEndpointTest_NoAuthorizer_2_cDGCGM" --zk_session_timeout="10secs"
I0901 05:04:24.124749 4062 credentials.hpp:86] Loading credential for authentication from '/tmp/Endpoint_SlaveEndpointTest_NoAuthorizer_2_Vy75Vs/credential'
I0901 05:04:24.124898 4062 slave.cpp:285] Agent using credential for: test-principal
I0901 05:04:24.124930 4062 credentials.hpp:37] Loading credentials for authentication from '/tmp/Endpoint_SlaveEndpointTest_NoAuthorizer_2_Vy75Vs/http_credentials'
I0901 05:04:24.125174 4062 http.cpp:1045] Creating default 'basic' HTTP authenticator for realm 'mesos-agent-readonly'
I0901 05:04:24.125335 4062 http.cpp:1045] Creating default 'basic' HTTP authenticator for realm 'mesos-agent-readwrite'
I0901 05:04:24.126631 4062 slave.cpp:581] Agent resources: [{"name":"cpus","scalar":{"value":2.0},"type":"SCALAR"},{"name":"mem","scalar":{"value":1024.0},"type":"SCALAR"},{"name":"disk","scalar":{"value":1024.0},"type":"SCALAR"},{"name":"ports","ranges":{"range":[{"begin":31000,"end":32000}]},"type":"RANGES"}]
I0901 05:04:24.126844 4062 slave.cpp:589] Agent attributes: [ ]
I0901 05:04:24.126857 4062 slave.cpp:598] Agent hostname: 006d916ace57
I0901 05:04:24.126992 4064 status_update_manager.cpp:177] Pausing sending status updates
I0901 05:04:24.128280 4080 state.cpp:64] Recovering state from '/tmp/Endpoint_SlaveEndpointTest_NoAuthorizer_2_cDGCGM/meta'
I0901 05:04:24.128541 4061 status_update_manager.cpp:203] Recovering status update manager
I0901 05:04:24.128746 4075 containerizer.cpp:646] Recovering containerizer
I0901 05:04:24.129906 4066 provisioner.cpp:416] Provisioner recovery complete
I0901 05:04:24.130190 4062 slave.cpp:6296] Finished recovery
I0901 05:04:24.130573 4062 slave.cpp:6478] Querying resource estimator for oversubscribable resources
I0901 05:04:24.130769 4077 slave.cpp:6492] Received oversubscribable resources {} from the resource estimator
I0901 05:04:24.132870 4065 process.cpp:3956] Handling HTTP event for process 'slave(815)' with path: '/slave(815)/containers'
I0901 05:04:24.133898 4061 http.cpp:1185] HTTP GET for /slave(815)/containers from 172.17.0.3:57050
I0901 05:04:24.133961 4061 http.cpp:976] Authorizing principal 'test-principal' to GET the '/containers' endpoint
I0901 05:04:24.137022 4043 slave.cpp:859] Agent terminating
[ OK ] Endpoint/SlaveEndpointTest.NoAuthorizer/2 (28 ms)
[----------] 9 tests from Endpoint/SlaveEndpointTest (246 ms total)
[----------] 2 tests from ContainerizerType/DefaultContainerDNSFlagTest
[ RUN ] ContainerizerType/DefaultContainerDNSFlagTest.ValidateFlag/0
[ OK ] ContainerizerType/DefaultContainerDNSFlagTest.ValidateFlag/0 (9 ms)
[ RUN ] ContainerizerType/DefaultContainerDNSFlagTest.ValidateFlag/1
[ OK ] ContainerizerType/DefaultContainerDNSFlagTest.ValidateFlag/1 (10 ms)
[----------] 2 tests from ContainerizerType/DefaultContainerDNSFlagTest (19 ms total)
[----------] Global test environment tear-down
[==========] 1666 tests from 183 test cases ran. (597861 ms total)
[ PASSED ] 1664 tests.
[ FAILED ] 2 tests, listed below:
[ FAILED ] ExamplesTest.TestHTTPFramework
[ FAILED ] ExamplesTest.DynamicReservationFramework
2 FAILED TESTS
YOU HAVE 20 DISABLED TESTS
I0901 05:04:24.223731 4085 process.cpp:1072] Failed to accept socket: future discarded
make[4]: *** [check-local] Error 1
make[4]: Leaving directory `/mesos/mesos-1.5.0/_build/src'
make[3]: *** [check-am] Error 2
make[3]: Leaving directory `/mesos/mesos-1.5.0/_build/src'
make[2]: *** [check] Error 2
make[2]: Leaving directory `/mesos/mesos-1.5.0/_build/src'
make[1]: *** [check-recursive] Error 1
make[1]: Leaving directory `/mesos/mesos-1.5.0/_build'
make: *** [distcheck] Error 1
+ docker rmi mesos-1504239190-23075
Untagged: mesos-1504239190-23075:latest
Deleted: sha256:5a3037800e29305ec6dca94a37c2f61092231f2e04561cdb1d647763089ac94e
Deleted: sha256:9f9eeaafed41a7d6f3ee384526414e0a6a48671757d2be7c2637a62bf23ff0a0
Deleted: sha256:707f3c21bf16ebaa4d333fadfd5197178f8b5a20d9fb4f22d0e21bb387fd4818
Deleted: sha256:ca73871fec45d31f806703b3523f8cf4f2e1c64e4caf9e9a281cf2b7bdd8d41a
Deleted: sha256:dc9447bbaaa8c8eab02fdef6157d5cc53859b0fa6cd5dae2fc12a64311643252
Deleted: sha256:f9ddc688e9e45380401f9fd9a3ea01dd187dd1531c3e0712c42cba1336d3da54
Deleted: sha256:64543548417eb4cd3406f34117d0bb8425ff778a161f600963bb50225cca59d5
Deleted: sha256:368d032e29189758f3cc689accc78a5d476ae0c8aa7a677c36be2fc4d798d064
Deleted: sha256:0bd4e9c53108b29db49dca22d4348455d2e2d10cdbb171279d66d7e18c74b8f4
Deleted: sha256:9ddedb797e2613822c8af1f6da4909f06ece867f489868b61ca0ac0ee55d5354
Deleted: sha256:87c105fdfc450890f9c04b4b344da2c2e6c635c3e3b60853ddf9b201f591648d
Deleted: sha256:fbc9391d0e5ed0540d000c6b25200051099138a69d7335cf8650f0f964561482
Deleted: sha256:da9a74a92f2c5d49f12aabb9022f0425f07463d9a2b6fc795c5e918bd22fdf47
Deleted: sha256:0e0ffde4b8f3d56f7e203ca90452997197c9f7b3e2cb657a950a1a1a86182009
Deleted: sha256:fd49905badca866c6b6e521dd0a0c6c66d17d2b6db69294309edc3d291dadf24
Deleted: sha256:a297711ec1d9034f9e2ee6fe064e06fe278afa6574f9c0e65a731a93fe559a23
Deleted: sha256:42d047b28474ed49daad0d10da3695f39f935cd3b2811843c8e9cfd0545e8cc5
Deleted: sha256:a02536cb30c08563ba65b7327ace4eea14d927c17afa3658d1100f62079893a2
Deleted: sha256:46812344b70ddec71f24d167a7c8d9ee4ab93b911b3c1572ee428cef2da92fd6
Deleted: sha256:870874350b6b7045e4fced3d5e8f218bfc033f2a63d967e70be62a9994a71069
Deleted: sha256:b71658a643682769a4055f14bac4805f9092c42ec54443d620c689c3c8a76ca2
Deleted: sha256:d615e4cae07ac1b87c143953a7b1e093689301362215fa74bd0a2097c3386adf
Deleted: sha256:6ca00d3dc4bd738b3cb0fa297a2628365a382ee6bbd274d8a4d1d77fc11695b0
Deleted: sha256:304422fe4b5339288e96228e3db636cd269dce040e03df6c995f93a5b5942ced
Build step 'Execute shell' marked build as failure
Not sending mail to unregistered user yujie.jay@gmail.com
Not sending mail to unregistered user benjamin.hindman@gmail.com