You are viewing a plain text version of this content. The canonical link for it is here.
Posted to builds@beam.apache.org by Apache Jenkins Server <je...@builds.apache.org> on 2023/10/17 17:05:12 UTC

Build failed in Jenkins: beam_LoadTests_Python_ParDo_Flink_Batch #1471

See <https://ci-beam.apache.org/job/beam_LoadTests_Python_ParDo_Flink_Batch/1471/display/redirect>

Changes:


------------------------------------------
[...truncated 180.83 KB...]
  Using cached psycopg2_binary-2.9.9-cp38-cp38-manylinux_2_17_x86_64.manylinux2014_x86_64.whl.metadata (4.4 kB)
Collecting testcontainers<4.0.0,>=3.0.3 (from testcontainers[mysql]<4.0.0,>=3.0.3; extra == "test")
  Using cached testcontainers-3.7.1-py2.py3-none-any.whl (45 kB)
Collecting cryptography>=41.0.2
  Using cached cryptography-41.0.4-cp37-abi3-manylinux_2_28_x86_64.whl.metadata (5.2 kB)
Collecting hypothesis<=7.0.0,>5.0.0
  Using cached hypothesis-6.88.1-py3-none-any.whl.metadata (5.9 kB)
Collecting boto3<2,>=1.9
  Using cached boto3-1.28.64-py3-none-any.whl.metadata (6.7 kB)
Collecting six>=1.11.0 (from azure-core<2,>=1.7.0)
  Using cached six-1.16.0-py2.py3-none-any.whl (11 kB)
Collecting msal<2.0.0,>=1.24.0 (from azure-identity<2,>=1.12.0)
  Using cached msal-1.24.1-py2.py3-none-any.whl.metadata (11 kB)
Collecting msal-extensions<2.0.0,>=0.3.0 (from azure-identity<2,>=1.12.0)
  Using cached msal_extensions-1.0.0-py2.py3-none-any.whl (19 kB)
Collecting isodate>=0.6.1 (from azure-storage-blob<13,>=12.3.2)
  Using cached isodate-0.6.1-py2.py3-none-any.whl (41 kB)
Collecting botocore<1.32.0,>=1.31.64 (from boto3<2,>=1.9)
  Using cached botocore-1.31.64-py3-none-any.whl.metadata (6.1 kB)
Collecting jmespath<2.0.0,>=0.7.1 (from boto3<2,>=1.9)
  Using cached jmespath-1.0.1-py3-none-any.whl (20 kB)
Collecting s3transfer<0.8.0,>=0.7.0 (from boto3<2,>=1.9)
  Using cached s3transfer-0.7.0-py3-none-any.whl.metadata (1.8 kB)
Collecting cffi>=1.12 (from cryptography>=41.0.2)
  Using cached cffi-1.16.0-cp38-cp38-manylinux_2_17_x86_64.manylinux2014_x86_64.whl.metadata (1.5 kB)
Collecting googleapis-common-protos<2.0.dev0,>=1.56.2 (from google-api-core<3,>=2.0.0)
  Using cached googleapis_common_protos-1.61.0-py2.py3-none-any.whl.metadata (1.5 kB)
Collecting oauth2client>=1.4.12 (from google-apitools<0.5.32,>=0.5.31)
  Using cached oauth2client-4.1.3-py2.py3-none-any.whl (98 kB)
Collecting pyasn1-modules>=0.2.1 (from google-auth<3,>=1.18.0)
  Using cached pyasn1_modules-0.3.0-py2.py3-none-any.whl (181 kB)
Collecting rsa<5,>=3.1.4 (from google-auth<3,>=1.18.0)
  Using cached rsa-4.9-py3-none-any.whl (34 kB)
Collecting google-cloud-storage<3.0.0dev,>=1.32.0 (from google-cloud-aiplatform<2.0,>=1.26.0)
  Using cached google_cloud_storage-2.12.0-py2.py3-none-any.whl.metadata (6.1 kB)
Collecting google-cloud-resource-manager<3.0.0dev,>=1.3.3 (from google-cloud-aiplatform<2.0,>=1.26.0)
  Using cached google_cloud_resource_manager-1.10.4-py2.py3-none-any.whl.metadata (5.2 kB)
Collecting shapely<3.0.0dev (from google-cloud-aiplatform<2.0,>=1.26.0)
  Using cached shapely-2.0.2-cp38-cp38-manylinux_2_17_x86_64.manylinux2014_x86_64.whl.metadata (7.0 kB)
Collecting google-resumable-media<3.0dev,>=0.6.0 (from google-cloud-bigquery<4,>=2.0.0)
  Using cached google_resumable_media-2.6.0-py2.py3-none-any.whl.metadata (2.1 kB)
Collecting grpc-google-iam-v1<1.0.0dev,>=0.12.4 (from google-cloud-bigtable<3,>=2.19.0)
  Using cached grpc_google_iam_v1-0.12.6-py2.py3-none-any.whl (26 kB)
Collecting grpcio-status>=1.33.2 (from google-cloud-pubsub<3,>=2.1.0)
  Using cached grpcio_status-1.59.0-py3-none-any.whl.metadata (1.3 kB)
Collecting overrides<7.0.0,>=6.0.1 (from google-cloud-pubsublite<2,>=1.2.0)
  Using cached overrides-6.5.0-py3-none-any.whl (17 kB)
Collecting sqlparse>=0.4.4 (from google-cloud-spanner<4,>=3.0.0)
  Using cached sqlparse-0.4.4-py3-none-any.whl (41 kB)
Collecting docopt (from hdfs<3.0.0,>=2.1.0)
  Using cached docopt-0.6.2-py2.py3-none-any.whl
Collecting pyparsing!=3.0.0,!=3.0.1,!=3.0.2,!=3.0.3,<4,>=2.4.2 (from httplib2<0.23.0,>=0.8)
  Using cached pyparsing-3.1.1-py3-none-any.whl.metadata (5.1 kB)
Collecting attrs>=19.2.0 (from hypothesis<=7.0.0,>5.0.0)
  Using cached attrs-23.1.0-py3-none-any.whl (61 kB)
Collecting sortedcontainers<3.0.0,>=2.1.0 (from hypothesis<=7.0.0,>5.0.0)
  Using cached sortedcontainers-2.4.0-py2.py3-none-any.whl (29 kB)
Collecting exceptiongroup>=1.0.0 (from hypothesis<=7.0.0,>5.0.0)
  Using cached exceptiongroup-1.1.3-py3-none-any.whl.metadata (6.1 kB)
Collecting tzlocal>=1.2 (from js2py<1,>=0.74)
  Using cached tzlocal-5.1-py3-none-any.whl.metadata (16 kB)
Collecting pyjsparser>=2.5.1 (from js2py<1,>=0.74)
  Using cached pyjsparser-2.7.1-py3-none-any.whl
Collecting dnspython<3.0.0,>=1.16.0 (from pymongo<5.0.0,>=3.8.0)
  Using cached dnspython-2.4.2-py3-none-any.whl.metadata (4.9 kB)
Collecting iniconfig (from pytest<8.0,>=7.1.2)
  Using cached iniconfig-2.0.0-py3-none-any.whl (5.9 kB)
Requirement already satisfied: pluggy<2.0,>=0.12 in <https://ci-beam.apache.org/job/beam_LoadTests_Python_ParDo_Flink_Batch/ws/src/build/gradleenv/1329484227/lib/python3.8/site-packages> (from pytest<8.0,>=7.1.2) (1.3.0)
Requirement already satisfied: tomli>=1.0.0 in <https://ci-beam.apache.org/job/beam_LoadTests_Python_ParDo_Flink_Batch/ws/src/build/gradleenv/1329484227/lib/python3.8/site-packages> (from pytest<8.0,>=7.1.2) (2.0.1)
Collecting execnet>=1.1 (from pytest-xdist<4,>=2.5.0)
  Using cached execnet-2.0.2-py3-none-any.whl.metadata (2.9 kB)
Collecting charset-normalizer<4,>=2 (from requests<3.0.0,>=2.24.0)
  Using cached charset_normalizer-3.3.0-cp38-cp38-manylinux_2_17_x86_64.manylinux2014_x86_64.whl.metadata (32 kB)
Collecting idna<4,>=2.5 (from requests<3.0.0,>=2.24.0)
  Using cached idna-3.4-py3-none-any.whl (61 kB)
Collecting urllib3<3,>=1.21.1 (from requests<3.0.0,>=2.24.0)
  Using cached urllib3-2.0.6-py3-none-any.whl.metadata (6.6 kB)
Collecting certifi>=2017.4.17 (from requests<3.0.0,>=2.24.0)
  Using cached certifi-2023.7.22-py3-none-any.whl.metadata (2.2 kB)
Collecting scipy>=1.5.0 (from scikit-learn>=0.20.0)
  Using cached scipy-1.10.1-cp38-cp38-manylinux_2_17_x86_64.manylinux2014_x86_64.whl (34.5 MB)
Collecting threadpoolctl>=2.0.0 (from scikit-learn>=0.20.0)
  Using cached threadpoolctl-3.2.0-py3-none-any.whl.metadata (10.0 kB)
Collecting greenlet!=0.4.17 (from sqlalchemy<2.0,>=1.3)
  Using cached greenlet-3.0.0-cp38-cp38-manylinux_2_24_x86_64.manylinux_2_28_x86_64.whl.metadata (3.8 kB)
Collecting docker>=4.0.0 (from testcontainers<4.0.0,>=3.0.3->testcontainers[mysql]<4.0.0,>=3.0.3; extra == "test")
  Using cached docker-6.1.3-py3-none-any.whl.metadata (3.5 kB)
Collecting wrapt (from testcontainers<4.0.0,>=3.0.3->testcontainers[mysql]<4.0.0,>=3.0.3; extra == "test")
  Using cached wrapt-1.16.0rc1-cp38-cp38-manylinux_2_5_x86_64.manylinux1_x86_64.manylinux_2_17_x86_64.manylinux2014_x86_64.whl.metadata (6.6 kB)
Collecting deprecation (from testcontainers<4.0.0,>=3.0.3->testcontainers[mysql]<4.0.0,>=3.0.3; extra == "test")
  Using cached deprecation-2.1.0-py2.py3-none-any.whl (11 kB)
Collecting pymysql (from testcontainers[mysql]<4.0.0,>=3.0.3; extra == "test")
  Using cached PyMySQL-1.1.0-py3-none-any.whl.metadata (4.4 kB)
Collecting urllib3<3,>=1.21.1 (from requests<3.0.0,>=2.24.0)
  Using cached urllib3-1.26.17-py2.py3-none-any.whl.metadata (48 kB)
Collecting pycparser (from cffi>=1.12->cryptography>=41.0.2)
  Using cached pycparser-2.21-py2.py3-none-any.whl (118 kB)
Collecting websocket-client>=0.32.0 (from docker>=4.0.0->testcontainers<4.0.0,>=3.0.3->testcontainers[mysql]<4.0.0,>=3.0.3; extra == "test")
  Using cached websocket_client-1.6.4-py3-none-any.whl.metadata (7.7 kB)
Collecting google-crc32c<2.0dev,>=1.0 (from google-cloud-storage<3.0.0dev,>=1.32.0->google-cloud-aiplatform<2.0,>=1.26.0)
  Using cached google_crc32c-1.5.0-cp38-cp38-manylinux_2_17_x86_64.manylinux2014_x86_64.whl (32 kB)
Collecting PyJWT<3,>=1.0.0 (from PyJWT[crypto]<3,>=1.0.0->msal<2.0.0,>=1.24.0->azure-identity<2,>=1.12.0)
  Using cached PyJWT-2.8.0-py3-none-any.whl.metadata (4.2 kB)
Collecting portalocker<3,>=1.0 (from msal-extensions<2.0.0,>=0.3.0->azure-identity<2,>=1.12.0)
  Using cached portalocker-2.8.2-py3-none-any.whl.metadata (8.5 kB)
Collecting pyasn1>=0.1.7 (from oauth2client>=1.4.12->google-apitools<0.5.32,>=0.5.31)
  Using cached pyasn1-0.5.0-py2.py3-none-any.whl (83 kB)
Collecting backports.zoneinfo (from tzlocal>=1.2->js2py<1,>=0.74)
  Using cached backports.zoneinfo-0.2.1-cp38-cp38-manylinux1_x86_64.whl (74 kB)
Using cached azure_core-1.29.4-py3-none-any.whl (192 kB)
Using cached azure_identity-1.15.0b2-py3-none-any.whl (162 kB)
Using cached azure_storage_blob-12.18.3-py3-none-any.whl (392 kB)
Using cached boto3-1.28.64-py3-none-any.whl (135 kB)
Using cached cryptography-41.0.4-cp37-abi3-manylinux_2_28_x86_64.whl (4.4 MB)
Using cached fastavro-1.8.4-cp38-cp38-manylinux_2_17_x86_64.manylinux2014_x86_64.whl (3.1 MB)
Using cached fasteners-0.19-py3-none-any.whl (18 kB)
Using cached google_api_core-2.12.0-py3-none-any.whl (121 kB)
Using cached google_auth-2.23.3-py2.py3-none-any.whl (182 kB)
Using cached google_auth_httplib2-0.1.1-py2.py3-none-any.whl (9.3 kB)
Using cached google_cloud_aiplatform-1.35.0-py2.py3-none-any.whl (3.1 MB)
Using cached google_cloud_bigquery-3.12.0-py2.py3-none-any.whl (220 kB)
Using cached google_cloud_bigquery_storage-2.22.0-py2.py3-none-any.whl (190 kB)
Using cached google_cloud_bigtable-2.21.0-py2.py3-none-any.whl (293 kB)
Using cached google_cloud_core-2.3.3-py2.py3-none-any.whl (29 kB)
Using cached google_cloud_datastore-2.18.0-py2.py3-none-any.whl (177 kB)
Using cached google_cloud_dlp-3.12.3-py2.py3-none-any.whl (143 kB)
Using cached google_cloud_language-2.11.1-py2.py3-none-any.whl (138 kB)
Using cached google_cloud_pubsub-2.18.4-py2.py3-none-any.whl (265 kB)
Using cached google_cloud_pubsublite-1.8.3-py2.py3-none-any.whl (288 kB)
Using cached google_cloud_recommendations_ai-0.10.5-py2.py3-none-any.whl (173 kB)
Using cached google_cloud_spanner-3.40.1-py2.py3-none-any.whl (332 kB)
Using cached google_cloud_videointelligence-2.11.4-py2.py3-none-any.whl (229 kB)
Using cached google_cloud_vision-3.4.4-py2.py3-none-any.whl (444 kB)
Using cached grpcio-1.59.0-cp38-cp38-manylinux_2_17_x86_64.manylinux2014_x86_64.whl (5.3 MB)
Using cached hypothesis-6.88.1-py3-none-any.whl (421 kB)
Using cached joblib-1.3.2-py3-none-any.whl (302 kB)
Using cached mock-5.1.0-py3-none-any.whl (30 kB)
Using cached numpy-1.24.4-cp38-cp38-manylinux_2_17_x86_64.manylinux2014_x86_64.whl (17.3 MB)
Using cached orjson-3.9.9-cp38-cp38-manylinux_2_17_x86_64.manylinux2014_x86_64.whl (138 kB)
Using cached proto_plus-1.22.3-py3-none-any.whl (48 kB)
Using cached protobuf-4.24.4-cp37-abi3-manylinux2014_x86_64.whl (311 kB)
Using cached psycopg2_binary-2.9.9-cp38-cp38-manylinux_2_17_x86_64.manylinux2014_x86_64.whl (3.0 MB)
Using cached pymongo-4.5.0-cp38-cp38-manylinux_2_17_x86_64.manylinux2014_x86_64.whl (687 kB)
Using cached pytest-7.4.2-py3-none-any.whl (324 kB)
Using cached pytest_timeout-2.2.0-py3-none-any.whl (13 kB)
Using cached pytest_xdist-3.3.1-py3-none-any.whl (41 kB)
Using cached pytz-2023.3.post1-py2.py3-none-any.whl (502 kB)
Using cached PyYAML-6.0.1-cp38-cp38-manylinux_2_17_x86_64.manylinux2014_x86_64.whl (736 kB)
Using cached regex-2023.10.3-cp38-cp38-manylinux_2_17_x86_64.manylinux2014_x86_64.whl (776 kB)
Using cached requests-2.31.0-py3-none-any.whl (62 kB)
Using cached requests_mock-1.11.0-py2.py3-none-any.whl (28 kB)
Using cached scikit_learn-1.3.1-cp38-cp38-manylinux_2_17_x86_64.manylinux2014_x86_64.whl (11.1 MB)
Using cached SQLAlchemy-1.4.49-cp38-cp38-manylinux_2_5_x86_64.manylinux1_x86_64.manylinux_2_17_x86_64.manylinux2014_x86_64.whl (1.6 MB)
Using cached tenacity-8.2.3-py3-none-any.whl (24 kB)
Using cached typing_extensions-4.8.0-py3-none-any.whl (31 kB)
Using cached botocore-1.31.64-py3-none-any.whl (11.3 MB)
Using cached certifi-2023.7.22-py3-none-any.whl (158 kB)
Using cached cffi-1.16.0-cp38-cp38-manylinux_2_17_x86_64.manylinux2014_x86_64.whl (444 kB)
Using cached charset_normalizer-3.3.0-cp38-cp38-manylinux_2_17_x86_64.manylinux2014_x86_64.whl (137 kB)
Using cached dnspython-2.4.2-py3-none-any.whl (300 kB)
Using cached docker-6.1.3-py3-none-any.whl (148 kB)
Using cached exceptiongroup-1.1.3-py3-none-any.whl (14 kB)
Using cached execnet-2.0.2-py3-none-any.whl (37 kB)
Using cached google_cloud_resource_manager-1.10.4-py2.py3-none-any.whl (320 kB)
Using cached google_cloud_storage-2.12.0-py2.py3-none-any.whl (120 kB)
Using cached google_resumable_media-2.6.0-py2.py3-none-any.whl (80 kB)
Using cached googleapis_common_protos-1.61.0-py2.py3-none-any.whl (230 kB)
Using cached greenlet-3.0.0-cp38-cp38-manylinux_2_24_x86_64.manylinux_2_28_x86_64.whl (617 kB)
Using cached grpcio_status-1.59.0-py3-none-any.whl (14 kB)
Using cached msal-1.24.1-py2.py3-none-any.whl (95 kB)
Using cached pyparsing-3.1.1-py3-none-any.whl (103 kB)
Using cached s3transfer-0.7.0-py3-none-any.whl (79 kB)
Using cached shapely-2.0.2-cp38-cp38-manylinux_2_17_x86_64.manylinux2014_x86_64.whl (2.5 MB)
Using cached threadpoolctl-3.2.0-py3-none-any.whl (15 kB)
Using cached tzlocal-5.1-py3-none-any.whl (21 kB)
Using cached urllib3-1.26.17-py2.py3-none-any.whl (143 kB)
Using cached PyMySQL-1.1.0-py3-none-any.whl (44 kB)
Using cached wrapt-1.16.0rc1-cp38-cp38-manylinux_2_5_x86_64.manylinux1_x86_64.manylinux_2_17_x86_64.manylinux2014_x86_64.whl (82 kB)
Using cached portalocker-2.8.2-py3-none-any.whl (17 kB)
Using cached PyJWT-2.8.0-py3-none-any.whl (22 kB)
Using cached websocket_client-1.6.4-py3-none-any.whl (57 kB)
Building wheels for collected packages: apache-beam
  Building wheel for apache-beam (pyproject.toml): started
  Building wheel for apache-beam (pyproject.toml): still running...
  Building wheel for apache-beam (pyproject.toml): still running...
  Building wheel for apache-beam (pyproject.toml): still running...
  Building wheel for apache-beam (pyproject.toml): finished with status 'done'
  Created wheel for apache-beam: filename=apache_beam-2.52.0.dev0-cp38-cp38-linux_x86_64.whl size=16200529 sha256=01472b4263eafb15310460287f023e3fbe1ab0aeff267077196283b9922b8d77
  Stored in directory: /home/jenkins/.cache/pip/wheels/77/a7/e6/16454117045e3dcccdce1447c008de111593127ca25d666b73
Successfully built apache-beam
Installing collected packages: sortedcontainers, pytz, pyjsparser, docopt, crcmod, zstandard, wrapt, websocket-client, urllib3, typing-extensions, threadpoolctl, tenacity, sqlparse, six, regex, pyyaml, pyparsing, pymysql, PyJWT, pyhamcrest, pycparser, pyasn1, psycopg2-binary, protobuf, portalocker, parameterized, overrides, orjson, objsize, numpy, mock, joblib, jmespath, iniconfig, idna, grpcio, greenlet, google-crc32c, fasteners, fastavro, execnet, exceptiongroup, dnspython, dill, deprecation, cloudpickle, charset-normalizer, certifi, backports.zoneinfo, attrs, tzlocal, sqlalchemy, shapely, scipy, rsa, requests, python-dateutil, pytest, pymongo, pydot, pyasn1-modules, pyarrow, proto-plus, isodate, hypothesis, httplib2, googleapis-common-protos, google-resumable-media, cffi, scikit-learn, requests-mock, pytest-xdist, pytest-timeout, pandas, oauth2client, js2py, hdfs, grpcio-status, google-auth, freezegun, docker, cryptography, botocore, azure-core, testcontainers, s3transfer, grpc-google-iam-v1, google-auth-httplib2, google-apitools, google-api-core, azure-storage-blob, apache-beam, msal, google-cloud-core, boto3, msal-extensions, google-cloud-vision, google-cloud-videointelligence, google-cloud-storage, google-cloud-spanner, google-cloud-resource-manager, google-cloud-recommendations-ai, google-cloud-pubsub, google-cloud-language, google-cloud-dlp, google-cloud-datastore, google-cloud-bigtable, google-cloud-bigquery-storage, google-cloud-bigquery, google-cloud-pubsublite, google-cloud-aiplatform, azure-identity
Successfully installed PyJWT-2.8.0 apache-beam-2.52.0.dev0 attrs-23.1.0 azure-core-1.29.4 azure-identity-1.15.0b2 azure-storage-blob-12.18.3 backports.zoneinfo-0.2.1 boto3-1.28.64 botocore-1.31.64 certifi-2023.7.22 cffi-1.16.0 charset-normalizer-3.3.0 cloudpickle-2.2.1 crcmod-1.7 cryptography-41.0.4 deprecation-2.1.0 dill-0.3.1.1 dnspython-2.4.2 docker-6.1.3 docopt-0.6.2 exceptiongroup-1.1.3 execnet-2.0.2 fastavro-1.8.4 fasteners-0.19 freezegun-1.2.2 google-api-core-2.12.0 google-apitools-0.5.31 google-auth-2.23.3 google-auth-httplib2-0.1.1 google-cloud-aiplatform-1.35.0 google-cloud-bigquery-3.12.0 google-cloud-bigquery-storage-2.22.0 google-cloud-bigtable-2.21.0 google-cloud-core-2.3.3 google-cloud-datastore-2.18.0 google-cloud-dlp-3.12.3 google-cloud-language-2.11.1 google-cloud-pubsub-2.18.4 google-cloud-pubsublite-1.8.3 google-cloud-recommendations-ai-0.10.5 google-cloud-resource-manager-1.10.4 google-cloud-spanner-3.40.1 google-cloud-storage-2.12.0 google-cloud-videointelligence-2.11.4 google-cloud-vision-3.4.4 google-crc32c-1.5.0 google-resumable-media-2.6.0 googleapis-common-protos-1.61.0 greenlet-3.0.0 grpc-google-iam-v1-0.12.6 grpcio-1.59.0 grpcio-status-1.59.0 hdfs-2.7.3 httplib2-0.22.0 hypothesis-6.88.1 idna-3.4 iniconfig-2.0.0 isodate-0.6.1 jmespath-1.0.1 joblib-1.3.2 js2py-0.74 mock-5.1.0 msal-1.24.1 msal-extensions-1.0.0 numpy-1.24.4 oauth2client-4.1.3 objsize-0.6.1 orjson-3.9.9 overrides-6.5.0 pandas-1.5.3 parameterized-0.9.0 portalocker-2.8.2 proto-plus-1.22.3 protobuf-4.24.4 psycopg2-binary-2.9.9 pyarrow-11.0.0 pyasn1-0.5.0 pyasn1-modules-0.3.0 pycparser-2.21 pydot-1.4.2 pyhamcrest-2.0.4 pyjsparser-2.7.1 pymongo-4.5.0 pymysql-1.1.0 pyparsing-3.1.1 pytest-7.4.2 pytest-timeout-2.2.0 pytest-xdist-3.3.1 python-dateutil-2.8.2 pytz-2023.3.post1 pyyaml-6.0.1 regex-2023.10.3 requests-2.31.0 requests-mock-1.11.0 rsa-4.9 s3transfer-0.7.0 scikit-learn-1.3.1 scipy-1.10.1 shapely-2.0.2 six-1.16.0 sortedcontainers-2.4.0 sqlalchemy-1.4.49 sqlparse-0.4.4 tenacity-8.2.3 testcontainers-3.7.1 threadpoolctl-3.2.0 typing-extensions-4.8.0 tzlocal-5.1 urllib3-1.26.17 websocket-client-1.6.4 wrapt-1.16.0rc1 zstandard-0.21.0
WARNING: There was an error checking the latest version of pip.

> Task :sdks:python:apache_beam:testing:load_tests:run
INFO:root:Using provided Python SDK container image: gcr.io/apache-beam-testing/beam-sdk/beam_python3.8_sdk:latest
INFO:root:Python SDK container image set to "gcr.io/apache-beam-testing/beam-sdk/beam_python3.8_sdk:latest" for Docker environment
INFO:apache_beam.runners.portability.fn_api_runner.translations:==================== <function pack_combiners at 0x7f7a0a007700> ====================
INFO:apache_beam.runners.portability.fn_api_runner.translations:==================== <function lift_combiners at 0x7f7a0a007790> ====================
INFO:apache_beam.runners.portability.fn_api_runner.translations:==================== <function sort_stages at 0x7f7a0a007ee0> ====================
WARNING:apache_beam.options.pipeline_options:Discarding unparseable args: ['--iterations=10', '--number_of_counter_operations=0', '--number_of_counters=0']
INFO:apache_beam.runners.portability.portable_runner:Job state changed to STOPPED
INFO:apache_beam.runners.portability.portable_runner:Job state changed to STARTING
INFO:apache_beam.runners.portability.portable_runner:Job state changed to RUNNING
ERROR:root:java.util.concurrent.TimeoutException: Waited 3 minutes (plus 83274 nanoseconds delay) for SettableFuture@7a0cea2e[status=PENDING]
INFO:apache_beam.runners.portability.portable_runner:Job state changed to FAILED
Traceback (most recent call last):
  File "/usr/lib/python3.8/runpy.py", line 194, in _run_module_as_main
    return _run_code(code, main_globals, None,
  File "/usr/lib/python3.8/runpy.py", line 87, in _run_code
    exec(code, run_globals)
  File "<https://ci-beam.apache.org/job/beam_LoadTests_Python_ParDo_Flink_Batch/ws/src/sdks/python/apache_beam/testing/load_tests/pardo_test.py",> line 167, in <module>
    ParDoTest().run()
  File "<https://ci-beam.apache.org/job/beam_LoadTests_Python_ParDo_Flink_Batch/ws/src/sdks/python/apache_beam/testing/load_tests/load_test.py",> line 152, in run
    state = self.result.wait_until_finish(duration=self.timeout_ms)
  File "<https://ci-beam.apache.org/job/beam_LoadTests_Python_ParDo_Flink_Batch/ws/src/sdks/python/apache_beam/runners/portability/portable_runner.py",> line 575, in wait_until_finish
    raise self._runtime_exception
RuntimeError: Pipeline load-tests-python-flink-batch-pardo-1-1017155301_aee1524c-6b11-4dba-8e84-0034e91faac1 failed in state FAILED: java.util.concurrent.TimeoutException: Waited 3 minutes (plus 83274 nanoseconds delay) for SettableFuture@7a0cea2e[status=PENDING]

> Task :sdks:python:apache_beam:testing:load_tests:run FAILED

FAILURE: Build failed with an exception.

* Where:
Build file '<https://ci-beam.apache.org/job/beam_LoadTests_Python_ParDo_Flink_Batch/ws/src/sdks/python/apache_beam/testing/load_tests/build.gradle'> line: 63

* What went wrong:
Execution failed for task ':sdks:python:apache_beam:testing:load_tests:run'.
> error occurred

* Try:
> Run with --stacktrace option to get the stack trace.
> Run with --info or --debug option to get more log output.
> Get more help at https://help.gradle.org.

Deprecated Gradle features were used in this build, making it incompatible with Gradle 9.0.

You can use '--warning-mode all' to show the individual deprecation warnings and determine if they come from your own scripts or plugins.

For more on this, please refer to https://docs.gradle.org/8.3/userguide/command_line_interface.html#sec:command_line_warnings in the Gradle documentation.

BUILD FAILED in 10m 59s
9 actionable tasks: 8 executed, 1 from cache

Publishing build scan...
https://ge.apache.org/s/jmu2jzcqmixbu

Build step 'Invoke Gradle script' changed build result to FAILURE
Build step 'Invoke Gradle script' marked build as failure

---------------------------------------------------------------------
To unsubscribe, e-mail: builds-unsubscribe@beam.apache.org
For additional commands, e-mail: builds-help@beam.apache.org


Jenkins build is back to normal : beam_LoadTests_Python_ParDo_Flink_Batch #1480

Posted by Apache Jenkins Server <je...@builds.apache.org>.
See <https://ci-beam.apache.org/job/beam_LoadTests_Python_ParDo_Flink_Batch/1480/display/redirect>


---------------------------------------------------------------------
To unsubscribe, e-mail: builds-unsubscribe@beam.apache.org
For additional commands, e-mail: builds-help@beam.apache.org


Build failed in Jenkins: beam_LoadTests_Python_ParDo_Flink_Batch #1479

Posted by Apache Jenkins Server <je...@builds.apache.org>.
See <https://ci-beam.apache.org/job/beam_LoadTests_Python_ParDo_Flink_Batch/1479/display/redirect>

Changes:


------------------------------------------
[...truncated 182.09 KB...]
  Using cached botocore-1.31.70-py3-none-any.whl.metadata (6.1 kB)
Collecting jmespath<2.0.0,>=0.7.1 (from boto3<2,>=1.9)
  Using cached jmespath-1.0.1-py3-none-any.whl (20 kB)
Collecting s3transfer<0.8.0,>=0.7.0 (from boto3<2,>=1.9)
  Using cached s3transfer-0.7.0-py3-none-any.whl.metadata (1.8 kB)
Collecting cffi>=1.12 (from cryptography>=41.0.2)
  Using cached cffi-1.16.0-cp38-cp38-manylinux_2_17_x86_64.manylinux2014_x86_64.whl.metadata (1.5 kB)
Collecting googleapis-common-protos<2.0.dev0,>=1.56.2 (from google-api-core<3,>=2.0.0)
  Using cached googleapis_common_protos-1.61.0-py2.py3-none-any.whl.metadata (1.5 kB)
Collecting oauth2client>=1.4.12 (from google-apitools<0.5.32,>=0.5.31)
  Using cached oauth2client-4.1.3-py2.py3-none-any.whl (98 kB)
Collecting pyasn1-modules>=0.2.1 (from google-auth<3,>=1.18.0)
  Using cached pyasn1_modules-0.3.0-py2.py3-none-any.whl (181 kB)
Collecting rsa<5,>=3.1.4 (from google-auth<3,>=1.18.0)
  Using cached rsa-4.9-py3-none-any.whl (34 kB)
Collecting google-cloud-storage<3.0.0dev,>=1.32.0 (from google-cloud-aiplatform<2.0,>=1.26.0)
  Using cached google_cloud_storage-2.12.0-py2.py3-none-any.whl.metadata (6.1 kB)
Collecting google-cloud-resource-manager<3.0.0dev,>=1.3.3 (from google-cloud-aiplatform<2.0,>=1.26.0)
  Using cached google_cloud_resource_manager-1.10.4-py2.py3-none-any.whl.metadata (5.2 kB)
Collecting shapely<3.0.0dev (from google-cloud-aiplatform<2.0,>=1.26.0)
  Using cached shapely-2.0.2-cp38-cp38-manylinux_2_17_x86_64.manylinux2014_x86_64.whl.metadata (7.0 kB)
Collecting google-resumable-media<3.0dev,>=0.6.0 (from google-cloud-bigquery<4,>=2.0.0)
  Using cached google_resumable_media-2.6.0-py2.py3-none-any.whl.metadata (2.1 kB)
Collecting grpc-google-iam-v1<1.0.0dev,>=0.12.4 (from google-cloud-bigtable<3,>=2.19.0)
  Using cached grpc_google_iam_v1-0.12.6-py2.py3-none-any.whl (26 kB)
Collecting grpcio-status>=1.33.2 (from google-cloud-pubsub<3,>=2.1.0)
  Using cached grpcio_status-1.59.0-py3-none-any.whl.metadata (1.3 kB)
Collecting overrides<7.0.0,>=6.0.1 (from google-cloud-pubsublite<2,>=1.2.0)
  Using cached overrides-6.5.0-py3-none-any.whl (17 kB)
Collecting sqlparse>=0.4.4 (from google-cloud-spanner<4,>=3.0.0)
  Using cached sqlparse-0.4.4-py3-none-any.whl (41 kB)
Collecting docopt (from hdfs<3.0.0,>=2.1.0)
  Using cached docopt-0.6.2-py2.py3-none-any.whl
Collecting pyparsing!=3.0.0,!=3.0.1,!=3.0.2,!=3.0.3,<4,>=2.4.2 (from httplib2<0.23.0,>=0.8)
  Using cached pyparsing-3.1.1-py3-none-any.whl.metadata (5.1 kB)
Collecting attrs>=19.2.0 (from hypothesis<=7.0.0,>5.0.0)
  Using cached attrs-23.1.0-py3-none-any.whl (61 kB)
Collecting sortedcontainers<3.0.0,>=2.1.0 (from hypothesis<=7.0.0,>5.0.0)
  Using cached sortedcontainers-2.4.0-py2.py3-none-any.whl (29 kB)
Collecting exceptiongroup>=1.0.0 (from hypothesis<=7.0.0,>5.0.0)
  Using cached exceptiongroup-1.1.3-py3-none-any.whl.metadata (6.1 kB)
Collecting tzlocal>=1.2 (from js2py<1,>=0.74)
  Using cached tzlocal-5.2-py3-none-any.whl.metadata (7.8 kB)
Collecting pyjsparser>=2.5.1 (from js2py<1,>=0.74)
  Using cached pyjsparser-2.7.1-py3-none-any.whl
Collecting importlib-resources>=1.4.0 (from jsonschema<5.0.0,>=4.0.0)
  Using cached importlib_resources-6.1.0-py3-none-any.whl.metadata (4.1 kB)
Collecting jsonschema-specifications>=2023.03.6 (from jsonschema<5.0.0,>=4.0.0)
  Using cached jsonschema_specifications-2023.7.1-py3-none-any.whl.metadata (2.8 kB)
Collecting pkgutil-resolve-name>=1.3.10 (from jsonschema<5.0.0,>=4.0.0)
  Using cached pkgutil_resolve_name-1.3.10-py3-none-any.whl (4.7 kB)
Collecting referencing>=0.28.4 (from jsonschema<5.0.0,>=4.0.0)
  Using cached referencing-0.30.2-py3-none-any.whl.metadata (2.6 kB)
Collecting rpds-py>=0.7.1 (from jsonschema<5.0.0,>=4.0.0)
  Using cached rpds_py-0.10.6-cp38-cp38-manylinux_2_17_x86_64.manylinux2014_x86_64.whl.metadata (3.7 kB)
Collecting dnspython<3.0.0,>=1.16.0 (from pymongo<5.0.0,>=3.8.0)
  Using cached dnspython-2.4.2-py3-none-any.whl.metadata (4.9 kB)
Collecting iniconfig (from pytest<8.0,>=7.1.2)
  Using cached iniconfig-2.0.0-py3-none-any.whl (5.9 kB)
Requirement already satisfied: pluggy<2.0,>=0.12 in <https://ci-beam.apache.org/job/beam_LoadTests_Python_ParDo_Flink_Batch/ws/src/build/gradleenv/1329484227/lib/python3.8/site-packages> (from pytest<8.0,>=7.1.2) (1.3.0)
Requirement already satisfied: tomli>=1.0.0 in <https://ci-beam.apache.org/job/beam_LoadTests_Python_ParDo_Flink_Batch/ws/src/build/gradleenv/1329484227/lib/python3.8/site-packages> (from pytest<8.0,>=7.1.2) (2.0.1)
Collecting execnet>=1.1 (from pytest-xdist<4,>=2.5.0)
  Using cached execnet-2.0.2-py3-none-any.whl.metadata (2.9 kB)
Collecting charset-normalizer<4,>=2 (from requests<3.0.0,>=2.24.0)
  Using cached charset_normalizer-3.3.1-cp38-cp38-manylinux_2_17_x86_64.manylinux2014_x86_64.whl.metadata (33 kB)
Collecting idna<4,>=2.5 (from requests<3.0.0,>=2.24.0)
  Using cached idna-3.4-py3-none-any.whl (61 kB)
Collecting urllib3<3,>=1.21.1 (from requests<3.0.0,>=2.24.0)
  Using cached urllib3-2.0.7-py3-none-any.whl.metadata (6.6 kB)
Collecting certifi>=2017.4.17 (from requests<3.0.0,>=2.24.0)
  Using cached certifi-2023.7.22-py3-none-any.whl.metadata (2.2 kB)
Collecting scipy>=1.5.0 (from scikit-learn>=0.20.0)
  Using cached scipy-1.10.1-cp38-cp38-manylinux_2_17_x86_64.manylinux2014_x86_64.whl (34.5 MB)
Collecting threadpoolctl>=2.0.0 (from scikit-learn>=0.20.0)
  Using cached threadpoolctl-3.2.0-py3-none-any.whl.metadata (10.0 kB)
Collecting greenlet!=0.4.17 (from sqlalchemy<2.0,>=1.3)
  Using cached greenlet-3.0.1-cp38-cp38-manylinux_2_24_x86_64.manylinux_2_28_x86_64.whl.metadata (3.7 kB)
Collecting docker>=4.0.0 (from testcontainers<4.0.0,>=3.0.3->testcontainers[mysql]<4.0.0,>=3.0.3; extra == "test")
  Using cached docker-6.1.3-py3-none-any.whl.metadata (3.5 kB)
Collecting wrapt (from testcontainers<4.0.0,>=3.0.3->testcontainers[mysql]<4.0.0,>=3.0.3; extra == "test")
  Using cached wrapt-1.16.0rc1-cp38-cp38-manylinux_2_5_x86_64.manylinux1_x86_64.manylinux_2_17_x86_64.manylinux2014_x86_64.whl.metadata (6.6 kB)
Collecting deprecation (from testcontainers<4.0.0,>=3.0.3->testcontainers[mysql]<4.0.0,>=3.0.3; extra == "test")
  Using cached deprecation-2.1.0-py2.py3-none-any.whl (11 kB)
Collecting pymysql (from testcontainers[mysql]<4.0.0,>=3.0.3; extra == "test")
  Using cached PyMySQL-1.1.0-py3-none-any.whl.metadata (4.4 kB)
Collecting urllib3<3,>=1.21.1 (from requests<3.0.0,>=2.24.0)
  Using cached urllib3-1.26.18-py2.py3-none-any.whl.metadata (48 kB)
Collecting pycparser (from cffi>=1.12->cryptography>=41.0.2)
  Using cached pycparser-2.21-py2.py3-none-any.whl (118 kB)
Collecting websocket-client>=0.32.0 (from docker>=4.0.0->testcontainers<4.0.0,>=3.0.3->testcontainers[mysql]<4.0.0,>=3.0.3; extra == "test")
  Using cached websocket_client-1.6.4-py3-none-any.whl.metadata (7.7 kB)
Collecting google-crc32c<2.0dev,>=1.0 (from google-cloud-storage<3.0.0dev,>=1.32.0->google-cloud-aiplatform<2.0,>=1.26.0)
  Using cached google_crc32c-1.5.0-cp38-cp38-manylinux_2_17_x86_64.manylinux2014_x86_64.whl (32 kB)
Collecting zipp>=3.1.0 (from importlib-resources>=1.4.0->jsonschema<5.0.0,>=4.0.0)
  Using cached zipp-3.17.0-py3-none-any.whl.metadata (3.7 kB)
Collecting PyJWT<3,>=1.0.0 (from PyJWT[crypto]<3,>=1.0.0->msal<2.0.0,>=1.24.0->azure-identity<2,>=1.12.0)
  Using cached PyJWT-2.8.0-py3-none-any.whl.metadata (4.2 kB)
Collecting portalocker<3,>=1.0 (from msal-extensions<2.0.0,>=0.3.0->azure-identity<2,>=1.12.0)
  Using cached portalocker-2.8.2-py3-none-any.whl.metadata (8.5 kB)
Collecting pyasn1>=0.1.7 (from oauth2client>=1.4.12->google-apitools<0.5.32,>=0.5.31)
  Using cached pyasn1-0.5.0-py2.py3-none-any.whl (83 kB)
Collecting backports.zoneinfo (from tzlocal>=1.2->js2py<1,>=0.74)
  Using cached backports.zoneinfo-0.2.1-cp38-cp38-manylinux1_x86_64.whl (74 kB)
Using cached azure_core-1.29.5-py3-none-any.whl (192 kB)
Using cached azure_identity-1.15.0b2-py3-none-any.whl (162 kB)
Using cached azure_storage_blob-12.19.0b1-py3-none-any.whl (394 kB)
Using cached boto3-1.28.70-py3-none-any.whl (135 kB)
Using cached cryptography-41.0.5-cp37-abi3-manylinux_2_28_x86_64.whl (4.4 MB)
Using cached fastavro-1.8.4-cp38-cp38-manylinux_2_17_x86_64.manylinux2014_x86_64.whl (3.1 MB)
Using cached fasteners-0.19-py3-none-any.whl (18 kB)
Using cached google_api_core-2.12.0-py3-none-any.whl (121 kB)
Using cached google_auth-2.23.3-py2.py3-none-any.whl (182 kB)
Using cached google_auth_httplib2-0.1.1-py2.py3-none-any.whl (9.3 kB)
Using cached google_cloud_aiplatform-1.35.0-py2.py3-none-any.whl (3.1 MB)
Using cached google_cloud_bigquery-3.12.0-py2.py3-none-any.whl (220 kB)
Using cached google_cloud_bigquery_storage-2.22.0-py2.py3-none-any.whl (190 kB)
Using cached google_cloud_bigtable-2.21.0-py2.py3-none-any.whl (293 kB)
Using cached google_cloud_core-2.3.3-py2.py3-none-any.whl (29 kB)
Using cached google_cloud_datastore-2.18.0-py2.py3-none-any.whl (177 kB)
Using cached google_cloud_dlp-3.12.3-py2.py3-none-any.whl (143 kB)
Using cached google_cloud_language-2.11.1-py2.py3-none-any.whl (138 kB)
Using cached google_cloud_pubsub-2.18.4-py2.py3-none-any.whl (265 kB)
Using cached google_cloud_pubsublite-1.8.3-py2.py3-none-any.whl (288 kB)
Using cached google_cloud_recommendations_ai-0.10.5-py2.py3-none-any.whl (173 kB)
Using cached google_cloud_spanner-3.40.1-py2.py3-none-any.whl (332 kB)
Using cached google_cloud_videointelligence-2.11.4-py2.py3-none-any.whl (229 kB)
Using cached google_cloud_vision-3.4.5-py2.py3-none-any.whl (444 kB)
Using cached grpcio-1.59.0-cp38-cp38-manylinux_2_17_x86_64.manylinux2014_x86_64.whl (5.3 MB)
Using cached hypothesis-6.88.1-py3-none-any.whl (421 kB)
Using cached joblib-1.3.2-py3-none-any.whl (302 kB)
Using cached jsonschema-4.19.1-py3-none-any.whl (83 kB)
Using cached mock-5.1.0-py3-none-any.whl (30 kB)
Using cached numpy-1.24.4-cp38-cp38-manylinux_2_17_x86_64.manylinux2014_x86_64.whl (17.3 MB)
Using cached orjson-3.9.9-cp38-cp38-manylinux_2_17_x86_64.manylinux2014_x86_64.whl (138 kB)
Using cached proto_plus-1.23.0rc1-py3-none-any.whl (48 kB)
Using cached protobuf-4.24.4-cp37-abi3-manylinux2014_x86_64.whl (311 kB)
Using cached psycopg2_binary-2.9.9-cp38-cp38-manylinux_2_17_x86_64.manylinux2014_x86_64.whl (3.0 MB)
Using cached pyhamcrest-2.1.0-py3-none-any.whl (54 kB)
Using cached pymongo-4.5.0-cp38-cp38-manylinux_2_17_x86_64.manylinux2014_x86_64.whl (687 kB)
Using cached pytest-7.4.3-py3-none-any.whl (325 kB)
Using cached pytest_timeout-2.2.0-py3-none-any.whl (13 kB)
Using cached pytest_xdist-3.3.1-py3-none-any.whl (41 kB)
Using cached pytz-2023.3.post1-py2.py3-none-any.whl (502 kB)
Using cached PyYAML-6.0.1-cp38-cp38-manylinux_2_17_x86_64.manylinux2014_x86_64.whl (736 kB)
Using cached regex-2023.10.3-cp38-cp38-manylinux_2_17_x86_64.manylinux2014_x86_64.whl (776 kB)
Using cached requests-2.31.0-py3-none-any.whl (62 kB)
Using cached requests_mock-1.11.0-py2.py3-none-any.whl (28 kB)
Using cached scikit_learn-1.3.2-cp38-cp38-manylinux_2_17_x86_64.manylinux2014_x86_64.whl (11.1 MB)
Using cached SQLAlchemy-1.4.49-cp38-cp38-manylinux_2_5_x86_64.manylinux1_x86_64.manylinux_2_17_x86_64.manylinux2014_x86_64.whl (1.6 MB)
Using cached tenacity-8.2.3-py3-none-any.whl (24 kB)
Using cached typing_extensions-4.8.0-py3-none-any.whl (31 kB)
Using cached botocore-1.31.70-py3-none-any.whl (11.3 MB)
Using cached certifi-2023.7.22-py3-none-any.whl (158 kB)
Using cached cffi-1.16.0-cp38-cp38-manylinux_2_17_x86_64.manylinux2014_x86_64.whl (444 kB)
Using cached charset_normalizer-3.3.1-cp38-cp38-manylinux_2_17_x86_64.manylinux2014_x86_64.whl (138 kB)
Using cached dnspython-2.4.2-py3-none-any.whl (300 kB)
Using cached docker-6.1.3-py3-none-any.whl (148 kB)
Using cached exceptiongroup-1.1.3-py3-none-any.whl (14 kB)
Using cached execnet-2.0.2-py3-none-any.whl (37 kB)
Using cached google_cloud_resource_manager-1.10.4-py2.py3-none-any.whl (320 kB)
Using cached google_cloud_storage-2.12.0-py2.py3-none-any.whl (120 kB)
Using cached google_resumable_media-2.6.0-py2.py3-none-any.whl (80 kB)
Using cached googleapis_common_protos-1.61.0-py2.py3-none-any.whl (230 kB)
Using cached greenlet-3.0.1-cp38-cp38-manylinux_2_24_x86_64.manylinux_2_28_x86_64.whl (618 kB)
Using cached grpcio_status-1.59.0-py3-none-any.whl (14 kB)
Using cached importlib_resources-6.1.0-py3-none-any.whl (33 kB)
Using cached jsonschema_specifications-2023.7.1-py3-none-any.whl (17 kB)
Using cached msal-1.24.1-py2.py3-none-any.whl (95 kB)
Using cached pyparsing-3.1.1-py3-none-any.whl (103 kB)
Using cached referencing-0.30.2-py3-none-any.whl (25 kB)
Using cached rpds_py-0.10.6-cp38-cp38-manylinux_2_17_x86_64.manylinux2014_x86_64.whl (1.2 MB)
Using cached s3transfer-0.7.0-py3-none-any.whl (79 kB)
Using cached shapely-2.0.2-cp38-cp38-manylinux_2_17_x86_64.manylinux2014_x86_64.whl (2.5 MB)
Using cached threadpoolctl-3.2.0-py3-none-any.whl (15 kB)
Using cached tzlocal-5.2-py3-none-any.whl (17 kB)
Using cached urllib3-1.26.18-py2.py3-none-any.whl (143 kB)
Using cached PyMySQL-1.1.0-py3-none-any.whl (44 kB)
Using cached wrapt-1.16.0rc1-cp38-cp38-manylinux_2_5_x86_64.manylinux1_x86_64.manylinux_2_17_x86_64.manylinux2014_x86_64.whl (82 kB)
Using cached portalocker-2.8.2-py3-none-any.whl (17 kB)
Using cached PyJWT-2.8.0-py3-none-any.whl (22 kB)
Using cached websocket_client-1.6.4-py3-none-any.whl (57 kB)
Using cached zipp-3.17.0-py3-none-any.whl (7.4 kB)
Building wheels for collected packages: apache-beam
  Building wheel for apache-beam (pyproject.toml): started
  Building wheel for apache-beam (pyproject.toml): still running...
  Building wheel for apache-beam (pyproject.toml): still running...
  Building wheel for apache-beam (pyproject.toml): still running...
  Building wheel for apache-beam (pyproject.toml): finished with status 'done'
  Created wheel for apache-beam: filename=apache_beam-2.52.0.dev0-cp38-cp38-linux_x86_64.whl size=16207110 sha256=832b25f2c2136b79f4a93e6dbd9b83cd826757687c6b9a22d4dc27acc1063cfb
  Stored in directory: /home/jenkins/.cache/pip/wheels/77/a7/e6/16454117045e3dcccdce1447c008de111593127ca25d666b73
Successfully built apache-beam
Installing collected packages: sortedcontainers, pytz, pyjsparser, docopt, crcmod, zstandard, zipp, wrapt, websocket-client, urllib3, typing-extensions, threadpoolctl, tenacity, sqlparse, six, rpds-py, regex, pyyaml, pyparsing, pymysql, PyJWT, pyhamcrest, pycparser, pyasn1, psycopg2-binary, protobuf, portalocker, pkgutil-resolve-name, parameterized, overrides, orjson, objsize, numpy, mock, joblib, jmespath, iniconfig, idna, grpcio, greenlet, google-crc32c, fasteners, fastavro, execnet, exceptiongroup, dnspython, dill, deprecation, cloudpickle, charset-normalizer, certifi, backports.zoneinfo, attrs, tzlocal, sqlalchemy, shapely, scipy, rsa, requests, referencing, python-dateutil, pytest, pymongo, pydot, pyasn1-modules, pyarrow, proto-plus, isodate, importlib-resources, hypothesis, httplib2, googleapis-common-protos, google-resumable-media, cffi, scikit-learn, requests-mock, pytest-xdist, pytest-timeout, pandas, oauth2client, jsonschema-specifications, js2py, hdfs, grpcio-status, google-auth, freezegun, docker, cryptography, botocore, azure-core, testcontainers, s3transfer, jsonschema, grpc-google-iam-v1, google-auth-httplib2, google-apitools, google-api-core, azure-storage-blob, msal, google-cloud-core, boto3, apache-beam, msal-extensions, google-cloud-vision, google-cloud-videointelligence, google-cloud-storage, google-cloud-spanner, google-cloud-resource-manager, google-cloud-recommendations-ai, google-cloud-pubsub, google-cloud-language, google-cloud-dlp, google-cloud-datastore, google-cloud-bigtable, google-cloud-bigquery-storage, google-cloud-bigquery, google-cloud-pubsublite, google-cloud-aiplatform, azure-identity
Successfully installed PyJWT-2.8.0 apache-beam-2.52.0.dev0 attrs-23.1.0 azure-core-1.29.5 azure-identity-1.15.0b2 azure-storage-blob-12.19.0b1 backports.zoneinfo-0.2.1 boto3-1.28.70 botocore-1.31.70 certifi-2023.7.22 cffi-1.16.0 charset-normalizer-3.3.1 cloudpickle-2.2.1 crcmod-1.7 cryptography-41.0.5 deprecation-2.1.0 dill-0.3.1.1 dnspython-2.4.2 docker-6.1.3 docopt-0.6.2 exceptiongroup-1.1.3 execnet-2.0.2 fastavro-1.8.4 fasteners-0.19 freezegun-1.2.2 google-api-core-2.12.0 google-apitools-0.5.31 google-auth-2.23.3 google-auth-httplib2-0.1.1 google-cloud-aiplatform-1.35.0 google-cloud-bigquery-3.12.0 google-cloud-bigquery-storage-2.22.0 google-cloud-bigtable-2.21.0 google-cloud-core-2.3.3 google-cloud-datastore-2.18.0 google-cloud-dlp-3.12.3 google-cloud-language-2.11.1 google-cloud-pubsub-2.18.4 google-cloud-pubsublite-1.8.3 google-cloud-recommendations-ai-0.10.5 google-cloud-resource-manager-1.10.4 google-cloud-spanner-3.40.1 google-cloud-storage-2.12.0 google-cloud-videointelligence-2.11.4 google-cloud-vision-3.4.5 google-crc32c-1.5.0 google-resumable-media-2.6.0 googleapis-common-protos-1.61.0 greenlet-3.0.1 grpc-google-iam-v1-0.12.6 grpcio-1.59.0 grpcio-status-1.59.0 hdfs-2.7.3 httplib2-0.22.0 hypothesis-6.88.1 idna-3.4 importlib-resources-6.1.0 iniconfig-2.0.0 isodate-0.6.1 jmespath-1.0.1 joblib-1.3.2 js2py-0.74 jsonschema-4.19.1 jsonschema-specifications-2023.7.1 mock-5.1.0 msal-1.24.1 msal-extensions-1.0.0 numpy-1.24.4 oauth2client-4.1.3 objsize-0.6.1 orjson-3.9.9 overrides-6.5.0 pandas-1.5.3 parameterized-0.9.0 pkgutil-resolve-name-1.3.10 portalocker-2.8.2 proto-plus-1.23.0rc1 protobuf-4.24.4 psycopg2-binary-2.9.9 pyarrow-11.0.0 pyasn1-0.5.0 pyasn1-modules-0.3.0 pycparser-2.21 pydot-1.4.2 pyhamcrest-2.1.0 pyjsparser-2.7.1 pymongo-4.5.0 pymysql-1.1.0 pyparsing-3.1.1 pytest-7.4.3 pytest-timeout-2.2.0 pytest-xdist-3.3.1 python-dateutil-2.8.2 pytz-2023.3.post1 pyyaml-6.0.1 referencing-0.30.2 regex-2023.10.3 requests-2.31.0 requests-mock-1.11.0 rpds-py-0.10.6 rsa-4.9 s3transfer-0.7.0 scikit-learn-1.3.2 scipy-1.10.1 shapely-2.0.2 six-1.16.0 sortedcontainers-2.4.0 sqlalchemy-1.4.49 sqlparse-0.4.4 tenacity-8.2.3 testcontainers-3.7.1 threadpoolctl-3.2.0 typing-extensions-4.8.0 tzlocal-5.2 urllib3-1.26.18 websocket-client-1.6.4 wrapt-1.16.0rc1 zipp-3.17.0 zstandard-0.21.0

> Task :sdks:python:apache_beam:testing:load_tests:run
INFO:root:Using provided Python SDK container image: gcr.io/apache-beam-testing/beam-sdk/beam_python3.8_sdk:latest
INFO:root:Python SDK container image set to "gcr.io/apache-beam-testing/beam-sdk/beam_python3.8_sdk:latest" for Docker environment
INFO:apache_beam.runners.portability.fn_api_runner.translations:==================== <function pack_combiners at 0x7ff67bb6c9d0> ====================
INFO:apache_beam.runners.portability.fn_api_runner.translations:==================== <function lift_combiners at 0x7ff67bb6ca60> ====================
INFO:apache_beam.runners.portability.fn_api_runner.translations:==================== <function sort_stages at 0x7ff67bb6e1f0> ====================
WARNING:apache_beam.options.pipeline_options:Discarding unparseable args: ['--iterations=10', '--number_of_counter_operations=0', '--number_of_counters=0']
INFO:apache_beam.runners.portability.portable_runner:Job state changed to STOPPED
INFO:apache_beam.runners.portability.portable_runner:Job state changed to STARTING
INFO:apache_beam.runners.portability.portable_runner:Job state changed to RUNNING
ERROR:root:java.util.concurrent.TimeoutException: Waited 3 minutes (plus 1068110 nanoseconds delay) for SettableFuture@550a69f9[status=PENDING]
INFO:apache_beam.runners.portability.portable_runner:Job state changed to FAILED
Traceback (most recent call last):
  File "/usr/lib/python3.8/runpy.py", line 194, in _run_module_as_main
    return _run_code(code, main_globals, None,
  File "/usr/lib/python3.8/runpy.py", line 87, in _run_code
    exec(code, run_globals)
  File "<https://ci-beam.apache.org/job/beam_LoadTests_Python_ParDo_Flink_Batch/ws/src/sdks/python/apache_beam/testing/load_tests/pardo_test.py",> line 167, in <module>
    ParDoTest().run()
  File "<https://ci-beam.apache.org/job/beam_LoadTests_Python_ParDo_Flink_Batch/ws/src/sdks/python/apache_beam/testing/load_tests/load_test.py",> line 152, in run
    state = self.result.wait_until_finish(duration=self.timeout_ms)
  File "<https://ci-beam.apache.org/job/beam_LoadTests_Python_ParDo_Flink_Batch/ws/src/sdks/python/apache_beam/runners/portability/portable_runner.py",> line 575, in wait_until_finish
    raise self._runtime_exception
RuntimeError: Pipeline load-tests-python-flink-batch-pardo-1-1025155126_eaaee3da-149d-4bec-b62e-2c8b3ce76ab5 failed in state FAILED: java.util.concurrent.TimeoutException: Waited 3 minutes (plus 1068110 nanoseconds delay) for SettableFuture@550a69f9[status=PENDING]

> Task :sdks:python:apache_beam:testing:load_tests:run FAILED

FAILURE: Build failed with an exception.

* Where:
Build file '<https://ci-beam.apache.org/job/beam_LoadTests_Python_ParDo_Flink_Batch/ws/src/sdks/python/apache_beam/testing/load_tests/build.gradle'> line: 63

* What went wrong:
Execution failed for task ':sdks:python:apache_beam:testing:load_tests:run'.
> error occurred

* Try:
> Run with --stacktrace option to get the stack trace.
> Run with --info or --debug option to get more log output.
> Get more help at https://help.gradle.org.

Deprecated Gradle features were used in this build, making it incompatible with Gradle 9.0.

You can use '--warning-mode all' to show the individual deprecation warnings and determine if they come from your own scripts or plugins.

For more on this, please refer to https://docs.gradle.org/8.4/userguide/command_line_interface.html#sec:command_line_warnings in the Gradle documentation.

BUILD FAILED in 11m 10s
9 actionable tasks: 8 executed, 1 from cache

Publishing build scan...
https://ge.apache.org/s/wj33mti6f63ri

Build step 'Invoke Gradle script' changed build result to FAILURE
Build step 'Invoke Gradle script' marked build as failure

---------------------------------------------------------------------
To unsubscribe, e-mail: builds-unsubscribe@beam.apache.org
For additional commands, e-mail: builds-help@beam.apache.org


Build failed in Jenkins: beam_LoadTests_Python_ParDo_Flink_Batch #1478

Posted by Apache Jenkins Server <je...@builds.apache.org>.
See <https://ci-beam.apache.org/job/beam_LoadTests_Python_ParDo_Flink_Batch/1478/display/redirect>

Changes:


------------------------------------------
[...truncated 182.02 KB...]
Collecting jmespath<2.0.0,>=0.7.1 (from boto3<2,>=1.9)
  Using cached jmespath-1.0.1-py3-none-any.whl (20 kB)
Collecting s3transfer<0.8.0,>=0.7.0 (from boto3<2,>=1.9)
  Using cached s3transfer-0.7.0-py3-none-any.whl.metadata (1.8 kB)
Collecting cffi>=1.12 (from cryptography>=41.0.2)
  Using cached cffi-1.16.0-cp38-cp38-manylinux_2_17_x86_64.manylinux2014_x86_64.whl.metadata (1.5 kB)
Collecting googleapis-common-protos<2.0.dev0,>=1.56.2 (from google-api-core<3,>=2.0.0)
  Using cached googleapis_common_protos-1.61.0-py2.py3-none-any.whl.metadata (1.5 kB)
Collecting oauth2client>=1.4.12 (from google-apitools<0.5.32,>=0.5.31)
  Using cached oauth2client-4.1.3-py2.py3-none-any.whl (98 kB)
Collecting pyasn1-modules>=0.2.1 (from google-auth<3,>=1.18.0)
  Using cached pyasn1_modules-0.3.0-py2.py3-none-any.whl (181 kB)
Collecting rsa<5,>=3.1.4 (from google-auth<3,>=1.18.0)
  Using cached rsa-4.9-py3-none-any.whl (34 kB)
Collecting google-cloud-storage<3.0.0dev,>=1.32.0 (from google-cloud-aiplatform<2.0,>=1.26.0)
  Using cached google_cloud_storage-2.12.0-py2.py3-none-any.whl.metadata (6.1 kB)
Collecting google-cloud-resource-manager<3.0.0dev,>=1.3.3 (from google-cloud-aiplatform<2.0,>=1.26.0)
  Using cached google_cloud_resource_manager-1.10.4-py2.py3-none-any.whl.metadata (5.2 kB)
Collecting shapely<3.0.0dev (from google-cloud-aiplatform<2.0,>=1.26.0)
  Using cached shapely-2.0.2-cp38-cp38-manylinux_2_17_x86_64.manylinux2014_x86_64.whl.metadata (7.0 kB)
Collecting google-resumable-media<3.0dev,>=0.6.0 (from google-cloud-bigquery<4,>=2.0.0)
  Using cached google_resumable_media-2.6.0-py2.py3-none-any.whl.metadata (2.1 kB)
Collecting grpc-google-iam-v1<1.0.0dev,>=0.12.4 (from google-cloud-bigtable<3,>=2.19.0)
  Using cached grpc_google_iam_v1-0.12.6-py2.py3-none-any.whl (26 kB)
Collecting grpcio-status>=1.33.2 (from google-cloud-pubsub<3,>=2.1.0)
  Using cached grpcio_status-1.59.0-py3-none-any.whl.metadata (1.3 kB)
Collecting overrides<7.0.0,>=6.0.1 (from google-cloud-pubsublite<2,>=1.2.0)
  Using cached overrides-6.5.0-py3-none-any.whl (17 kB)
Collecting sqlparse>=0.4.4 (from google-cloud-spanner<4,>=3.0.0)
  Using cached sqlparse-0.4.4-py3-none-any.whl (41 kB)
Collecting docopt (from hdfs<3.0.0,>=2.1.0)
  Using cached docopt-0.6.2-py2.py3-none-any.whl
Collecting pyparsing!=3.0.0,!=3.0.1,!=3.0.2,!=3.0.3,<4,>=2.4.2 (from httplib2<0.23.0,>=0.8)
  Using cached pyparsing-3.1.1-py3-none-any.whl.metadata (5.1 kB)
Collecting attrs>=19.2.0 (from hypothesis<=7.0.0,>5.0.0)
  Using cached attrs-23.1.0-py3-none-any.whl (61 kB)
Collecting sortedcontainers<3.0.0,>=2.1.0 (from hypothesis<=7.0.0,>5.0.0)
  Using cached sortedcontainers-2.4.0-py2.py3-none-any.whl (29 kB)
Collecting exceptiongroup>=1.0.0 (from hypothesis<=7.0.0,>5.0.0)
  Using cached exceptiongroup-1.1.3-py3-none-any.whl.metadata (6.1 kB)
Collecting tzlocal>=1.2 (from js2py<1,>=0.74)
  Using cached tzlocal-5.2-py3-none-any.whl.metadata (7.8 kB)
Collecting pyjsparser>=2.5.1 (from js2py<1,>=0.74)
  Using cached pyjsparser-2.7.1-py3-none-any.whl
Collecting importlib-resources>=1.4.0 (from jsonschema<5.0.0,>=4.0.0)
  Using cached importlib_resources-6.1.0-py3-none-any.whl.metadata (4.1 kB)
Collecting jsonschema-specifications>=2023.03.6 (from jsonschema<5.0.0,>=4.0.0)
  Using cached jsonschema_specifications-2023.7.1-py3-none-any.whl.metadata (2.8 kB)
Collecting pkgutil-resolve-name>=1.3.10 (from jsonschema<5.0.0,>=4.0.0)
  Using cached pkgutil_resolve_name-1.3.10-py3-none-any.whl (4.7 kB)
Collecting referencing>=0.28.4 (from jsonschema<5.0.0,>=4.0.0)
  Using cached referencing-0.30.2-py3-none-any.whl.metadata (2.6 kB)
Collecting rpds-py>=0.7.1 (from jsonschema<5.0.0,>=4.0.0)
  Using cached rpds_py-0.10.6-cp38-cp38-manylinux_2_17_x86_64.manylinux2014_x86_64.whl.metadata (3.7 kB)
Collecting dnspython<3.0.0,>=1.16.0 (from pymongo<5.0.0,>=3.8.0)
  Using cached dnspython-2.4.2-py3-none-any.whl.metadata (4.9 kB)
Collecting iniconfig (from pytest<8.0,>=7.1.2)
  Using cached iniconfig-2.0.0-py3-none-any.whl (5.9 kB)
Requirement already satisfied: pluggy<2.0,>=0.12 in <https://ci-beam.apache.org/job/beam_LoadTests_Python_ParDo_Flink_Batch/ws/src/build/gradleenv/1329484227/lib/python3.8/site-packages> (from pytest<8.0,>=7.1.2) (1.3.0)
Requirement already satisfied: tomli>=1.0.0 in <https://ci-beam.apache.org/job/beam_LoadTests_Python_ParDo_Flink_Batch/ws/src/build/gradleenv/1329484227/lib/python3.8/site-packages> (from pytest<8.0,>=7.1.2) (2.0.1)
Collecting execnet>=1.1 (from pytest-xdist<4,>=2.5.0)
  Using cached execnet-2.0.2-py3-none-any.whl.metadata (2.9 kB)
Collecting charset-normalizer<4,>=2 (from requests<3.0.0,>=2.24.0)
  Using cached charset_normalizer-3.3.1-cp38-cp38-manylinux_2_17_x86_64.manylinux2014_x86_64.whl.metadata (33 kB)
Collecting idna<4,>=2.5 (from requests<3.0.0,>=2.24.0)
  Using cached idna-3.4-py3-none-any.whl (61 kB)
Collecting urllib3<3,>=1.21.1 (from requests<3.0.0,>=2.24.0)
  Using cached urllib3-2.0.7-py3-none-any.whl.metadata (6.6 kB)
Collecting certifi>=2017.4.17 (from requests<3.0.0,>=2.24.0)
  Using cached certifi-2023.7.22-py3-none-any.whl.metadata (2.2 kB)
Collecting scipy>=1.5.0 (from scikit-learn>=0.20.0)
  Using cached scipy-1.10.1-cp38-cp38-manylinux_2_17_x86_64.manylinux2014_x86_64.whl (34.5 MB)
Collecting threadpoolctl>=2.0.0 (from scikit-learn>=0.20.0)
  Using cached threadpoolctl-3.2.0-py3-none-any.whl.metadata (10.0 kB)
Collecting greenlet!=0.4.17 (from sqlalchemy<2.0,>=1.3)
  Using cached greenlet-3.0.0-cp38-cp38-manylinux_2_24_x86_64.manylinux_2_28_x86_64.whl.metadata (3.8 kB)
Collecting docker>=4.0.0 (from testcontainers<4.0.0,>=3.0.3->testcontainers[mysql]<4.0.0,>=3.0.3; extra == "test")
  Using cached docker-6.1.3-py3-none-any.whl.metadata (3.5 kB)
Collecting wrapt (from testcontainers<4.0.0,>=3.0.3->testcontainers[mysql]<4.0.0,>=3.0.3; extra == "test")
  Using cached wrapt-1.16.0rc1-cp38-cp38-manylinux_2_5_x86_64.manylinux1_x86_64.manylinux_2_17_x86_64.manylinux2014_x86_64.whl.metadata (6.6 kB)
Collecting deprecation (from testcontainers<4.0.0,>=3.0.3->testcontainers[mysql]<4.0.0,>=3.0.3; extra == "test")
  Using cached deprecation-2.1.0-py2.py3-none-any.whl (11 kB)
Collecting pymysql (from testcontainers[mysql]<4.0.0,>=3.0.3; extra == "test")
  Using cached PyMySQL-1.1.0-py3-none-any.whl.metadata (4.4 kB)
Collecting urllib3<3,>=1.21.1 (from requests<3.0.0,>=2.24.0)
  Using cached urllib3-1.26.18-py2.py3-none-any.whl.metadata (48 kB)
Collecting pycparser (from cffi>=1.12->cryptography>=41.0.2)
  Using cached pycparser-2.21-py2.py3-none-any.whl (118 kB)
Collecting websocket-client>=0.32.0 (from docker>=4.0.0->testcontainers<4.0.0,>=3.0.3->testcontainers[mysql]<4.0.0,>=3.0.3; extra == "test")
  Using cached websocket_client-1.6.4-py3-none-any.whl.metadata (7.7 kB)
Collecting google-crc32c<2.0dev,>=1.0 (from google-cloud-storage<3.0.0dev,>=1.32.0->google-cloud-aiplatform<2.0,>=1.26.0)
  Using cached google_crc32c-1.5.0-cp38-cp38-manylinux_2_17_x86_64.manylinux2014_x86_64.whl (32 kB)
Collecting zipp>=3.1.0 (from importlib-resources>=1.4.0->jsonschema<5.0.0,>=4.0.0)
  Using cached zipp-3.17.0-py3-none-any.whl.metadata (3.7 kB)
Collecting PyJWT<3,>=1.0.0 (from PyJWT[crypto]<3,>=1.0.0->msal<2.0.0,>=1.24.0->azure-identity<2,>=1.12.0)
  Using cached PyJWT-2.8.0-py3-none-any.whl.metadata (4.2 kB)
Collecting portalocker<3,>=1.0 (from msal-extensions<2.0.0,>=0.3.0->azure-identity<2,>=1.12.0)
  Using cached portalocker-2.8.2-py3-none-any.whl.metadata (8.5 kB)
Collecting pyasn1>=0.1.7 (from oauth2client>=1.4.12->google-apitools<0.5.32,>=0.5.31)
  Using cached pyasn1-0.5.0-py2.py3-none-any.whl (83 kB)
Collecting backports.zoneinfo (from tzlocal>=1.2->js2py<1,>=0.74)
  Using cached backports.zoneinfo-0.2.1-cp38-cp38-manylinux1_x86_64.whl (74 kB)
Using cached azure_core-1.29.5-py3-none-any.whl (192 kB)
Using cached azure_identity-1.15.0b2-py3-none-any.whl (162 kB)
Using cached azure_storage_blob-12.19.0b1-py3-none-any.whl (394 kB)
Using cached boto3-1.28.69-py3-none-any.whl (135 kB)
Downloading cryptography-41.0.5-cp37-abi3-manylinux_2_28_x86_64.whl (4.4 MB)
   ━━━━━━━━━━━━━━━━━━━━━━━━━━━━━━━━━━━━━━━━ 4.4/4.4 MB 36.6 MB/s eta 0:00:00
Using cached fastavro-1.8.4-cp38-cp38-manylinux_2_17_x86_64.manylinux2014_x86_64.whl (3.1 MB)
Using cached fasteners-0.19-py3-none-any.whl (18 kB)
Using cached google_api_core-2.12.0-py3-none-any.whl (121 kB)
Using cached google_auth-2.23.3-py2.py3-none-any.whl (182 kB)
Using cached google_auth_httplib2-0.1.1-py2.py3-none-any.whl (9.3 kB)
Using cached google_cloud_aiplatform-1.35.0-py2.py3-none-any.whl (3.1 MB)
Using cached google_cloud_bigquery-3.12.0-py2.py3-none-any.whl (220 kB)
Using cached google_cloud_bigquery_storage-2.22.0-py2.py3-none-any.whl (190 kB)
Using cached google_cloud_bigtable-2.21.0-py2.py3-none-any.whl (293 kB)
Using cached google_cloud_core-2.3.3-py2.py3-none-any.whl (29 kB)
Using cached google_cloud_datastore-2.18.0-py2.py3-none-any.whl (177 kB)
Using cached google_cloud_dlp-3.12.3-py2.py3-none-any.whl (143 kB)
Using cached google_cloud_language-2.11.1-py2.py3-none-any.whl (138 kB)
Using cached google_cloud_pubsub-2.18.4-py2.py3-none-any.whl (265 kB)
Using cached google_cloud_pubsublite-1.8.3-py2.py3-none-any.whl (288 kB)
Using cached google_cloud_recommendations_ai-0.10.5-py2.py3-none-any.whl (173 kB)
Using cached google_cloud_spanner-3.40.1-py2.py3-none-any.whl (332 kB)
Using cached google_cloud_videointelligence-2.11.4-py2.py3-none-any.whl (229 kB)
Using cached google_cloud_vision-3.4.5-py2.py3-none-any.whl (444 kB)
Using cached grpcio-1.59.0-cp38-cp38-manylinux_2_17_x86_64.manylinux2014_x86_64.whl (5.3 MB)
Using cached hypothesis-6.88.1-py3-none-any.whl (421 kB)
Using cached joblib-1.3.2-py3-none-any.whl (302 kB)
Using cached jsonschema-4.19.1-py3-none-any.whl (83 kB)
Using cached mock-5.1.0-py3-none-any.whl (30 kB)
Using cached numpy-1.24.4-cp38-cp38-manylinux_2_17_x86_64.manylinux2014_x86_64.whl (17.3 MB)
Using cached orjson-3.9.9-cp38-cp38-manylinux_2_17_x86_64.manylinux2014_x86_64.whl (138 kB)
Using cached proto_plus-1.23.0rc1-py3-none-any.whl (48 kB)
Using cached protobuf-4.24.4-cp37-abi3-manylinux2014_x86_64.whl (311 kB)
Using cached psycopg2_binary-2.9.9-cp38-cp38-manylinux_2_17_x86_64.manylinux2014_x86_64.whl (3.0 MB)
Using cached pyhamcrest-2.1.0-py3-none-any.whl (54 kB)
Using cached pymongo-4.5.0-cp38-cp38-manylinux_2_17_x86_64.manylinux2014_x86_64.whl (687 kB)
Using cached pytest-7.4.2-py3-none-any.whl (324 kB)
Using cached pytest_timeout-2.2.0-py3-none-any.whl (13 kB)
Using cached pytest_xdist-3.3.1-py3-none-any.whl (41 kB)
Using cached pytz-2023.3.post1-py2.py3-none-any.whl (502 kB)
Using cached PyYAML-6.0.1-cp38-cp38-manylinux_2_17_x86_64.manylinux2014_x86_64.whl (736 kB)
Using cached regex-2023.10.3-cp38-cp38-manylinux_2_17_x86_64.manylinux2014_x86_64.whl (776 kB)
Using cached requests-2.31.0-py3-none-any.whl (62 kB)
Using cached requests_mock-1.11.0-py2.py3-none-any.whl (28 kB)
Using cached scikit_learn-1.3.2-cp38-cp38-manylinux_2_17_x86_64.manylinux2014_x86_64.whl (11.1 MB)
Using cached SQLAlchemy-1.4.49-cp38-cp38-manylinux_2_5_x86_64.manylinux1_x86_64.manylinux_2_17_x86_64.manylinux2014_x86_64.whl (1.6 MB)
Using cached tenacity-8.2.3-py3-none-any.whl (24 kB)
Using cached typing_extensions-4.8.0-py3-none-any.whl (31 kB)
Using cached botocore-1.31.69-py3-none-any.whl (11.3 MB)
Using cached certifi-2023.7.22-py3-none-any.whl (158 kB)
Using cached cffi-1.16.0-cp38-cp38-manylinux_2_17_x86_64.manylinux2014_x86_64.whl (444 kB)
Using cached charset_normalizer-3.3.1-cp38-cp38-manylinux_2_17_x86_64.manylinux2014_x86_64.whl (138 kB)
Using cached dnspython-2.4.2-py3-none-any.whl (300 kB)
Using cached docker-6.1.3-py3-none-any.whl (148 kB)
Using cached exceptiongroup-1.1.3-py3-none-any.whl (14 kB)
Using cached execnet-2.0.2-py3-none-any.whl (37 kB)
Using cached google_cloud_resource_manager-1.10.4-py2.py3-none-any.whl (320 kB)
Using cached google_cloud_storage-2.12.0-py2.py3-none-any.whl (120 kB)
Using cached google_resumable_media-2.6.0-py2.py3-none-any.whl (80 kB)
Using cached googleapis_common_protos-1.61.0-py2.py3-none-any.whl (230 kB)
Using cached greenlet-3.0.0-cp38-cp38-manylinux_2_24_x86_64.manylinux_2_28_x86_64.whl (617 kB)
Using cached grpcio_status-1.59.0-py3-none-any.whl (14 kB)
Using cached importlib_resources-6.1.0-py3-none-any.whl (33 kB)
Using cached jsonschema_specifications-2023.7.1-py3-none-any.whl (17 kB)
Using cached msal-1.24.1-py2.py3-none-any.whl (95 kB)
Using cached pyparsing-3.1.1-py3-none-any.whl (103 kB)
Using cached referencing-0.30.2-py3-none-any.whl (25 kB)
Using cached rpds_py-0.10.6-cp38-cp38-manylinux_2_17_x86_64.manylinux2014_x86_64.whl (1.2 MB)
Using cached s3transfer-0.7.0-py3-none-any.whl (79 kB)
Using cached shapely-2.0.2-cp38-cp38-manylinux_2_17_x86_64.manylinux2014_x86_64.whl (2.5 MB)
Using cached threadpoolctl-3.2.0-py3-none-any.whl (15 kB)
Using cached tzlocal-5.2-py3-none-any.whl (17 kB)
Using cached urllib3-1.26.18-py2.py3-none-any.whl (143 kB)
Using cached PyMySQL-1.1.0-py3-none-any.whl (44 kB)
Using cached wrapt-1.16.0rc1-cp38-cp38-manylinux_2_5_x86_64.manylinux1_x86_64.manylinux_2_17_x86_64.manylinux2014_x86_64.whl (82 kB)
Using cached portalocker-2.8.2-py3-none-any.whl (17 kB)
Using cached PyJWT-2.8.0-py3-none-any.whl (22 kB)
Using cached websocket_client-1.6.4-py3-none-any.whl (57 kB)
Using cached zipp-3.17.0-py3-none-any.whl (7.4 kB)
Building wheels for collected packages: apache-beam
  Building wheel for apache-beam (pyproject.toml): started
  Building wheel for apache-beam (pyproject.toml): still running...
  Building wheel for apache-beam (pyproject.toml): still running...
  Building wheel for apache-beam (pyproject.toml): still running...
  Building wheel for apache-beam (pyproject.toml): finished with status 'done'
  Created wheel for apache-beam: filename=apache_beam-2.52.0.dev0-cp38-cp38-linux_x86_64.whl size=16207582 sha256=5752698972d59db71d1f98e3e958bc11a0da01bd25d93ac494ffac76d2d2cb8b
  Stored in directory: /home/jenkins/.cache/pip/wheels/77/a7/e6/16454117045e3dcccdce1447c008de111593127ca25d666b73
Successfully built apache-beam
Installing collected packages: sortedcontainers, pytz, pyjsparser, docopt, crcmod, zstandard, zipp, wrapt, websocket-client, urllib3, typing-extensions, threadpoolctl, tenacity, sqlparse, six, rpds-py, regex, pyyaml, pyparsing, pymysql, PyJWT, pyhamcrest, pycparser, pyasn1, psycopg2-binary, protobuf, portalocker, pkgutil-resolve-name, parameterized, overrides, orjson, objsize, numpy, mock, joblib, jmespath, iniconfig, idna, grpcio, greenlet, google-crc32c, fasteners, fastavro, execnet, exceptiongroup, dnspython, dill, deprecation, cloudpickle, charset-normalizer, certifi, backports.zoneinfo, attrs, tzlocal, sqlalchemy, shapely, scipy, rsa, requests, referencing, python-dateutil, pytest, pymongo, pydot, pyasn1-modules, pyarrow, proto-plus, isodate, importlib-resources, hypothesis, httplib2, googleapis-common-protos, google-resumable-media, cffi, scikit-learn, requests-mock, pytest-xdist, pytest-timeout, pandas, oauth2client, jsonschema-specifications, js2py, hdfs, grpcio-status, google-auth, freezegun, docker, cryptography, botocore, azure-core, testcontainers, s3transfer, jsonschema, grpc-google-iam-v1, google-auth-httplib2, google-apitools, google-api-core, azure-storage-blob, msal, google-cloud-core, boto3, apache-beam, msal-extensions, google-cloud-vision, google-cloud-videointelligence, google-cloud-storage, google-cloud-spanner, google-cloud-resource-manager, google-cloud-recommendations-ai, google-cloud-pubsub, google-cloud-language, google-cloud-dlp, google-cloud-datastore, google-cloud-bigtable, google-cloud-bigquery-storage, google-cloud-bigquery, google-cloud-pubsublite, google-cloud-aiplatform, azure-identity
Successfully installed PyJWT-2.8.0 apache-beam-2.52.0.dev0 attrs-23.1.0 azure-core-1.29.5 azure-identity-1.15.0b2 azure-storage-blob-12.19.0b1 backports.zoneinfo-0.2.1 boto3-1.28.69 botocore-1.31.69 certifi-2023.7.22 cffi-1.16.0 charset-normalizer-3.3.1 cloudpickle-2.2.1 crcmod-1.7 cryptography-41.0.5 deprecation-2.1.0 dill-0.3.1.1 dnspython-2.4.2 docker-6.1.3 docopt-0.6.2 exceptiongroup-1.1.3 execnet-2.0.2 fastavro-1.8.4 fasteners-0.19 freezegun-1.2.2 google-api-core-2.12.0 google-apitools-0.5.31 google-auth-2.23.3 google-auth-httplib2-0.1.1 google-cloud-aiplatform-1.35.0 google-cloud-bigquery-3.12.0 google-cloud-bigquery-storage-2.22.0 google-cloud-bigtable-2.21.0 google-cloud-core-2.3.3 google-cloud-datastore-2.18.0 google-cloud-dlp-3.12.3 google-cloud-language-2.11.1 google-cloud-pubsub-2.18.4 google-cloud-pubsublite-1.8.3 google-cloud-recommendations-ai-0.10.5 google-cloud-resource-manager-1.10.4 google-cloud-spanner-3.40.1 google-cloud-storage-2.12.0 google-cloud-videointelligence-2.11.4 google-cloud-vision-3.4.5 google-crc32c-1.5.0 google-resumable-media-2.6.0 googleapis-common-protos-1.61.0 greenlet-3.0.0 grpc-google-iam-v1-0.12.6 grpcio-1.59.0 grpcio-status-1.59.0 hdfs-2.7.3 httplib2-0.22.0 hypothesis-6.88.1 idna-3.4 importlib-resources-6.1.0 iniconfig-2.0.0 isodate-0.6.1 jmespath-1.0.1 joblib-1.3.2 js2py-0.74 jsonschema-4.19.1 jsonschema-specifications-2023.7.1 mock-5.1.0 msal-1.24.1 msal-extensions-1.0.0 numpy-1.24.4 oauth2client-4.1.3 objsize-0.6.1 orjson-3.9.9 overrides-6.5.0 pandas-1.5.3 parameterized-0.9.0 pkgutil-resolve-name-1.3.10 portalocker-2.8.2 proto-plus-1.23.0rc1 protobuf-4.24.4 psycopg2-binary-2.9.9 pyarrow-11.0.0 pyasn1-0.5.0 pyasn1-modules-0.3.0 pycparser-2.21 pydot-1.4.2 pyhamcrest-2.1.0 pyjsparser-2.7.1 pymongo-4.5.0 pymysql-1.1.0 pyparsing-3.1.1 pytest-7.4.2 pytest-timeout-2.2.0 pytest-xdist-3.3.1 python-dateutil-2.8.2 pytz-2023.3.post1 pyyaml-6.0.1 referencing-0.30.2 regex-2023.10.3 requests-2.31.0 requests-mock-1.11.0 rpds-py-0.10.6 rsa-4.9 s3transfer-0.7.0 scikit-learn-1.3.2 scipy-1.10.1 shapely-2.0.2 six-1.16.0 sortedcontainers-2.4.0 sqlalchemy-1.4.49 sqlparse-0.4.4 tenacity-8.2.3 testcontainers-3.7.1 threadpoolctl-3.2.0 typing-extensions-4.8.0 tzlocal-5.2 urllib3-1.26.18 websocket-client-1.6.4 wrapt-1.16.0rc1 zipp-3.17.0 zstandard-0.21.0

> Task :sdks:python:apache_beam:testing:load_tests:run
INFO:root:Using provided Python SDK container image: gcr.io/apache-beam-testing/beam-sdk/beam_python3.8_sdk:latest
INFO:root:Python SDK container image set to "gcr.io/apache-beam-testing/beam-sdk/beam_python3.8_sdk:latest" for Docker environment
INFO:apache_beam.runners.portability.fn_api_runner.translations:==================== <function pack_combiners at 0x7f2648d738b0> ====================
INFO:apache_beam.runners.portability.fn_api_runner.translations:==================== <function lift_combiners at 0x7f2648d73940> ====================
INFO:apache_beam.runners.portability.fn_api_runner.translations:==================== <function sort_stages at 0x7f2648d740d0> ====================
WARNING:apache_beam.options.pipeline_options:Discarding unparseable args: ['--iterations=10', '--number_of_counter_operations=0', '--number_of_counters=0']
INFO:apache_beam.runners.portability.portable_runner:Job state changed to STOPPED
INFO:apache_beam.runners.portability.portable_runner:Job state changed to STARTING
INFO:apache_beam.runners.portability.portable_runner:Job state changed to RUNNING
ERROR:root:java.util.concurrent.TimeoutException: Waited 3 minutes (plus 82496 nanoseconds delay) for SettableFuture@5cb8f19f[status=PENDING]
INFO:apache_beam.runners.portability.portable_runner:Job state changed to FAILED
Traceback (most recent call last):
  File "/usr/lib/python3.8/runpy.py", line 194, in _run_module_as_main
    return _run_code(code, main_globals, None,
  File "/usr/lib/python3.8/runpy.py", line 87, in _run_code
    exec(code, run_globals)
  File "<https://ci-beam.apache.org/job/beam_LoadTests_Python_ParDo_Flink_Batch/ws/src/sdks/python/apache_beam/testing/load_tests/pardo_test.py",> line 167, in <module>
    ParDoTest().run()
  File "<https://ci-beam.apache.org/job/beam_LoadTests_Python_ParDo_Flink_Batch/ws/src/sdks/python/apache_beam/testing/load_tests/load_test.py",> line 152, in run
    state = self.result.wait_until_finish(duration=self.timeout_ms)
  File "<https://ci-beam.apache.org/job/beam_LoadTests_Python_ParDo_Flink_Batch/ws/src/sdks/python/apache_beam/runners/portability/portable_runner.py",> line 575, in wait_until_finish
    raise self._runtime_exception
RuntimeError: Pipeline load-tests-python-flink-batch-pardo-1-1024155253_67511038-c1f7-4f3c-b240-f793ae940178 failed in state FAILED: java.util.concurrent.TimeoutException: Waited 3 minutes (plus 82496 nanoseconds delay) for SettableFuture@5cb8f19f[status=PENDING]

> Task :sdks:python:apache_beam:testing:load_tests:run FAILED

FAILURE: Build failed with an exception.

* Where:
Build file '<https://ci-beam.apache.org/job/beam_LoadTests_Python_ParDo_Flink_Batch/ws/src/sdks/python/apache_beam/testing/load_tests/build.gradle'> line: 63

* What went wrong:
Execution failed for task ':sdks:python:apache_beam:testing:load_tests:run'.
> error occurred

* Try:
> Run with --stacktrace option to get the stack trace.
> Run with --info or --debug option to get more log output.
> Get more help at https://help.gradle.org.

Deprecated Gradle features were used in this build, making it incompatible with Gradle 9.0.

You can use '--warning-mode all' to show the individual deprecation warnings and determine if they come from your own scripts or plugins.

For more on this, please refer to https://docs.gradle.org/8.4/userguide/command_line_interface.html#sec:command_line_warnings in the Gradle documentation.

BUILD FAILED in 11m 15s
9 actionable tasks: 8 executed, 1 from cache

Publishing build scan...
https://ge.apache.org/s/s4afzayxellau

Build step 'Invoke Gradle script' changed build result to FAILURE
Build step 'Invoke Gradle script' marked build as failure

---------------------------------------------------------------------
To unsubscribe, e-mail: builds-unsubscribe@beam.apache.org
For additional commands, e-mail: builds-help@beam.apache.org


Build failed in Jenkins: beam_LoadTests_Python_ParDo_Flink_Batch #1477

Posted by Apache Jenkins Server <je...@builds.apache.org>.
See <https://ci-beam.apache.org/job/beam_LoadTests_Python_ParDo_Flink_Batch/1477/display/redirect>

Changes:


------------------------------------------
[...truncated 182.06 KB...]
Collecting jmespath<2.0.0,>=0.7.1 (from boto3<2,>=1.9)
  Using cached jmespath-1.0.1-py3-none-any.whl (20 kB)
Collecting s3transfer<0.8.0,>=0.7.0 (from boto3<2,>=1.9)
  Using cached s3transfer-0.7.0-py3-none-any.whl.metadata (1.8 kB)
Collecting cffi>=1.12 (from cryptography>=41.0.2)
  Using cached cffi-1.16.0-cp38-cp38-manylinux_2_17_x86_64.manylinux2014_x86_64.whl.metadata (1.5 kB)
Collecting googleapis-common-protos<2.0.dev0,>=1.56.2 (from google-api-core<3,>=2.0.0)
  Using cached googleapis_common_protos-1.61.0-py2.py3-none-any.whl.metadata (1.5 kB)
Collecting oauth2client>=1.4.12 (from google-apitools<0.5.32,>=0.5.31)
  Using cached oauth2client-4.1.3-py2.py3-none-any.whl (98 kB)
Collecting pyasn1-modules>=0.2.1 (from google-auth<3,>=1.18.0)
  Using cached pyasn1_modules-0.3.0-py2.py3-none-any.whl (181 kB)
Collecting rsa<5,>=3.1.4 (from google-auth<3,>=1.18.0)
  Using cached rsa-4.9-py3-none-any.whl (34 kB)
Collecting google-cloud-storage<3.0.0dev,>=1.32.0 (from google-cloud-aiplatform<2.0,>=1.26.0)
  Using cached google_cloud_storage-2.12.0-py2.py3-none-any.whl.metadata (6.1 kB)
Collecting google-cloud-resource-manager<3.0.0dev,>=1.3.3 (from google-cloud-aiplatform<2.0,>=1.26.0)
  Using cached google_cloud_resource_manager-1.10.4-py2.py3-none-any.whl.metadata (5.2 kB)
Collecting shapely<3.0.0dev (from google-cloud-aiplatform<2.0,>=1.26.0)
  Using cached shapely-2.0.2-cp38-cp38-manylinux_2_17_x86_64.manylinux2014_x86_64.whl.metadata (7.0 kB)
Collecting google-resumable-media<3.0dev,>=0.6.0 (from google-cloud-bigquery<4,>=2.0.0)
  Using cached google_resumable_media-2.6.0-py2.py3-none-any.whl.metadata (2.1 kB)
Collecting grpc-google-iam-v1<1.0.0dev,>=0.12.4 (from google-cloud-bigtable<3,>=2.19.0)
  Using cached grpc_google_iam_v1-0.12.6-py2.py3-none-any.whl (26 kB)
Collecting grpcio-status>=1.33.2 (from google-cloud-pubsub<3,>=2.1.0)
  Using cached grpcio_status-1.59.0-py3-none-any.whl.metadata (1.3 kB)
Collecting overrides<7.0.0,>=6.0.1 (from google-cloud-pubsublite<2,>=1.2.0)
  Using cached overrides-6.5.0-py3-none-any.whl (17 kB)
Collecting sqlparse>=0.4.4 (from google-cloud-spanner<4,>=3.0.0)
  Using cached sqlparse-0.4.4-py3-none-any.whl (41 kB)
Collecting docopt (from hdfs<3.0.0,>=2.1.0)
  Using cached docopt-0.6.2-py2.py3-none-any.whl
Collecting pyparsing!=3.0.0,!=3.0.1,!=3.0.2,!=3.0.3,<4,>=2.4.2 (from httplib2<0.23.0,>=0.8)
  Using cached pyparsing-3.1.1-py3-none-any.whl.metadata (5.1 kB)
Collecting attrs>=19.2.0 (from hypothesis<=7.0.0,>5.0.0)
  Using cached attrs-23.1.0-py3-none-any.whl (61 kB)
Collecting sortedcontainers<3.0.0,>=2.1.0 (from hypothesis<=7.0.0,>5.0.0)
  Using cached sortedcontainers-2.4.0-py2.py3-none-any.whl (29 kB)
Collecting exceptiongroup>=1.0.0 (from hypothesis<=7.0.0,>5.0.0)
  Using cached exceptiongroup-1.1.3-py3-none-any.whl.metadata (6.1 kB)
Collecting tzlocal>=1.2 (from js2py<1,>=0.74)
  Using cached tzlocal-5.2-py3-none-any.whl.metadata (7.8 kB)
Collecting pyjsparser>=2.5.1 (from js2py<1,>=0.74)
  Using cached pyjsparser-2.7.1-py3-none-any.whl
Collecting importlib-resources>=1.4.0 (from jsonschema<5.0.0,>=4.0.0)
  Using cached importlib_resources-6.1.0-py3-none-any.whl.metadata (4.1 kB)
Collecting jsonschema-specifications>=2023.03.6 (from jsonschema<5.0.0,>=4.0.0)
  Using cached jsonschema_specifications-2023.7.1-py3-none-any.whl.metadata (2.8 kB)
Collecting pkgutil-resolve-name>=1.3.10 (from jsonschema<5.0.0,>=4.0.0)
  Using cached pkgutil_resolve_name-1.3.10-py3-none-any.whl (4.7 kB)
Collecting referencing>=0.28.4 (from jsonschema<5.0.0,>=4.0.0)
  Using cached referencing-0.30.2-py3-none-any.whl.metadata (2.6 kB)
Collecting rpds-py>=0.7.1 (from jsonschema<5.0.0,>=4.0.0)
  Using cached rpds_py-0.10.6-cp38-cp38-manylinux_2_17_x86_64.manylinux2014_x86_64.whl.metadata (3.7 kB)
Collecting dnspython<3.0.0,>=1.16.0 (from pymongo<5.0.0,>=3.8.0)
  Using cached dnspython-2.4.2-py3-none-any.whl.metadata (4.9 kB)
Collecting iniconfig (from pytest<8.0,>=7.1.2)
  Using cached iniconfig-2.0.0-py3-none-any.whl (5.9 kB)
Requirement already satisfied: pluggy<2.0,>=0.12 in <https://ci-beam.apache.org/job/beam_LoadTests_Python_ParDo_Flink_Batch/ws/src/build/gradleenv/1329484227/lib/python3.8/site-packages> (from pytest<8.0,>=7.1.2) (1.3.0)
Requirement already satisfied: tomli>=1.0.0 in <https://ci-beam.apache.org/job/beam_LoadTests_Python_ParDo_Flink_Batch/ws/src/build/gradleenv/1329484227/lib/python3.8/site-packages> (from pytest<8.0,>=7.1.2) (2.0.1)
Collecting execnet>=1.1 (from pytest-xdist<4,>=2.5.0)
  Using cached execnet-2.0.2-py3-none-any.whl.metadata (2.9 kB)
Collecting charset-normalizer<4,>=2 (from requests<3.0.0,>=2.24.0)
  Using cached charset_normalizer-3.3.1-cp38-cp38-manylinux_2_17_x86_64.manylinux2014_x86_64.whl.metadata (33 kB)
Collecting idna<4,>=2.5 (from requests<3.0.0,>=2.24.0)
  Using cached idna-3.4-py3-none-any.whl (61 kB)
Collecting urllib3<3,>=1.21.1 (from requests<3.0.0,>=2.24.0)
  Using cached urllib3-2.0.7-py3-none-any.whl.metadata (6.6 kB)
Collecting certifi>=2017.4.17 (from requests<3.0.0,>=2.24.0)
  Using cached certifi-2023.7.22-py3-none-any.whl.metadata (2.2 kB)
Collecting scipy>=1.5.0 (from scikit-learn>=0.20.0)
  Using cached scipy-1.10.1-cp38-cp38-manylinux_2_17_x86_64.manylinux2014_x86_64.whl (34.5 MB)
Collecting threadpoolctl>=2.0.0 (from scikit-learn>=0.20.0)
  Using cached threadpoolctl-3.2.0-py3-none-any.whl.metadata (10.0 kB)
Collecting greenlet!=0.4.17 (from sqlalchemy<2.0,>=1.3)
  Using cached greenlet-3.0.0-cp38-cp38-manylinux_2_24_x86_64.manylinux_2_28_x86_64.whl.metadata (3.8 kB)
Collecting docker>=4.0.0 (from testcontainers<4.0.0,>=3.0.3->testcontainers[mysql]<4.0.0,>=3.0.3; extra == "test")
  Using cached docker-6.1.3-py3-none-any.whl.metadata (3.5 kB)
Collecting wrapt (from testcontainers<4.0.0,>=3.0.3->testcontainers[mysql]<4.0.0,>=3.0.3; extra == "test")
  Using cached wrapt-1.16.0rc1-cp38-cp38-manylinux_2_5_x86_64.manylinux1_x86_64.manylinux_2_17_x86_64.manylinux2014_x86_64.whl.metadata (6.6 kB)
Collecting deprecation (from testcontainers<4.0.0,>=3.0.3->testcontainers[mysql]<4.0.0,>=3.0.3; extra == "test")
  Using cached deprecation-2.1.0-py2.py3-none-any.whl (11 kB)
Collecting pymysql (from testcontainers[mysql]<4.0.0,>=3.0.3; extra == "test")
  Using cached PyMySQL-1.1.0-py3-none-any.whl.metadata (4.4 kB)
Collecting urllib3<3,>=1.21.1 (from requests<3.0.0,>=2.24.0)
  Using cached urllib3-1.26.18-py2.py3-none-any.whl.metadata (48 kB)
Collecting pycparser (from cffi>=1.12->cryptography>=41.0.2)
  Using cached pycparser-2.21-py2.py3-none-any.whl (118 kB)
Collecting websocket-client>=0.32.0 (from docker>=4.0.0->testcontainers<4.0.0,>=3.0.3->testcontainers[mysql]<4.0.0,>=3.0.3; extra == "test")
  Using cached websocket_client-1.6.4-py3-none-any.whl.metadata (7.7 kB)
Collecting google-crc32c<2.0dev,>=1.0 (from google-cloud-storage<3.0.0dev,>=1.32.0->google-cloud-aiplatform<2.0,>=1.26.0)
  Using cached google_crc32c-1.5.0-cp38-cp38-manylinux_2_17_x86_64.manylinux2014_x86_64.whl (32 kB)
Collecting zipp>=3.1.0 (from importlib-resources>=1.4.0->jsonschema<5.0.0,>=4.0.0)
  Using cached zipp-3.17.0-py3-none-any.whl.metadata (3.7 kB)
Collecting PyJWT<3,>=1.0.0 (from PyJWT[crypto]<3,>=1.0.0->msal<2.0.0,>=1.24.0->azure-identity<2,>=1.12.0)
  Using cached PyJWT-2.8.0-py3-none-any.whl.metadata (4.2 kB)
Collecting portalocker<3,>=1.0 (from msal-extensions<2.0.0,>=0.3.0->azure-identity<2,>=1.12.0)
  Using cached portalocker-2.8.2-py3-none-any.whl.metadata (8.5 kB)
Collecting pyasn1>=0.1.7 (from oauth2client>=1.4.12->google-apitools<0.5.32,>=0.5.31)
  Using cached pyasn1-0.5.0-py2.py3-none-any.whl (83 kB)
Collecting backports.zoneinfo (from tzlocal>=1.2->js2py<1,>=0.74)
  Using cached backports.zoneinfo-0.2.1-cp38-cp38-manylinux1_x86_64.whl (74 kB)
Using cached azure_core-1.29.5-py3-none-any.whl (192 kB)
Using cached azure_identity-1.15.0b2-py3-none-any.whl (162 kB)
Using cached azure_storage_blob-12.19.0b1-py3-none-any.whl (394 kB)
Using cached boto3-1.28.68-py3-none-any.whl (135 kB)
Using cached cryptography-41.0.4-cp37-abi3-manylinux_2_28_x86_64.whl (4.4 MB)
Using cached fastavro-1.8.4-cp38-cp38-manylinux_2_17_x86_64.manylinux2014_x86_64.whl (3.1 MB)
Using cached fasteners-0.19-py3-none-any.whl (18 kB)
Using cached google_api_core-2.12.0-py3-none-any.whl (121 kB)
Using cached google_auth-2.23.3-py2.py3-none-any.whl (182 kB)
Using cached google_auth_httplib2-0.1.1-py2.py3-none-any.whl (9.3 kB)
Using cached google_cloud_aiplatform-1.35.0-py2.py3-none-any.whl (3.1 MB)
Using cached google_cloud_bigquery-3.12.0-py2.py3-none-any.whl (220 kB)
Using cached google_cloud_bigquery_storage-2.22.0-py2.py3-none-any.whl (190 kB)
Using cached google_cloud_bigtable-2.21.0-py2.py3-none-any.whl (293 kB)
Using cached google_cloud_core-2.3.3-py2.py3-none-any.whl (29 kB)
Using cached google_cloud_datastore-2.18.0-py2.py3-none-any.whl (177 kB)
Using cached google_cloud_dlp-3.12.3-py2.py3-none-any.whl (143 kB)
Using cached google_cloud_language-2.11.1-py2.py3-none-any.whl (138 kB)
Using cached google_cloud_pubsub-2.18.4-py2.py3-none-any.whl (265 kB)
Using cached google_cloud_pubsublite-1.8.3-py2.py3-none-any.whl (288 kB)
Using cached google_cloud_recommendations_ai-0.10.5-py2.py3-none-any.whl (173 kB)
Using cached google_cloud_spanner-3.40.1-py2.py3-none-any.whl (332 kB)
Using cached google_cloud_videointelligence-2.11.4-py2.py3-none-any.whl (229 kB)
Using cached google_cloud_vision-3.4.5-py2.py3-none-any.whl (444 kB)
Using cached grpcio-1.59.0-cp38-cp38-manylinux_2_17_x86_64.manylinux2014_x86_64.whl (5.3 MB)
Using cached hypothesis-6.88.1-py3-none-any.whl (421 kB)
Using cached joblib-1.3.2-py3-none-any.whl (302 kB)
Using cached jsonschema-4.19.1-py3-none-any.whl (83 kB)
Using cached mock-5.1.0-py3-none-any.whl (30 kB)
Using cached numpy-1.24.4-cp38-cp38-manylinux_2_17_x86_64.manylinux2014_x86_64.whl (17.3 MB)
Using cached orjson-3.9.9-cp38-cp38-manylinux_2_17_x86_64.manylinux2014_x86_64.whl (138 kB)
Using cached proto_plus-1.23.0rc1-py3-none-any.whl (48 kB)
Using cached protobuf-4.24.4-cp37-abi3-manylinux2014_x86_64.whl (311 kB)
Using cached psycopg2_binary-2.9.9-cp38-cp38-manylinux_2_17_x86_64.manylinux2014_x86_64.whl (3.0 MB)
Using cached pyhamcrest-2.1.0-py3-none-any.whl (54 kB)
Using cached pymongo-4.5.0-cp38-cp38-manylinux_2_17_x86_64.manylinux2014_x86_64.whl (687 kB)
Using cached pytest-7.4.2-py3-none-any.whl (324 kB)
Using cached pytest_timeout-2.2.0-py3-none-any.whl (13 kB)
Using cached pytest_xdist-3.3.1-py3-none-any.whl (41 kB)
Using cached pytz-2023.3.post1-py2.py3-none-any.whl (502 kB)
Using cached PyYAML-6.0.1-cp38-cp38-manylinux_2_17_x86_64.manylinux2014_x86_64.whl (736 kB)
Using cached regex-2023.10.3-cp38-cp38-manylinux_2_17_x86_64.manylinux2014_x86_64.whl (776 kB)
Using cached requests-2.31.0-py3-none-any.whl (62 kB)
Using cached requests_mock-1.11.0-py2.py3-none-any.whl (28 kB)
Downloading scikit_learn-1.3.2-cp38-cp38-manylinux_2_17_x86_64.manylinux2014_x86_64.whl (11.1 MB)
   ━━━━━━━━━━━━━━━━━━━━━━━━━━━━━━━━━━━━━━━━ 11.1/11.1 MB 89.7 MB/s eta 0:00:00
Using cached SQLAlchemy-1.4.49-cp38-cp38-manylinux_2_5_x86_64.manylinux1_x86_64.manylinux_2_17_x86_64.manylinux2014_x86_64.whl (1.6 MB)
Using cached tenacity-8.2.3-py3-none-any.whl (24 kB)
Using cached typing_extensions-4.8.0-py3-none-any.whl (31 kB)
Using cached botocore-1.31.68-py3-none-any.whl (11.3 MB)
Using cached certifi-2023.7.22-py3-none-any.whl (158 kB)
Using cached cffi-1.16.0-cp38-cp38-manylinux_2_17_x86_64.manylinux2014_x86_64.whl (444 kB)
Using cached charset_normalizer-3.3.1-cp38-cp38-manylinux_2_17_x86_64.manylinux2014_x86_64.whl (138 kB)
Using cached dnspython-2.4.2-py3-none-any.whl (300 kB)
Using cached docker-6.1.3-py3-none-any.whl (148 kB)
Using cached exceptiongroup-1.1.3-py3-none-any.whl (14 kB)
Using cached execnet-2.0.2-py3-none-any.whl (37 kB)
Using cached google_cloud_resource_manager-1.10.4-py2.py3-none-any.whl (320 kB)
Using cached google_cloud_storage-2.12.0-py2.py3-none-any.whl (120 kB)
Using cached google_resumable_media-2.6.0-py2.py3-none-any.whl (80 kB)
Using cached googleapis_common_protos-1.61.0-py2.py3-none-any.whl (230 kB)
Using cached greenlet-3.0.0-cp38-cp38-manylinux_2_24_x86_64.manylinux_2_28_x86_64.whl (617 kB)
Using cached grpcio_status-1.59.0-py3-none-any.whl (14 kB)
Using cached importlib_resources-6.1.0-py3-none-any.whl (33 kB)
Using cached jsonschema_specifications-2023.7.1-py3-none-any.whl (17 kB)
Using cached msal-1.24.1-py2.py3-none-any.whl (95 kB)
Using cached pyparsing-3.1.1-py3-none-any.whl (103 kB)
Using cached referencing-0.30.2-py3-none-any.whl (25 kB)
Using cached rpds_py-0.10.6-cp38-cp38-manylinux_2_17_x86_64.manylinux2014_x86_64.whl (1.2 MB)
Using cached s3transfer-0.7.0-py3-none-any.whl (79 kB)
Using cached shapely-2.0.2-cp38-cp38-manylinux_2_17_x86_64.manylinux2014_x86_64.whl (2.5 MB)
Using cached threadpoolctl-3.2.0-py3-none-any.whl (15 kB)
Using cached tzlocal-5.2-py3-none-any.whl (17 kB)
Using cached urllib3-1.26.18-py2.py3-none-any.whl (143 kB)
Using cached PyMySQL-1.1.0-py3-none-any.whl (44 kB)
Using cached wrapt-1.16.0rc1-cp38-cp38-manylinux_2_5_x86_64.manylinux1_x86_64.manylinux_2_17_x86_64.manylinux2014_x86_64.whl (82 kB)
Using cached portalocker-2.8.2-py3-none-any.whl (17 kB)
Using cached PyJWT-2.8.0-py3-none-any.whl (22 kB)
Using cached websocket_client-1.6.4-py3-none-any.whl (57 kB)
Using cached zipp-3.17.0-py3-none-any.whl (7.4 kB)
Building wheels for collected packages: apache-beam
  Building wheel for apache-beam (pyproject.toml): started
  Building wheel for apache-beam (pyproject.toml): still running...
  Building wheel for apache-beam (pyproject.toml): still running...
  Building wheel for apache-beam (pyproject.toml): still running...
  Building wheel for apache-beam (pyproject.toml): finished with status 'done'
  Created wheel for apache-beam: filename=apache_beam-2.52.0.dev0-cp38-cp38-linux_x86_64.whl size=16207512 sha256=a2e56056e838b567ca8fff10d6666eaabfdf1c17817e0409523d5dc6854e97ef
  Stored in directory: /home/jenkins/.cache/pip/wheels/77/a7/e6/16454117045e3dcccdce1447c008de111593127ca25d666b73
Successfully built apache-beam
Installing collected packages: sortedcontainers, pytz, pyjsparser, docopt, crcmod, zstandard, zipp, wrapt, websocket-client, urllib3, typing-extensions, threadpoolctl, tenacity, sqlparse, six, rpds-py, regex, pyyaml, pyparsing, pymysql, PyJWT, pyhamcrest, pycparser, pyasn1, psycopg2-binary, protobuf, portalocker, pkgutil-resolve-name, parameterized, overrides, orjson, objsize, numpy, mock, joblib, jmespath, iniconfig, idna, grpcio, greenlet, google-crc32c, fasteners, fastavro, execnet, exceptiongroup, dnspython, dill, deprecation, cloudpickle, charset-normalizer, certifi, backports.zoneinfo, attrs, tzlocal, sqlalchemy, shapely, scipy, rsa, requests, referencing, python-dateutil, pytest, pymongo, pydot, pyasn1-modules, pyarrow, proto-plus, isodate, importlib-resources, hypothesis, httplib2, googleapis-common-protos, google-resumable-media, cffi, scikit-learn, requests-mock, pytest-xdist, pytest-timeout, pandas, oauth2client, jsonschema-specifications, js2py, hdfs, grpcio-status, google-auth, freezegun, docker, cryptography, botocore, azure-core, testcontainers, s3transfer, jsonschema, grpc-google-iam-v1, google-auth-httplib2, google-apitools, google-api-core, azure-storage-blob, msal, google-cloud-core, boto3, apache-beam, msal-extensions, google-cloud-vision, google-cloud-videointelligence, google-cloud-storage, google-cloud-spanner, google-cloud-resource-manager, google-cloud-recommendations-ai, google-cloud-pubsub, google-cloud-language, google-cloud-dlp, google-cloud-datastore, google-cloud-bigtable, google-cloud-bigquery-storage, google-cloud-bigquery, google-cloud-pubsublite, google-cloud-aiplatform, azure-identity
Successfully installed PyJWT-2.8.0 apache-beam-2.52.0.dev0 attrs-23.1.0 azure-core-1.29.5 azure-identity-1.15.0b2 azure-storage-blob-12.19.0b1 backports.zoneinfo-0.2.1 boto3-1.28.68 botocore-1.31.68 certifi-2023.7.22 cffi-1.16.0 charset-normalizer-3.3.1 cloudpickle-2.2.1 crcmod-1.7 cryptography-41.0.4 deprecation-2.1.0 dill-0.3.1.1 dnspython-2.4.2 docker-6.1.3 docopt-0.6.2 exceptiongroup-1.1.3 execnet-2.0.2 fastavro-1.8.4 fasteners-0.19 freezegun-1.2.2 google-api-core-2.12.0 google-apitools-0.5.31 google-auth-2.23.3 google-auth-httplib2-0.1.1 google-cloud-aiplatform-1.35.0 google-cloud-bigquery-3.12.0 google-cloud-bigquery-storage-2.22.0 google-cloud-bigtable-2.21.0 google-cloud-core-2.3.3 google-cloud-datastore-2.18.0 google-cloud-dlp-3.12.3 google-cloud-language-2.11.1 google-cloud-pubsub-2.18.4 google-cloud-pubsublite-1.8.3 google-cloud-recommendations-ai-0.10.5 google-cloud-resource-manager-1.10.4 google-cloud-spanner-3.40.1 google-cloud-storage-2.12.0 google-cloud-videointelligence-2.11.4 google-cloud-vision-3.4.5 google-crc32c-1.5.0 google-resumable-media-2.6.0 googleapis-common-protos-1.61.0 greenlet-3.0.0 grpc-google-iam-v1-0.12.6 grpcio-1.59.0 grpcio-status-1.59.0 hdfs-2.7.3 httplib2-0.22.0 hypothesis-6.88.1 idna-3.4 importlib-resources-6.1.0 iniconfig-2.0.0 isodate-0.6.1 jmespath-1.0.1 joblib-1.3.2 js2py-0.74 jsonschema-4.19.1 jsonschema-specifications-2023.7.1 mock-5.1.0 msal-1.24.1 msal-extensions-1.0.0 numpy-1.24.4 oauth2client-4.1.3 objsize-0.6.1 orjson-3.9.9 overrides-6.5.0 pandas-1.5.3 parameterized-0.9.0 pkgutil-resolve-name-1.3.10 portalocker-2.8.2 proto-plus-1.23.0rc1 protobuf-4.24.4 psycopg2-binary-2.9.9 pyarrow-11.0.0 pyasn1-0.5.0 pyasn1-modules-0.3.0 pycparser-2.21 pydot-1.4.2 pyhamcrest-2.1.0 pyjsparser-2.7.1 pymongo-4.5.0 pymysql-1.1.0 pyparsing-3.1.1 pytest-7.4.2 pytest-timeout-2.2.0 pytest-xdist-3.3.1 python-dateutil-2.8.2 pytz-2023.3.post1 pyyaml-6.0.1 referencing-0.30.2 regex-2023.10.3 requests-2.31.0 requests-mock-1.11.0 rpds-py-0.10.6 rsa-4.9 s3transfer-0.7.0 scikit-learn-1.3.2 scipy-1.10.1 shapely-2.0.2 six-1.16.0 sortedcontainers-2.4.0 sqlalchemy-1.4.49 sqlparse-0.4.4 tenacity-8.2.3 testcontainers-3.7.1 threadpoolctl-3.2.0 typing-extensions-4.8.0 tzlocal-5.2 urllib3-1.26.18 websocket-client-1.6.4 wrapt-1.16.0rc1 zipp-3.17.0 zstandard-0.21.0

> Task :sdks:python:apache_beam:testing:load_tests:run
INFO:root:Using provided Python SDK container image: gcr.io/apache-beam-testing/beam-sdk/beam_python3.8_sdk:latest
INFO:root:Python SDK container image set to "gcr.io/apache-beam-testing/beam-sdk/beam_python3.8_sdk:latest" for Docker environment
INFO:apache_beam.runners.portability.fn_api_runner.translations:==================== <function pack_combiners at 0x7f37e26f08b0> ====================
INFO:apache_beam.runners.portability.fn_api_runner.translations:==================== <function lift_combiners at 0x7f37e26f0940> ====================
INFO:apache_beam.runners.portability.fn_api_runner.translations:==================== <function sort_stages at 0x7f37e26ee0d0> ====================
WARNING:apache_beam.options.pipeline_options:Discarding unparseable args: ['--iterations=10', '--number_of_counter_operations=0', '--number_of_counters=0']
INFO:apache_beam.runners.portability.portable_runner:Job state changed to STOPPED
INFO:apache_beam.runners.portability.portable_runner:Job state changed to STARTING
INFO:apache_beam.runners.portability.portable_runner:Job state changed to RUNNING
ERROR:root:java.util.concurrent.TimeoutException: Waited 3 minutes (plus 447048 nanoseconds delay) for SettableFuture@65294b86[status=PENDING]
INFO:apache_beam.runners.portability.portable_runner:Job state changed to FAILED
Traceback (most recent call last):
  File "/usr/lib/python3.8/runpy.py", line 194, in _run_module_as_main
    return _run_code(code, main_globals, None,
  File "/usr/lib/python3.8/runpy.py", line 87, in _run_code
    exec(code, run_globals)
  File "<https://ci-beam.apache.org/job/beam_LoadTests_Python_ParDo_Flink_Batch/ws/src/sdks/python/apache_beam/testing/load_tests/pardo_test.py",> line 167, in <module>
    ParDoTest().run()
  File "<https://ci-beam.apache.org/job/beam_LoadTests_Python_ParDo_Flink_Batch/ws/src/sdks/python/apache_beam/testing/load_tests/load_test.py",> line 152, in run
    state = self.result.wait_until_finish(duration=self.timeout_ms)
  File "<https://ci-beam.apache.org/job/beam_LoadTests_Python_ParDo_Flink_Batch/ws/src/sdks/python/apache_beam/runners/portability/portable_runner.py",> line 575, in wait_until_finish
    raise self._runtime_exception
RuntimeError: Pipeline load-tests-python-flink-batch-pardo-1-1023155254_d6412490-83da-4976-b134-991fc803f259 failed in state FAILED: java.util.concurrent.TimeoutException: Waited 3 minutes (plus 447048 nanoseconds delay) for SettableFuture@65294b86[status=PENDING]

> Task :sdks:python:apache_beam:testing:load_tests:run FAILED

FAILURE: Build failed with an exception.

* Where:
Build file '<https://ci-beam.apache.org/job/beam_LoadTests_Python_ParDo_Flink_Batch/ws/src/sdks/python/apache_beam/testing/load_tests/build.gradle'> line: 63

* What went wrong:
Execution failed for task ':sdks:python:apache_beam:testing:load_tests:run'.
> error occurred

* Try:
> Run with --stacktrace option to get the stack trace.
> Run with --info or --debug option to get more log output.
> Get more help at https://help.gradle.org.

Deprecated Gradle features were used in this build, making it incompatible with Gradle 9.0.

You can use '--warning-mode all' to show the individual deprecation warnings and determine if they come from your own scripts or plugins.

For more on this, please refer to https://docs.gradle.org/8.3/userguide/command_line_interface.html#sec:command_line_warnings in the Gradle documentation.

BUILD FAILED in 11m 3s
9 actionable tasks: 8 executed, 1 from cache

Publishing build scan...
https://ge.apache.org/s/oexs7cpm3cyfg

Build step 'Invoke Gradle script' changed build result to FAILURE
Build step 'Invoke Gradle script' marked build as failure

---------------------------------------------------------------------
To unsubscribe, e-mail: builds-unsubscribe@beam.apache.org
For additional commands, e-mail: builds-help@beam.apache.org


Build failed in Jenkins: beam_LoadTests_Python_ParDo_Flink_Batch #1476

Posted by Apache Jenkins Server <je...@builds.apache.org>.
See <https://ci-beam.apache.org/job/beam_LoadTests_Python_ParDo_Flink_Batch/1476/display/redirect>

Changes:


------------------------------------------
[...truncated 182.09 KB...]
Collecting jmespath<2.0.0,>=0.7.1 (from boto3<2,>=1.9)
  Using cached jmespath-1.0.1-py3-none-any.whl (20 kB)
Collecting s3transfer<0.8.0,>=0.7.0 (from boto3<2,>=1.9)
  Using cached s3transfer-0.7.0-py3-none-any.whl.metadata (1.8 kB)
Collecting cffi>=1.12 (from cryptography>=41.0.2)
  Using cached cffi-1.16.0-cp38-cp38-manylinux_2_17_x86_64.manylinux2014_x86_64.whl.metadata (1.5 kB)
Collecting googleapis-common-protos<2.0.dev0,>=1.56.2 (from google-api-core<3,>=2.0.0)
  Using cached googleapis_common_protos-1.61.0-py2.py3-none-any.whl.metadata (1.5 kB)
Collecting oauth2client>=1.4.12 (from google-apitools<0.5.32,>=0.5.31)
  Using cached oauth2client-4.1.3-py2.py3-none-any.whl (98 kB)
Collecting pyasn1-modules>=0.2.1 (from google-auth<3,>=1.18.0)
  Using cached pyasn1_modules-0.3.0-py2.py3-none-any.whl (181 kB)
Collecting rsa<5,>=3.1.4 (from google-auth<3,>=1.18.0)
  Using cached rsa-4.9-py3-none-any.whl (34 kB)
Collecting google-cloud-storage<3.0.0dev,>=1.32.0 (from google-cloud-aiplatform<2.0,>=1.26.0)
  Using cached google_cloud_storage-2.12.0-py2.py3-none-any.whl.metadata (6.1 kB)
Collecting google-cloud-resource-manager<3.0.0dev,>=1.3.3 (from google-cloud-aiplatform<2.0,>=1.26.0)
  Using cached google_cloud_resource_manager-1.10.4-py2.py3-none-any.whl.metadata (5.2 kB)
Collecting shapely<3.0.0dev (from google-cloud-aiplatform<2.0,>=1.26.0)
  Using cached shapely-2.0.2-cp38-cp38-manylinux_2_17_x86_64.manylinux2014_x86_64.whl.metadata (7.0 kB)
Collecting google-resumable-media<3.0dev,>=0.6.0 (from google-cloud-bigquery<4,>=2.0.0)
  Using cached google_resumable_media-2.6.0-py2.py3-none-any.whl.metadata (2.1 kB)
Collecting grpc-google-iam-v1<1.0.0dev,>=0.12.4 (from google-cloud-bigtable<3,>=2.19.0)
  Using cached grpc_google_iam_v1-0.12.6-py2.py3-none-any.whl (26 kB)
Collecting grpcio-status>=1.33.2 (from google-cloud-pubsub<3,>=2.1.0)
  Using cached grpcio_status-1.59.0-py3-none-any.whl.metadata (1.3 kB)
Collecting overrides<7.0.0,>=6.0.1 (from google-cloud-pubsublite<2,>=1.2.0)
  Using cached overrides-6.5.0-py3-none-any.whl (17 kB)
Collecting sqlparse>=0.4.4 (from google-cloud-spanner<4,>=3.0.0)
  Using cached sqlparse-0.4.4-py3-none-any.whl (41 kB)
Collecting docopt (from hdfs<3.0.0,>=2.1.0)
  Using cached docopt-0.6.2-py2.py3-none-any.whl
Collecting pyparsing!=3.0.0,!=3.0.1,!=3.0.2,!=3.0.3,<4,>=2.4.2 (from httplib2<0.23.0,>=0.8)
  Using cached pyparsing-3.1.1-py3-none-any.whl.metadata (5.1 kB)
Collecting attrs>=19.2.0 (from hypothesis<=7.0.0,>5.0.0)
  Using cached attrs-23.1.0-py3-none-any.whl (61 kB)
Collecting sortedcontainers<3.0.0,>=2.1.0 (from hypothesis<=7.0.0,>5.0.0)
  Using cached sortedcontainers-2.4.0-py2.py3-none-any.whl (29 kB)
Collecting exceptiongroup>=1.0.0 (from hypothesis<=7.0.0,>5.0.0)
  Using cached exceptiongroup-1.1.3-py3-none-any.whl.metadata (6.1 kB)
Collecting tzlocal>=1.2 (from js2py<1,>=0.74)
  Using cached tzlocal-5.1-py3-none-any.whl.metadata (16 kB)
Collecting pyjsparser>=2.5.1 (from js2py<1,>=0.74)
  Using cached pyjsparser-2.7.1-py3-none-any.whl
Collecting importlib-resources>=1.4.0 (from jsonschema<5.0.0,>=4.0.0)
  Using cached importlib_resources-6.1.0-py3-none-any.whl.metadata (4.1 kB)
Collecting jsonschema-specifications>=2023.03.6 (from jsonschema<5.0.0,>=4.0.0)
  Using cached jsonschema_specifications-2023.7.1-py3-none-any.whl.metadata (2.8 kB)
Collecting pkgutil-resolve-name>=1.3.10 (from jsonschema<5.0.0,>=4.0.0)
  Using cached pkgutil_resolve_name-1.3.10-py3-none-any.whl (4.7 kB)
Collecting referencing>=0.28.4 (from jsonschema<5.0.0,>=4.0.0)
  Using cached referencing-0.30.2-py3-none-any.whl.metadata (2.6 kB)
Collecting rpds-py>=0.7.1 (from jsonschema<5.0.0,>=4.0.0)
  Using cached rpds_py-0.10.6-cp38-cp38-manylinux_2_17_x86_64.manylinux2014_x86_64.whl.metadata (3.7 kB)
Collecting dnspython<3.0.0,>=1.16.0 (from pymongo<5.0.0,>=3.8.0)
  Using cached dnspython-2.4.2-py3-none-any.whl.metadata (4.9 kB)
Collecting iniconfig (from pytest<8.0,>=7.1.2)
  Using cached iniconfig-2.0.0-py3-none-any.whl (5.9 kB)
Requirement already satisfied: pluggy<2.0,>=0.12 in <https://ci-beam.apache.org/job/beam_LoadTests_Python_ParDo_Flink_Batch/ws/src/build/gradleenv/1329484227/lib/python3.8/site-packages> (from pytest<8.0,>=7.1.2) (1.3.0)
Requirement already satisfied: tomli>=1.0.0 in <https://ci-beam.apache.org/job/beam_LoadTests_Python_ParDo_Flink_Batch/ws/src/build/gradleenv/1329484227/lib/python3.8/site-packages> (from pytest<8.0,>=7.1.2) (2.0.1)
Collecting execnet>=1.1 (from pytest-xdist<4,>=2.5.0)
  Using cached execnet-2.0.2-py3-none-any.whl.metadata (2.9 kB)
Collecting charset-normalizer<4,>=2 (from requests<3.0.0,>=2.24.0)
  Downloading charset_normalizer-3.3.1-cp38-cp38-manylinux_2_17_x86_64.manylinux2014_x86_64.whl.metadata (33 kB)
Collecting idna<4,>=2.5 (from requests<3.0.0,>=2.24.0)
  Using cached idna-3.4-py3-none-any.whl (61 kB)
Collecting urllib3<3,>=1.21.1 (from requests<3.0.0,>=2.24.0)
  Using cached urllib3-2.0.7-py3-none-any.whl.metadata (6.6 kB)
Collecting certifi>=2017.4.17 (from requests<3.0.0,>=2.24.0)
  Using cached certifi-2023.7.22-py3-none-any.whl.metadata (2.2 kB)
Collecting scipy>=1.5.0 (from scikit-learn>=0.20.0)
  Using cached scipy-1.10.1-cp38-cp38-manylinux_2_17_x86_64.manylinux2014_x86_64.whl (34.5 MB)
Collecting threadpoolctl>=2.0.0 (from scikit-learn>=0.20.0)
  Using cached threadpoolctl-3.2.0-py3-none-any.whl.metadata (10.0 kB)
Collecting greenlet!=0.4.17 (from sqlalchemy<2.0,>=1.3)
  Using cached greenlet-3.0.0-cp38-cp38-manylinux_2_24_x86_64.manylinux_2_28_x86_64.whl.metadata (3.8 kB)
Collecting docker>=4.0.0 (from testcontainers<4.0.0,>=3.0.3->testcontainers[mysql]<4.0.0,>=3.0.3; extra == "test")
  Using cached docker-6.1.3-py3-none-any.whl.metadata (3.5 kB)
Collecting wrapt (from testcontainers<4.0.0,>=3.0.3->testcontainers[mysql]<4.0.0,>=3.0.3; extra == "test")
  Using cached wrapt-1.16.0rc1-cp38-cp38-manylinux_2_5_x86_64.manylinux1_x86_64.manylinux_2_17_x86_64.manylinux2014_x86_64.whl.metadata (6.6 kB)
Collecting deprecation (from testcontainers<4.0.0,>=3.0.3->testcontainers[mysql]<4.0.0,>=3.0.3; extra == "test")
  Using cached deprecation-2.1.0-py2.py3-none-any.whl (11 kB)
Collecting pymysql (from testcontainers[mysql]<4.0.0,>=3.0.3; extra == "test")
  Using cached PyMySQL-1.1.0-py3-none-any.whl.metadata (4.4 kB)
Collecting urllib3<3,>=1.21.1 (from requests<3.0.0,>=2.24.0)
  Using cached urllib3-1.26.18-py2.py3-none-any.whl.metadata (48 kB)
Collecting pycparser (from cffi>=1.12->cryptography>=41.0.2)
  Using cached pycparser-2.21-py2.py3-none-any.whl (118 kB)
Collecting websocket-client>=0.32.0 (from docker>=4.0.0->testcontainers<4.0.0,>=3.0.3->testcontainers[mysql]<4.0.0,>=3.0.3; extra == "test")
  Using cached websocket_client-1.6.4-py3-none-any.whl.metadata (7.7 kB)
Collecting google-crc32c<2.0dev,>=1.0 (from google-cloud-storage<3.0.0dev,>=1.32.0->google-cloud-aiplatform<2.0,>=1.26.0)
  Using cached google_crc32c-1.5.0-cp38-cp38-manylinux_2_17_x86_64.manylinux2014_x86_64.whl (32 kB)
Collecting zipp>=3.1.0 (from importlib-resources>=1.4.0->jsonschema<5.0.0,>=4.0.0)
  Using cached zipp-3.17.0-py3-none-any.whl.metadata (3.7 kB)
Collecting PyJWT<3,>=1.0.0 (from PyJWT[crypto]<3,>=1.0.0->msal<2.0.0,>=1.24.0->azure-identity<2,>=1.12.0)
  Using cached PyJWT-2.8.0-py3-none-any.whl.metadata (4.2 kB)
Collecting portalocker<3,>=1.0 (from msal-extensions<2.0.0,>=0.3.0->azure-identity<2,>=1.12.0)
  Using cached portalocker-2.8.2-py3-none-any.whl.metadata (8.5 kB)
Collecting pyasn1>=0.1.7 (from oauth2client>=1.4.12->google-apitools<0.5.32,>=0.5.31)
  Using cached pyasn1-0.5.0-py2.py3-none-any.whl (83 kB)
Collecting backports.zoneinfo (from tzlocal>=1.2->js2py<1,>=0.74)
  Using cached backports.zoneinfo-0.2.1-cp38-cp38-manylinux1_x86_64.whl (74 kB)
Using cached azure_core-1.29.5-py3-none-any.whl (192 kB)
Using cached azure_identity-1.15.0b2-py3-none-any.whl (162 kB)
Using cached azure_storage_blob-12.19.0b1-py3-none-any.whl (394 kB)
Using cached boto3-1.28.68-py3-none-any.whl (135 kB)
Using cached cryptography-41.0.4-cp37-abi3-manylinux_2_28_x86_64.whl (4.4 MB)
Using cached fastavro-1.8.4-cp38-cp38-manylinux_2_17_x86_64.manylinux2014_x86_64.whl (3.1 MB)
Using cached fasteners-0.19-py3-none-any.whl (18 kB)
Using cached google_api_core-2.12.0-py3-none-any.whl (121 kB)
Using cached google_auth-2.23.3-py2.py3-none-any.whl (182 kB)
Using cached google_auth_httplib2-0.1.1-py2.py3-none-any.whl (9.3 kB)
Using cached google_cloud_aiplatform-1.35.0-py2.py3-none-any.whl (3.1 MB)
Using cached google_cloud_bigquery-3.12.0-py2.py3-none-any.whl (220 kB)
Using cached google_cloud_bigquery_storage-2.22.0-py2.py3-none-any.whl (190 kB)
Using cached google_cloud_bigtable-2.21.0-py2.py3-none-any.whl (293 kB)
Using cached google_cloud_core-2.3.3-py2.py3-none-any.whl (29 kB)
Using cached google_cloud_datastore-2.18.0-py2.py3-none-any.whl (177 kB)
Using cached google_cloud_dlp-3.12.3-py2.py3-none-any.whl (143 kB)
Using cached google_cloud_language-2.11.1-py2.py3-none-any.whl (138 kB)
Using cached google_cloud_pubsub-2.18.4-py2.py3-none-any.whl (265 kB)
Using cached google_cloud_pubsublite-1.8.3-py2.py3-none-any.whl (288 kB)
Using cached google_cloud_recommendations_ai-0.10.5-py2.py3-none-any.whl (173 kB)
Using cached google_cloud_spanner-3.40.1-py2.py3-none-any.whl (332 kB)
Using cached google_cloud_videointelligence-2.11.4-py2.py3-none-any.whl (229 kB)
Using cached google_cloud_vision-3.4.5-py2.py3-none-any.whl (444 kB)
Using cached grpcio-1.59.0-cp38-cp38-manylinux_2_17_x86_64.manylinux2014_x86_64.whl (5.3 MB)
Using cached hypothesis-6.88.1-py3-none-any.whl (421 kB)
Using cached joblib-1.3.2-py3-none-any.whl (302 kB)
Using cached jsonschema-4.19.1-py3-none-any.whl (83 kB)
Using cached mock-5.1.0-py3-none-any.whl (30 kB)
Using cached numpy-1.24.4-cp38-cp38-manylinux_2_17_x86_64.manylinux2014_x86_64.whl (17.3 MB)
Using cached orjson-3.9.9-cp38-cp38-manylinux_2_17_x86_64.manylinux2014_x86_64.whl (138 kB)
Using cached proto_plus-1.23.0rc1-py3-none-any.whl (48 kB)
Using cached protobuf-4.24.4-cp37-abi3-manylinux2014_x86_64.whl (311 kB)
Using cached psycopg2_binary-2.9.9-cp38-cp38-manylinux_2_17_x86_64.manylinux2014_x86_64.whl (3.0 MB)
Using cached pyhamcrest-2.1.0-py3-none-any.whl (54 kB)
Using cached pymongo-4.5.0-cp38-cp38-manylinux_2_17_x86_64.manylinux2014_x86_64.whl (687 kB)
Using cached pytest-7.4.2-py3-none-any.whl (324 kB)
Using cached pytest_timeout-2.2.0-py3-none-any.whl (13 kB)
Using cached pytest_xdist-3.3.1-py3-none-any.whl (41 kB)
Using cached pytz-2023.3.post1-py2.py3-none-any.whl (502 kB)
Using cached PyYAML-6.0.1-cp38-cp38-manylinux_2_17_x86_64.manylinux2014_x86_64.whl (736 kB)
Using cached regex-2023.10.3-cp38-cp38-manylinux_2_17_x86_64.manylinux2014_x86_64.whl (776 kB)
Using cached requests-2.31.0-py3-none-any.whl (62 kB)
Using cached requests_mock-1.11.0-py2.py3-none-any.whl (28 kB)
Using cached scikit_learn-1.3.1-cp38-cp38-manylinux_2_17_x86_64.manylinux2014_x86_64.whl (11.1 MB)
Using cached SQLAlchemy-1.4.49-cp38-cp38-manylinux_2_5_x86_64.manylinux1_x86_64.manylinux_2_17_x86_64.manylinux2014_x86_64.whl (1.6 MB)
Using cached tenacity-8.2.3-py3-none-any.whl (24 kB)
Using cached typing_extensions-4.8.0-py3-none-any.whl (31 kB)
Using cached botocore-1.31.68-py3-none-any.whl (11.3 MB)
Using cached certifi-2023.7.22-py3-none-any.whl (158 kB)
Using cached cffi-1.16.0-cp38-cp38-manylinux_2_17_x86_64.manylinux2014_x86_64.whl (444 kB)
Downloading charset_normalizer-3.3.1-cp38-cp38-manylinux_2_17_x86_64.manylinux2014_x86_64.whl (138 kB)
   ━━━━━━━━━━━━━━━━━━━━━━━━━━━━━━━━━━━━━━━━ 138.3/138.3 kB 5.5 MB/s eta 0:00:00
Using cached dnspython-2.4.2-py3-none-any.whl (300 kB)
Using cached docker-6.1.3-py3-none-any.whl (148 kB)
Using cached exceptiongroup-1.1.3-py3-none-any.whl (14 kB)
Using cached execnet-2.0.2-py3-none-any.whl (37 kB)
Using cached google_cloud_resource_manager-1.10.4-py2.py3-none-any.whl (320 kB)
Using cached google_cloud_storage-2.12.0-py2.py3-none-any.whl (120 kB)
Using cached google_resumable_media-2.6.0-py2.py3-none-any.whl (80 kB)
Using cached googleapis_common_protos-1.61.0-py2.py3-none-any.whl (230 kB)
Using cached greenlet-3.0.0-cp38-cp38-manylinux_2_24_x86_64.manylinux_2_28_x86_64.whl (617 kB)
Using cached grpcio_status-1.59.0-py3-none-any.whl (14 kB)
Using cached importlib_resources-6.1.0-py3-none-any.whl (33 kB)
Using cached jsonschema_specifications-2023.7.1-py3-none-any.whl (17 kB)
Using cached msal-1.24.1-py2.py3-none-any.whl (95 kB)
Using cached pyparsing-3.1.1-py3-none-any.whl (103 kB)
Using cached referencing-0.30.2-py3-none-any.whl (25 kB)
Using cached rpds_py-0.10.6-cp38-cp38-manylinux_2_17_x86_64.manylinux2014_x86_64.whl (1.2 MB)
Using cached s3transfer-0.7.0-py3-none-any.whl (79 kB)
Using cached shapely-2.0.2-cp38-cp38-manylinux_2_17_x86_64.manylinux2014_x86_64.whl (2.5 MB)
Using cached threadpoolctl-3.2.0-py3-none-any.whl (15 kB)
Using cached tzlocal-5.1-py3-none-any.whl (21 kB)
Using cached urllib3-1.26.18-py2.py3-none-any.whl (143 kB)
Using cached PyMySQL-1.1.0-py3-none-any.whl (44 kB)
Using cached wrapt-1.16.0rc1-cp38-cp38-manylinux_2_5_x86_64.manylinux1_x86_64.manylinux_2_17_x86_64.manylinux2014_x86_64.whl (82 kB)
Using cached portalocker-2.8.2-py3-none-any.whl (17 kB)
Using cached PyJWT-2.8.0-py3-none-any.whl (22 kB)
Using cached websocket_client-1.6.4-py3-none-any.whl (57 kB)
Using cached zipp-3.17.0-py3-none-any.whl (7.4 kB)
Building wheels for collected packages: apache-beam
  Building wheel for apache-beam (pyproject.toml): started
  Building wheel for apache-beam (pyproject.toml): still running...
  Building wheel for apache-beam (pyproject.toml): still running...
  Building wheel for apache-beam (pyproject.toml): still running...
  Building wheel for apache-beam (pyproject.toml): finished with status 'done'
  Created wheel for apache-beam: filename=apache_beam-2.52.0.dev0-cp38-cp38-linux_x86_64.whl size=16207391 sha256=65356f2a36b0ec5df5fd5d77f4849b14624465cd10d82a520779097a593b1bb0
  Stored in directory: /home/jenkins/.cache/pip/wheels/77/a7/e6/16454117045e3dcccdce1447c008de111593127ca25d666b73
Successfully built apache-beam
Installing collected packages: sortedcontainers, pytz, pyjsparser, docopt, crcmod, zstandard, zipp, wrapt, websocket-client, urllib3, typing-extensions, threadpoolctl, tenacity, sqlparse, six, rpds-py, regex, pyyaml, pyparsing, pymysql, PyJWT, pyhamcrest, pycparser, pyasn1, psycopg2-binary, protobuf, portalocker, pkgutil-resolve-name, parameterized, overrides, orjson, objsize, numpy, mock, joblib, jmespath, iniconfig, idna, grpcio, greenlet, google-crc32c, fasteners, fastavro, execnet, exceptiongroup, dnspython, dill, deprecation, cloudpickle, charset-normalizer, certifi, backports.zoneinfo, attrs, tzlocal, sqlalchemy, shapely, scipy, rsa, requests, referencing, python-dateutil, pytest, pymongo, pydot, pyasn1-modules, pyarrow, proto-plus, isodate, importlib-resources, hypothesis, httplib2, googleapis-common-protos, google-resumable-media, cffi, scikit-learn, requests-mock, pytest-xdist, pytest-timeout, pandas, oauth2client, jsonschema-specifications, js2py, hdfs, grpcio-status, google-auth, freezegun, docker, cryptography, botocore, azure-core, testcontainers, s3transfer, jsonschema, grpc-google-iam-v1, google-auth-httplib2, google-apitools, google-api-core, azure-storage-blob, msal, google-cloud-core, boto3, apache-beam, msal-extensions, google-cloud-vision, google-cloud-videointelligence, google-cloud-storage, google-cloud-spanner, google-cloud-resource-manager, google-cloud-recommendations-ai, google-cloud-pubsub, google-cloud-language, google-cloud-dlp, google-cloud-datastore, google-cloud-bigtable, google-cloud-bigquery-storage, google-cloud-bigquery, google-cloud-pubsublite, google-cloud-aiplatform, azure-identity
Successfully installed PyJWT-2.8.0 apache-beam-2.52.0.dev0 attrs-23.1.0 azure-core-1.29.5 azure-identity-1.15.0b2 azure-storage-blob-12.19.0b1 backports.zoneinfo-0.2.1 boto3-1.28.68 botocore-1.31.68 certifi-2023.7.22 cffi-1.16.0 charset-normalizer-3.3.1 cloudpickle-2.2.1 crcmod-1.7 cryptography-41.0.4 deprecation-2.1.0 dill-0.3.1.1 dnspython-2.4.2 docker-6.1.3 docopt-0.6.2 exceptiongroup-1.1.3 execnet-2.0.2 fastavro-1.8.4 fasteners-0.19 freezegun-1.2.2 google-api-core-2.12.0 google-apitools-0.5.31 google-auth-2.23.3 google-auth-httplib2-0.1.1 google-cloud-aiplatform-1.35.0 google-cloud-bigquery-3.12.0 google-cloud-bigquery-storage-2.22.0 google-cloud-bigtable-2.21.0 google-cloud-core-2.3.3 google-cloud-datastore-2.18.0 google-cloud-dlp-3.12.3 google-cloud-language-2.11.1 google-cloud-pubsub-2.18.4 google-cloud-pubsublite-1.8.3 google-cloud-recommendations-ai-0.10.5 google-cloud-resource-manager-1.10.4 google-cloud-spanner-3.40.1 google-cloud-storage-2.12.0 google-cloud-videointelligence-2.11.4 google-cloud-vision-3.4.5 google-crc32c-1.5.0 google-resumable-media-2.6.0 googleapis-common-protos-1.61.0 greenlet-3.0.0 grpc-google-iam-v1-0.12.6 grpcio-1.59.0 grpcio-status-1.59.0 hdfs-2.7.3 httplib2-0.22.0 hypothesis-6.88.1 idna-3.4 importlib-resources-6.1.0 iniconfig-2.0.0 isodate-0.6.1 jmespath-1.0.1 joblib-1.3.2 js2py-0.74 jsonschema-4.19.1 jsonschema-specifications-2023.7.1 mock-5.1.0 msal-1.24.1 msal-extensions-1.0.0 numpy-1.24.4 oauth2client-4.1.3 objsize-0.6.1 orjson-3.9.9 overrides-6.5.0 pandas-1.5.3 parameterized-0.9.0 pkgutil-resolve-name-1.3.10 portalocker-2.8.2 proto-plus-1.23.0rc1 protobuf-4.24.4 psycopg2-binary-2.9.9 pyarrow-11.0.0 pyasn1-0.5.0 pyasn1-modules-0.3.0 pycparser-2.21 pydot-1.4.2 pyhamcrest-2.1.0 pyjsparser-2.7.1 pymongo-4.5.0 pymysql-1.1.0 pyparsing-3.1.1 pytest-7.4.2 pytest-timeout-2.2.0 pytest-xdist-3.3.1 python-dateutil-2.8.2 pytz-2023.3.post1 pyyaml-6.0.1 referencing-0.30.2 regex-2023.10.3 requests-2.31.0 requests-mock-1.11.0 rpds-py-0.10.6 rsa-4.9 s3transfer-0.7.0 scikit-learn-1.3.1 scipy-1.10.1 shapely-2.0.2 six-1.16.0 sortedcontainers-2.4.0 sqlalchemy-1.4.49 sqlparse-0.4.4 tenacity-8.2.3 testcontainers-3.7.1 threadpoolctl-3.2.0 typing-extensions-4.8.0 tzlocal-5.1 urllib3-1.26.18 websocket-client-1.6.4 wrapt-1.16.0rc1 zipp-3.17.0 zstandard-0.21.0

> Task :sdks:python:apache_beam:testing:load_tests:run
INFO:root:Using provided Python SDK container image: gcr.io/apache-beam-testing/beam-sdk/beam_python3.8_sdk:latest
INFO:root:Python SDK container image set to "gcr.io/apache-beam-testing/beam-sdk/beam_python3.8_sdk:latest" for Docker environment
INFO:apache_beam.runners.portability.fn_api_runner.translations:==================== <function pack_combiners at 0x7f0ce34058b0> ====================
INFO:apache_beam.runners.portability.fn_api_runner.translations:==================== <function lift_combiners at 0x7f0ce3405940> ====================
INFO:apache_beam.runners.portability.fn_api_runner.translations:==================== <function sort_stages at 0x7f0ce34070d0> ====================
WARNING:apache_beam.options.pipeline_options:Discarding unparseable args: ['--iterations=10', '--number_of_counter_operations=0', '--number_of_counters=0']
INFO:apache_beam.runners.portability.portable_runner:Job state changed to STOPPED
INFO:apache_beam.runners.portability.portable_runner:Job state changed to STARTING
INFO:apache_beam.runners.portability.portable_runner:Job state changed to RUNNING
ERROR:root:java.util.concurrent.TimeoutException: Waited 3 minutes (plus 71478 nanoseconds delay) for SettableFuture@7e7258c7[status=PENDING]
INFO:apache_beam.runners.portability.portable_runner:Job state changed to FAILED
Traceback (most recent call last):
  File "/usr/lib/python3.8/runpy.py", line 194, in _run_module_as_main
    return _run_code(code, main_globals, None,
  File "/usr/lib/python3.8/runpy.py", line 87, in _run_code
    exec(code, run_globals)
  File "<https://ci-beam.apache.org/job/beam_LoadTests_Python_ParDo_Flink_Batch/ws/src/sdks/python/apache_beam/testing/load_tests/pardo_test.py",> line 167, in <module>
    ParDoTest().run()
  File "<https://ci-beam.apache.org/job/beam_LoadTests_Python_ParDo_Flink_Batch/ws/src/sdks/python/apache_beam/testing/load_tests/load_test.py",> line 152, in run
    state = self.result.wait_until_finish(duration=self.timeout_ms)
  File "<https://ci-beam.apache.org/job/beam_LoadTests_Python_ParDo_Flink_Batch/ws/src/sdks/python/apache_beam/runners/portability/portable_runner.py",> line 575, in wait_until_finish
    raise self._runtime_exception
RuntimeError: Pipeline load-tests-python-flink-batch-pardo-1-1022155249_77b69b0b-e5f2-4cf0-9bc7-8ff7821b30cf failed in state FAILED: java.util.concurrent.TimeoutException: Waited 3 minutes (plus 71478 nanoseconds delay) for SettableFuture@7e7258c7[status=PENDING]

> Task :sdks:python:apache_beam:testing:load_tests:run FAILED

FAILURE: Build failed with an exception.

* Where:
Build file '<https://ci-beam.apache.org/job/beam_LoadTests_Python_ParDo_Flink_Batch/ws/src/sdks/python/apache_beam/testing/load_tests/build.gradle'> line: 63

* What went wrong:
Execution failed for task ':sdks:python:apache_beam:testing:load_tests:run'.
> error occurred

* Try:
> Run with --stacktrace option to get the stack trace.
> Run with --info or --debug option to get more log output.
> Get more help at https://help.gradle.org.

Deprecated Gradle features were used in this build, making it incompatible with Gradle 9.0.

You can use '--warning-mode all' to show the individual deprecation warnings and determine if they come from your own scripts or plugins.

For more on this, please refer to https://docs.gradle.org/8.3/userguide/command_line_interface.html#sec:command_line_warnings in the Gradle documentation.

BUILD FAILED in 11m 28s
9 actionable tasks: 8 executed, 1 from cache

Publishing build scan...
https://ge.apache.org/s/fxfvjriqh6fhs

Build step 'Invoke Gradle script' changed build result to FAILURE
Build step 'Invoke Gradle script' marked build as failure

---------------------------------------------------------------------
To unsubscribe, e-mail: builds-unsubscribe@beam.apache.org
For additional commands, e-mail: builds-help@beam.apache.org


Build failed in Jenkins: beam_LoadTests_Python_ParDo_Flink_Batch #1475

Posted by Apache Jenkins Server <je...@builds.apache.org>.
See <https://ci-beam.apache.org/job/beam_LoadTests_Python_ParDo_Flink_Batch/1475/display/redirect>

Changes:


------------------------------------------
[...truncated 181.89 KB...]
Collecting botocore<1.32.0,>=1.31.68 (from boto3<2,>=1.9)
  Using cached botocore-1.31.68-py3-none-any.whl.metadata (6.1 kB)
Collecting jmespath<2.0.0,>=0.7.1 (from boto3<2,>=1.9)
  Using cached jmespath-1.0.1-py3-none-any.whl (20 kB)
Collecting s3transfer<0.8.0,>=0.7.0 (from boto3<2,>=1.9)
  Using cached s3transfer-0.7.0-py3-none-any.whl.metadata (1.8 kB)
Collecting cffi>=1.12 (from cryptography>=41.0.2)
  Using cached cffi-1.16.0-cp38-cp38-manylinux_2_17_x86_64.manylinux2014_x86_64.whl.metadata (1.5 kB)
Collecting googleapis-common-protos<2.0.dev0,>=1.56.2 (from google-api-core<3,>=2.0.0)
  Using cached googleapis_common_protos-1.61.0-py2.py3-none-any.whl.metadata (1.5 kB)
Collecting oauth2client>=1.4.12 (from google-apitools<0.5.32,>=0.5.31)
  Using cached oauth2client-4.1.3-py2.py3-none-any.whl (98 kB)
Collecting pyasn1-modules>=0.2.1 (from google-auth<3,>=1.18.0)
  Using cached pyasn1_modules-0.3.0-py2.py3-none-any.whl (181 kB)
Collecting rsa<5,>=3.1.4 (from google-auth<3,>=1.18.0)
  Using cached rsa-4.9-py3-none-any.whl (34 kB)
Collecting google-cloud-storage<3.0.0dev,>=1.32.0 (from google-cloud-aiplatform<2.0,>=1.26.0)
  Using cached google_cloud_storage-2.12.0-py2.py3-none-any.whl.metadata (6.1 kB)
Collecting google-cloud-resource-manager<3.0.0dev,>=1.3.3 (from google-cloud-aiplatform<2.0,>=1.26.0)
  Using cached google_cloud_resource_manager-1.10.4-py2.py3-none-any.whl.metadata (5.2 kB)
Collecting shapely<3.0.0dev (from google-cloud-aiplatform<2.0,>=1.26.0)
  Using cached shapely-2.0.2-cp38-cp38-manylinux_2_17_x86_64.manylinux2014_x86_64.whl.metadata (7.0 kB)
Collecting google-resumable-media<3.0dev,>=0.6.0 (from google-cloud-bigquery<4,>=2.0.0)
  Using cached google_resumable_media-2.6.0-py2.py3-none-any.whl.metadata (2.1 kB)
Collecting grpc-google-iam-v1<1.0.0dev,>=0.12.4 (from google-cloud-bigtable<3,>=2.19.0)
  Using cached grpc_google_iam_v1-0.12.6-py2.py3-none-any.whl (26 kB)
Collecting grpcio-status>=1.33.2 (from google-cloud-pubsub<3,>=2.1.0)
  Using cached grpcio_status-1.59.0-py3-none-any.whl.metadata (1.3 kB)
Collecting overrides<7.0.0,>=6.0.1 (from google-cloud-pubsublite<2,>=1.2.0)
  Using cached overrides-6.5.0-py3-none-any.whl (17 kB)
Collecting sqlparse>=0.4.4 (from google-cloud-spanner<4,>=3.0.0)
  Using cached sqlparse-0.4.4-py3-none-any.whl (41 kB)
Collecting docopt (from hdfs<3.0.0,>=2.1.0)
  Using cached docopt-0.6.2-py2.py3-none-any.whl
Collecting pyparsing!=3.0.0,!=3.0.1,!=3.0.2,!=3.0.3,<4,>=2.4.2 (from httplib2<0.23.0,>=0.8)
  Using cached pyparsing-3.1.1-py3-none-any.whl.metadata (5.1 kB)
Collecting attrs>=19.2.0 (from hypothesis<=7.0.0,>5.0.0)
  Using cached attrs-23.1.0-py3-none-any.whl (61 kB)
Collecting sortedcontainers<3.0.0,>=2.1.0 (from hypothesis<=7.0.0,>5.0.0)
  Using cached sortedcontainers-2.4.0-py2.py3-none-any.whl (29 kB)
Collecting exceptiongroup>=1.0.0 (from hypothesis<=7.0.0,>5.0.0)
  Using cached exceptiongroup-1.1.3-py3-none-any.whl.metadata (6.1 kB)
Collecting tzlocal>=1.2 (from js2py<1,>=0.74)
  Using cached tzlocal-5.1-py3-none-any.whl.metadata (16 kB)
Collecting pyjsparser>=2.5.1 (from js2py<1,>=0.74)
  Using cached pyjsparser-2.7.1-py3-none-any.whl
Collecting importlib-resources>=1.4.0 (from jsonschema<5.0.0,>=4.0.0)
  Using cached importlib_resources-6.1.0-py3-none-any.whl.metadata (4.1 kB)
Collecting jsonschema-specifications>=2023.03.6 (from jsonschema<5.0.0,>=4.0.0)
  Using cached jsonschema_specifications-2023.7.1-py3-none-any.whl.metadata (2.8 kB)
Collecting pkgutil-resolve-name>=1.3.10 (from jsonschema<5.0.0,>=4.0.0)
  Using cached pkgutil_resolve_name-1.3.10-py3-none-any.whl (4.7 kB)
Collecting referencing>=0.28.4 (from jsonschema<5.0.0,>=4.0.0)
  Using cached referencing-0.30.2-py3-none-any.whl.metadata (2.6 kB)
Collecting rpds-py>=0.7.1 (from jsonschema<5.0.0,>=4.0.0)
  Using cached rpds_py-0.10.6-cp38-cp38-manylinux_2_17_x86_64.manylinux2014_x86_64.whl.metadata (3.7 kB)
Collecting dnspython<3.0.0,>=1.16.0 (from pymongo<5.0.0,>=3.8.0)
  Using cached dnspython-2.4.2-py3-none-any.whl.metadata (4.9 kB)
Collecting iniconfig (from pytest<8.0,>=7.1.2)
  Using cached iniconfig-2.0.0-py3-none-any.whl (5.9 kB)
Requirement already satisfied: pluggy<2.0,>=0.12 in <https://ci-beam.apache.org/job/beam_LoadTests_Python_ParDo_Flink_Batch/ws/src/build/gradleenv/1329484227/lib/python3.8/site-packages> (from pytest<8.0,>=7.1.2) (1.3.0)
Requirement already satisfied: tomli>=1.0.0 in <https://ci-beam.apache.org/job/beam_LoadTests_Python_ParDo_Flink_Batch/ws/src/build/gradleenv/1329484227/lib/python3.8/site-packages> (from pytest<8.0,>=7.1.2) (2.0.1)
Collecting execnet>=1.1 (from pytest-xdist<4,>=2.5.0)
  Using cached execnet-2.0.2-py3-none-any.whl.metadata (2.9 kB)
Collecting charset-normalizer<4,>=2 (from requests<3.0.0,>=2.24.0)
  Using cached charset_normalizer-3.3.0-cp38-cp38-manylinux_2_17_x86_64.manylinux2014_x86_64.whl.metadata (32 kB)
Collecting idna<4,>=2.5 (from requests<3.0.0,>=2.24.0)
  Using cached idna-3.4-py3-none-any.whl (61 kB)
Collecting urllib3<3,>=1.21.1 (from requests<3.0.0,>=2.24.0)
  Using cached urllib3-2.0.7-py3-none-any.whl.metadata (6.6 kB)
Collecting certifi>=2017.4.17 (from requests<3.0.0,>=2.24.0)
  Using cached certifi-2023.7.22-py3-none-any.whl.metadata (2.2 kB)
Collecting scipy>=1.5.0 (from scikit-learn>=0.20.0)
  Using cached scipy-1.10.1-cp38-cp38-manylinux_2_17_x86_64.manylinux2014_x86_64.whl (34.5 MB)
Collecting threadpoolctl>=2.0.0 (from scikit-learn>=0.20.0)
  Using cached threadpoolctl-3.2.0-py3-none-any.whl.metadata (10.0 kB)
Collecting greenlet!=0.4.17 (from sqlalchemy<2.0,>=1.3)
  Using cached greenlet-3.0.0-cp38-cp38-manylinux_2_24_x86_64.manylinux_2_28_x86_64.whl.metadata (3.8 kB)
Collecting docker>=4.0.0 (from testcontainers<4.0.0,>=3.0.3->testcontainers[mysql]<4.0.0,>=3.0.3; extra == "test")
  Using cached docker-6.1.3-py3-none-any.whl.metadata (3.5 kB)
Collecting wrapt (from testcontainers<4.0.0,>=3.0.3->testcontainers[mysql]<4.0.0,>=3.0.3; extra == "test")
  Using cached wrapt-1.16.0rc1-cp38-cp38-manylinux_2_5_x86_64.manylinux1_x86_64.manylinux_2_17_x86_64.manylinux2014_x86_64.whl.metadata (6.6 kB)
Collecting deprecation (from testcontainers<4.0.0,>=3.0.3->testcontainers[mysql]<4.0.0,>=3.0.3; extra == "test")
  Using cached deprecation-2.1.0-py2.py3-none-any.whl (11 kB)
Collecting pymysql (from testcontainers[mysql]<4.0.0,>=3.0.3; extra == "test")
  Using cached PyMySQL-1.1.0-py3-none-any.whl.metadata (4.4 kB)
Collecting urllib3<3,>=1.21.1 (from requests<3.0.0,>=2.24.0)
  Using cached urllib3-1.26.18-py2.py3-none-any.whl.metadata (48 kB)
Collecting pycparser (from cffi>=1.12->cryptography>=41.0.2)
  Using cached pycparser-2.21-py2.py3-none-any.whl (118 kB)
Collecting websocket-client>=0.32.0 (from docker>=4.0.0->testcontainers<4.0.0,>=3.0.3->testcontainers[mysql]<4.0.0,>=3.0.3; extra == "test")
  Using cached websocket_client-1.6.4-py3-none-any.whl.metadata (7.7 kB)
Collecting google-crc32c<2.0dev,>=1.0 (from google-cloud-storage<3.0.0dev,>=1.32.0->google-cloud-aiplatform<2.0,>=1.26.0)
  Using cached google_crc32c-1.5.0-cp38-cp38-manylinux_2_17_x86_64.manylinux2014_x86_64.whl (32 kB)
Collecting zipp>=3.1.0 (from importlib-resources>=1.4.0->jsonschema<5.0.0,>=4.0.0)
  Using cached zipp-3.17.0-py3-none-any.whl.metadata (3.7 kB)
Collecting PyJWT<3,>=1.0.0 (from PyJWT[crypto]<3,>=1.0.0->msal<2.0.0,>=1.24.0->azure-identity<2,>=1.12.0)
  Using cached PyJWT-2.8.0-py3-none-any.whl.metadata (4.2 kB)
Collecting portalocker<3,>=1.0 (from msal-extensions<2.0.0,>=0.3.0->azure-identity<2,>=1.12.0)
  Using cached portalocker-2.8.2-py3-none-any.whl.metadata (8.5 kB)
Collecting pyasn1>=0.1.7 (from oauth2client>=1.4.12->google-apitools<0.5.32,>=0.5.31)
  Using cached pyasn1-0.5.0-py2.py3-none-any.whl (83 kB)
Collecting backports.zoneinfo (from tzlocal>=1.2->js2py<1,>=0.74)
  Using cached backports.zoneinfo-0.2.1-cp38-cp38-manylinux1_x86_64.whl (74 kB)
Using cached azure_core-1.29.5-py3-none-any.whl (192 kB)
Using cached azure_identity-1.15.0b2-py3-none-any.whl (162 kB)
Using cached azure_storage_blob-12.19.0b1-py3-none-any.whl (394 kB)
Using cached boto3-1.28.68-py3-none-any.whl (135 kB)
Using cached cryptography-41.0.4-cp37-abi3-manylinux_2_28_x86_64.whl (4.4 MB)
Using cached fastavro-1.8.4-cp38-cp38-manylinux_2_17_x86_64.manylinux2014_x86_64.whl (3.1 MB)
Using cached fasteners-0.19-py3-none-any.whl (18 kB)
Using cached google_api_core-2.12.0-py3-none-any.whl (121 kB)
Using cached google_auth-2.23.3-py2.py3-none-any.whl (182 kB)
Using cached google_auth_httplib2-0.1.1-py2.py3-none-any.whl (9.3 kB)
Using cached google_cloud_aiplatform-1.35.0-py2.py3-none-any.whl (3.1 MB)
Using cached google_cloud_bigquery-3.12.0-py2.py3-none-any.whl (220 kB)
Using cached google_cloud_bigquery_storage-2.22.0-py2.py3-none-any.whl (190 kB)
Using cached google_cloud_bigtable-2.21.0-py2.py3-none-any.whl (293 kB)
Using cached google_cloud_core-2.3.3-py2.py3-none-any.whl (29 kB)
Using cached google_cloud_datastore-2.18.0-py2.py3-none-any.whl (177 kB)
Using cached google_cloud_dlp-3.12.3-py2.py3-none-any.whl (143 kB)
Using cached google_cloud_language-2.11.1-py2.py3-none-any.whl (138 kB)
Using cached google_cloud_pubsub-2.18.4-py2.py3-none-any.whl (265 kB)
Using cached google_cloud_pubsublite-1.8.3-py2.py3-none-any.whl (288 kB)
Using cached google_cloud_recommendations_ai-0.10.5-py2.py3-none-any.whl (173 kB)
Using cached google_cloud_spanner-3.40.1-py2.py3-none-any.whl (332 kB)
Using cached google_cloud_videointelligence-2.11.4-py2.py3-none-any.whl (229 kB)
Using cached google_cloud_vision-3.4.5-py2.py3-none-any.whl (444 kB)
Using cached grpcio-1.59.0-cp38-cp38-manylinux_2_17_x86_64.manylinux2014_x86_64.whl (5.3 MB)
Using cached hypothesis-6.88.1-py3-none-any.whl (421 kB)
Using cached joblib-1.3.2-py3-none-any.whl (302 kB)
Using cached jsonschema-4.19.1-py3-none-any.whl (83 kB)
Using cached mock-5.1.0-py3-none-any.whl (30 kB)
Using cached numpy-1.24.4-cp38-cp38-manylinux_2_17_x86_64.manylinux2014_x86_64.whl (17.3 MB)
Using cached orjson-3.9.9-cp38-cp38-manylinux_2_17_x86_64.manylinux2014_x86_64.whl (138 kB)
Using cached proto_plus-1.23.0rc1-py3-none-any.whl (48 kB)
Using cached protobuf-4.24.4-cp37-abi3-manylinux2014_x86_64.whl (311 kB)
Using cached psycopg2_binary-2.9.9-cp38-cp38-manylinux_2_17_x86_64.manylinux2014_x86_64.whl (3.0 MB)
Using cached pymongo-4.5.0-cp38-cp38-manylinux_2_17_x86_64.manylinux2014_x86_64.whl (687 kB)
Using cached pytest-7.4.2-py3-none-any.whl (324 kB)
Using cached pytest_timeout-2.2.0-py3-none-any.whl (13 kB)
Using cached pytest_xdist-3.3.1-py3-none-any.whl (41 kB)
Using cached pytz-2023.3.post1-py2.py3-none-any.whl (502 kB)
Using cached PyYAML-6.0.1-cp38-cp38-manylinux_2_17_x86_64.manylinux2014_x86_64.whl (736 kB)
Using cached regex-2023.10.3-cp38-cp38-manylinux_2_17_x86_64.manylinux2014_x86_64.whl (776 kB)
Using cached requests-2.31.0-py3-none-any.whl (62 kB)
Using cached requests_mock-1.11.0-py2.py3-none-any.whl (28 kB)
Using cached scikit_learn-1.3.1-cp38-cp38-manylinux_2_17_x86_64.manylinux2014_x86_64.whl (11.1 MB)
Using cached SQLAlchemy-1.4.49-cp38-cp38-manylinux_2_5_x86_64.manylinux1_x86_64.manylinux_2_17_x86_64.manylinux2014_x86_64.whl (1.6 MB)
Using cached tenacity-8.2.3-py3-none-any.whl (24 kB)
Using cached typing_extensions-4.8.0-py3-none-any.whl (31 kB)
Using cached botocore-1.31.68-py3-none-any.whl (11.3 MB)
Using cached certifi-2023.7.22-py3-none-any.whl (158 kB)
Using cached cffi-1.16.0-cp38-cp38-manylinux_2_17_x86_64.manylinux2014_x86_64.whl (444 kB)
Using cached charset_normalizer-3.3.0-cp38-cp38-manylinux_2_17_x86_64.manylinux2014_x86_64.whl (137 kB)
Using cached dnspython-2.4.2-py3-none-any.whl (300 kB)
Using cached docker-6.1.3-py3-none-any.whl (148 kB)
Using cached exceptiongroup-1.1.3-py3-none-any.whl (14 kB)
Using cached execnet-2.0.2-py3-none-any.whl (37 kB)
Using cached google_cloud_resource_manager-1.10.4-py2.py3-none-any.whl (320 kB)
Using cached google_cloud_storage-2.12.0-py2.py3-none-any.whl (120 kB)
Using cached google_resumable_media-2.6.0-py2.py3-none-any.whl (80 kB)
Using cached googleapis_common_protos-1.61.0-py2.py3-none-any.whl (230 kB)
Using cached greenlet-3.0.0-cp38-cp38-manylinux_2_24_x86_64.manylinux_2_28_x86_64.whl (617 kB)
Using cached grpcio_status-1.59.0-py3-none-any.whl (14 kB)
Using cached importlib_resources-6.1.0-py3-none-any.whl (33 kB)
Using cached jsonschema_specifications-2023.7.1-py3-none-any.whl (17 kB)
Using cached msal-1.24.1-py2.py3-none-any.whl (95 kB)
Using cached pyparsing-3.1.1-py3-none-any.whl (103 kB)
Using cached referencing-0.30.2-py3-none-any.whl (25 kB)
Using cached rpds_py-0.10.6-cp38-cp38-manylinux_2_17_x86_64.manylinux2014_x86_64.whl (1.2 MB)
Using cached s3transfer-0.7.0-py3-none-any.whl (79 kB)
Using cached shapely-2.0.2-cp38-cp38-manylinux_2_17_x86_64.manylinux2014_x86_64.whl (2.5 MB)
Using cached threadpoolctl-3.2.0-py3-none-any.whl (15 kB)
Using cached tzlocal-5.1-py3-none-any.whl (21 kB)
Using cached urllib3-1.26.18-py2.py3-none-any.whl (143 kB)
Using cached PyMySQL-1.1.0-py3-none-any.whl (44 kB)
Using cached wrapt-1.16.0rc1-cp38-cp38-manylinux_2_5_x86_64.manylinux1_x86_64.manylinux_2_17_x86_64.manylinux2014_x86_64.whl (82 kB)
Using cached portalocker-2.8.2-py3-none-any.whl (17 kB)
Using cached PyJWT-2.8.0-py3-none-any.whl (22 kB)
Using cached websocket_client-1.6.4-py3-none-any.whl (57 kB)
Using cached zipp-3.17.0-py3-none-any.whl (7.4 kB)
Building wheels for collected packages: apache-beam
  Building wheel for apache-beam (pyproject.toml): started
  Building wheel for apache-beam (pyproject.toml): still running...
  Building wheel for apache-beam (pyproject.toml): still running...
  Building wheel for apache-beam (pyproject.toml): still running...
  Building wheel for apache-beam (pyproject.toml): finished with status 'done'
  Created wheel for apache-beam: filename=apache_beam-2.52.0.dev0-cp38-cp38-linux_x86_64.whl size=16207582 sha256=151728b639a6d51948cab84ef7625f34898a9496e2f3740c0dff03591ee9ebc7
  Stored in directory: /home/jenkins/.cache/pip/wheels/77/a7/e6/16454117045e3dcccdce1447c008de111593127ca25d666b73
Successfully built apache-beam
Installing collected packages: sortedcontainers, pytz, pyjsparser, docopt, crcmod, zstandard, zipp, wrapt, websocket-client, urllib3, typing-extensions, threadpoolctl, tenacity, sqlparse, six, rpds-py, regex, pyyaml, pyparsing, pymysql, PyJWT, pyhamcrest, pycparser, pyasn1, psycopg2-binary, protobuf, portalocker, pkgutil-resolve-name, parameterized, overrides, orjson, objsize, numpy, mock, joblib, jmespath, iniconfig, idna, grpcio, greenlet, google-crc32c, fasteners, fastavro, execnet, exceptiongroup, dnspython, dill, deprecation, cloudpickle, charset-normalizer, certifi, backports.zoneinfo, attrs, tzlocal, sqlalchemy, shapely, scipy, rsa, requests, referencing, python-dateutil, pytest, pymongo, pydot, pyasn1-modules, pyarrow, proto-plus, isodate, importlib-resources, hypothesis, httplib2, googleapis-common-protos, google-resumable-media, cffi, scikit-learn, requests-mock, pytest-xdist, pytest-timeout, pandas, oauth2client, jsonschema-specifications, js2py, hdfs, grpcio-status, google-auth, freezegun, docker, cryptography, botocore, azure-core, testcontainers, s3transfer, jsonschema, grpc-google-iam-v1, google-auth-httplib2, google-apitools, google-api-core, azure-storage-blob, msal, google-cloud-core, boto3, apache-beam, msal-extensions, google-cloud-vision, google-cloud-videointelligence, google-cloud-storage, google-cloud-spanner, google-cloud-resource-manager, google-cloud-recommendations-ai, google-cloud-pubsub, google-cloud-language, google-cloud-dlp, google-cloud-datastore, google-cloud-bigtable, google-cloud-bigquery-storage, google-cloud-bigquery, google-cloud-pubsublite, google-cloud-aiplatform, azure-identity
Successfully installed PyJWT-2.8.0 apache-beam-2.52.0.dev0 attrs-23.1.0 azure-core-1.29.5 azure-identity-1.15.0b2 azure-storage-blob-12.19.0b1 backports.zoneinfo-0.2.1 boto3-1.28.68 botocore-1.31.68 certifi-2023.7.22 cffi-1.16.0 charset-normalizer-3.3.0 cloudpickle-2.2.1 crcmod-1.7 cryptography-41.0.4 deprecation-2.1.0 dill-0.3.1.1 dnspython-2.4.2 docker-6.1.3 docopt-0.6.2 exceptiongroup-1.1.3 execnet-2.0.2 fastavro-1.8.4 fasteners-0.19 freezegun-1.2.2 google-api-core-2.12.0 google-apitools-0.5.31 google-auth-2.23.3 google-auth-httplib2-0.1.1 google-cloud-aiplatform-1.35.0 google-cloud-bigquery-3.12.0 google-cloud-bigquery-storage-2.22.0 google-cloud-bigtable-2.21.0 google-cloud-core-2.3.3 google-cloud-datastore-2.18.0 google-cloud-dlp-3.12.3 google-cloud-language-2.11.1 google-cloud-pubsub-2.18.4 google-cloud-pubsublite-1.8.3 google-cloud-recommendations-ai-0.10.5 google-cloud-resource-manager-1.10.4 google-cloud-spanner-3.40.1 google-cloud-storage-2.12.0 google-cloud-videointelligence-2.11.4 google-cloud-vision-3.4.5 google-crc32c-1.5.0 google-resumable-media-2.6.0 googleapis-common-protos-1.61.0 greenlet-3.0.0 grpc-google-iam-v1-0.12.6 grpcio-1.59.0 grpcio-status-1.59.0 hdfs-2.7.3 httplib2-0.22.0 hypothesis-6.88.1 idna-3.4 importlib-resources-6.1.0 iniconfig-2.0.0 isodate-0.6.1 jmespath-1.0.1 joblib-1.3.2 js2py-0.74 jsonschema-4.19.1 jsonschema-specifications-2023.7.1 mock-5.1.0 msal-1.24.1 msal-extensions-1.0.0 numpy-1.24.4 oauth2client-4.1.3 objsize-0.6.1 orjson-3.9.9 overrides-6.5.0 pandas-1.5.3 parameterized-0.9.0 pkgutil-resolve-name-1.3.10 portalocker-2.8.2 proto-plus-1.23.0rc1 protobuf-4.24.4 psycopg2-binary-2.9.9 pyarrow-11.0.0 pyasn1-0.5.0 pyasn1-modules-0.3.0 pycparser-2.21 pydot-1.4.2 pyhamcrest-2.0.4 pyjsparser-2.7.1 pymongo-4.5.0 pymysql-1.1.0 pyparsing-3.1.1 pytest-7.4.2 pytest-timeout-2.2.0 pytest-xdist-3.3.1 python-dateutil-2.8.2 pytz-2023.3.post1 pyyaml-6.0.1 referencing-0.30.2 regex-2023.10.3 requests-2.31.0 requests-mock-1.11.0 rpds-py-0.10.6 rsa-4.9 s3transfer-0.7.0 scikit-learn-1.3.1 scipy-1.10.1 shapely-2.0.2 six-1.16.0 sortedcontainers-2.4.0 sqlalchemy-1.4.49 sqlparse-0.4.4 tenacity-8.2.3 testcontainers-3.7.1 threadpoolctl-3.2.0 typing-extensions-4.8.0 tzlocal-5.1 urllib3-1.26.18 websocket-client-1.6.4 wrapt-1.16.0rc1 zipp-3.17.0 zstandard-0.21.0

> Task :sdks:python:apache_beam:testing:load_tests:run
INFO:root:Using provided Python SDK container image: gcr.io/apache-beam-testing/beam-sdk/beam_python3.8_sdk:latest
INFO:root:Python SDK container image set to "gcr.io/apache-beam-testing/beam-sdk/beam_python3.8_sdk:latest" for Docker environment
INFO:apache_beam.runners.portability.fn_api_runner.translations:==================== <function pack_combiners at 0x7f4f9282e8b0> ====================
INFO:apache_beam.runners.portability.fn_api_runner.translations:==================== <function lift_combiners at 0x7f4f9282e940> ====================
INFO:apache_beam.runners.portability.fn_api_runner.translations:==================== <function sort_stages at 0x7f4f928340d0> ====================
WARNING:apache_beam.options.pipeline_options:Discarding unparseable args: ['--iterations=10', '--number_of_counter_operations=0', '--number_of_counters=0']
INFO:apache_beam.runners.portability.portable_runner:Job state changed to STOPPED
INFO:apache_beam.runners.portability.portable_runner:Job state changed to STARTING
INFO:apache_beam.runners.portability.portable_runner:Job state changed to RUNNING
ERROR:root:java.util.concurrent.TimeoutException: Waited 3 minutes (plus 322490 nanoseconds delay) for SettableFuture@60a14059[status=PENDING]
INFO:apache_beam.runners.portability.portable_runner:Job state changed to FAILED
Traceback (most recent call last):
  File "/usr/lib/python3.8/runpy.py", line 194, in _run_module_as_main
    return _run_code(code, main_globals, None,
  File "/usr/lib/python3.8/runpy.py", line 87, in _run_code
    exec(code, run_globals)
  File "<https://ci-beam.apache.org/job/beam_LoadTests_Python_ParDo_Flink_Batch/ws/src/sdks/python/apache_beam/testing/load_tests/pardo_test.py",> line 167, in <module>
    ParDoTest().run()
  File "<https://ci-beam.apache.org/job/beam_LoadTests_Python_ParDo_Flink_Batch/ws/src/sdks/python/apache_beam/testing/load_tests/load_test.py",> line 152, in run
    state = self.result.wait_until_finish(duration=self.timeout_ms)
  File "<https://ci-beam.apache.org/job/beam_LoadTests_Python_ParDo_Flink_Batch/ws/src/sdks/python/apache_beam/runners/portability/portable_runner.py",> line 575, in wait_until_finish
    raise self._runtime_exception
RuntimeError: Pipeline load-tests-python-flink-batch-pardo-1-1021155251_966909ef-e961-466b-9316-05dbc6d1e069 failed in state FAILED: java.util.concurrent.TimeoutException: Waited 3 minutes (plus 322490 nanoseconds delay) for SettableFuture@60a14059[status=PENDING]

> Task :sdks:python:apache_beam:testing:load_tests:run FAILED

FAILURE: Build failed with an exception.

* Where:
Build file '<https://ci-beam.apache.org/job/beam_LoadTests_Python_ParDo_Flink_Batch/ws/src/sdks/python/apache_beam/testing/load_tests/build.gradle'> line: 63

* What went wrong:
Execution failed for task ':sdks:python:apache_beam:testing:load_tests:run'.
> error occurred

* Try:
> Run with --stacktrace option to get the stack trace.
> Run with --info or --debug option to get more log output.
> Get more help at https://help.gradle.org.

Deprecated Gradle features were used in this build, making it incompatible with Gradle 9.0.

You can use '--warning-mode all' to show the individual deprecation warnings and determine if they come from your own scripts or plugins.

For more on this, please refer to https://docs.gradle.org/8.3/userguide/command_line_interface.html#sec:command_line_warnings in the Gradle documentation.

BUILD FAILED in 11m 2s
9 actionable tasks: 8 executed, 1 from cache

Publishing build scan...
https://ge.apache.org/s/qyeve5hm57cz2

Build step 'Invoke Gradle script' changed build result to FAILURE
Build step 'Invoke Gradle script' marked build as failure

---------------------------------------------------------------------
To unsubscribe, e-mail: builds-unsubscribe@beam.apache.org
For additional commands, e-mail: builds-help@beam.apache.org


Build failed in Jenkins: beam_LoadTests_Python_ParDo_Flink_Batch #1474

Posted by Apache Jenkins Server <je...@builds.apache.org>.
See <https://ci-beam.apache.org/job/beam_LoadTests_Python_ParDo_Flink_Batch/1474/display/redirect>

Changes:


------------------------------------------
[...truncated 180.84 KB...]
  Using cached google_cloud_language-2.11.1-py2.py3-none-any.whl.metadata (5.3 kB)
Collecting google-cloud-videointelligence<3,>=2.0
  Using cached google_cloud_videointelligence-2.11.4-py2.py3-none-any.whl.metadata (5.6 kB)
Collecting google-cloud-vision<4,>=2
  Using cached google_cloud_vision-3.4.5-py2.py3-none-any.whl.metadata (6.2 kB)
Collecting google-cloud-recommendations-ai<0.11.0,>=0.1.0
  Using cached google_cloud_recommendations_ai-0.10.5-py2.py3-none-any.whl.metadata (5.2 kB)
Collecting google-cloud-aiplatform<2.0,>=1.26.0
  Using cached google_cloud_aiplatform-1.35.0-py2.py3-none-any.whl.metadata (27 kB)
Collecting six>=1.11.0 (from azure-core<2,>=1.7.0)
  Using cached six-1.16.0-py2.py3-none-any.whl (11 kB)
Collecting msal<2.0.0,>=1.24.0 (from azure-identity<2,>=1.12.0)
  Using cached msal-1.24.1-py2.py3-none-any.whl.metadata (11 kB)
Collecting msal-extensions<2.0.0,>=0.3.0 (from azure-identity<2,>=1.12.0)
  Using cached msal_extensions-1.0.0-py2.py3-none-any.whl (19 kB)
Collecting isodate>=0.6.1 (from azure-storage-blob<13,>=12.3.2)
  Using cached isodate-0.6.1-py2.py3-none-any.whl (41 kB)
Collecting botocore<1.32.0,>=1.31.67 (from boto3<2,>=1.9)
  Using cached botocore-1.31.67-py3-none-any.whl.metadata (6.1 kB)
Collecting jmespath<2.0.0,>=0.7.1 (from boto3<2,>=1.9)
  Using cached jmespath-1.0.1-py3-none-any.whl (20 kB)
Collecting s3transfer<0.8.0,>=0.7.0 (from boto3<2,>=1.9)
  Using cached s3transfer-0.7.0-py3-none-any.whl.metadata (1.8 kB)
Collecting cffi>=1.12 (from cryptography>=41.0.2)
  Using cached cffi-1.16.0-cp38-cp38-manylinux_2_17_x86_64.manylinux2014_x86_64.whl.metadata (1.5 kB)
Collecting googleapis-common-protos<2.0.dev0,>=1.56.2 (from google-api-core<3,>=2.0.0)
  Using cached googleapis_common_protos-1.61.0-py2.py3-none-any.whl.metadata (1.5 kB)
Collecting oauth2client>=1.4.12 (from google-apitools<0.5.32,>=0.5.31)
  Using cached oauth2client-4.1.3-py2.py3-none-any.whl (98 kB)
Collecting pyasn1-modules>=0.2.1 (from google-auth<3,>=1.18.0)
  Using cached pyasn1_modules-0.3.0-py2.py3-none-any.whl (181 kB)
Collecting rsa<5,>=3.1.4 (from google-auth<3,>=1.18.0)
  Using cached rsa-4.9-py3-none-any.whl (34 kB)
Collecting google-cloud-storage<3.0.0dev,>=1.32.0 (from google-cloud-aiplatform<2.0,>=1.26.0)
  Using cached google_cloud_storage-2.12.0-py2.py3-none-any.whl.metadata (6.1 kB)
Collecting google-cloud-resource-manager<3.0.0dev,>=1.3.3 (from google-cloud-aiplatform<2.0,>=1.26.0)
  Using cached google_cloud_resource_manager-1.10.4-py2.py3-none-any.whl.metadata (5.2 kB)
Collecting shapely<3.0.0dev (from google-cloud-aiplatform<2.0,>=1.26.0)
  Using cached shapely-2.0.2-cp38-cp38-manylinux_2_17_x86_64.manylinux2014_x86_64.whl.metadata (7.0 kB)
Collecting google-resumable-media<3.0dev,>=0.6.0 (from google-cloud-bigquery<4,>=2.0.0)
  Using cached google_resumable_media-2.6.0-py2.py3-none-any.whl.metadata (2.1 kB)
Collecting grpc-google-iam-v1<1.0.0dev,>=0.12.4 (from google-cloud-bigtable<3,>=2.19.0)
  Using cached grpc_google_iam_v1-0.12.6-py2.py3-none-any.whl (26 kB)
Collecting grpcio-status>=1.33.2 (from google-cloud-pubsub<3,>=2.1.0)
  Using cached grpcio_status-1.59.0-py3-none-any.whl.metadata (1.3 kB)
Collecting overrides<7.0.0,>=6.0.1 (from google-cloud-pubsublite<2,>=1.2.0)
  Using cached overrides-6.5.0-py3-none-any.whl (17 kB)
Collecting sqlparse>=0.4.4 (from google-cloud-spanner<4,>=3.0.0)
  Using cached sqlparse-0.4.4-py3-none-any.whl (41 kB)
Collecting docopt (from hdfs<3.0.0,>=2.1.0)
  Using cached docopt-0.6.2-py2.py3-none-any.whl
Collecting pyparsing!=3.0.0,!=3.0.1,!=3.0.2,!=3.0.3,<4,>=2.4.2 (from httplib2<0.23.0,>=0.8)
  Using cached pyparsing-3.1.1-py3-none-any.whl.metadata (5.1 kB)
Collecting attrs>=19.2.0 (from hypothesis<=7.0.0,>5.0.0)
  Using cached attrs-23.1.0-py3-none-any.whl (61 kB)
Collecting sortedcontainers<3.0.0,>=2.1.0 (from hypothesis<=7.0.0,>5.0.0)
  Using cached sortedcontainers-2.4.0-py2.py3-none-any.whl (29 kB)
Collecting exceptiongroup>=1.0.0 (from hypothesis<=7.0.0,>5.0.0)
  Using cached exceptiongroup-1.1.3-py3-none-any.whl.metadata (6.1 kB)
Collecting tzlocal>=1.2 (from js2py<1,>=0.74)
  Using cached tzlocal-5.1-py3-none-any.whl.metadata (16 kB)
Collecting pyjsparser>=2.5.1 (from js2py<1,>=0.74)
  Using cached pyjsparser-2.7.1-py3-none-any.whl
Collecting dnspython<3.0.0,>=1.16.0 (from pymongo<5.0.0,>=3.8.0)
  Using cached dnspython-2.4.2-py3-none-any.whl.metadata (4.9 kB)
Collecting iniconfig (from pytest<8.0,>=7.1.2)
  Using cached iniconfig-2.0.0-py3-none-any.whl (5.9 kB)
Requirement already satisfied: pluggy<2.0,>=0.12 in <https://ci-beam.apache.org/job/beam_LoadTests_Python_ParDo_Flink_Batch/ws/src/build/gradleenv/1329484227/lib/python3.8/site-packages> (from pytest<8.0,>=7.1.2) (1.3.0)
Requirement already satisfied: tomli>=1.0.0 in <https://ci-beam.apache.org/job/beam_LoadTests_Python_ParDo_Flink_Batch/ws/src/build/gradleenv/1329484227/lib/python3.8/site-packages> (from pytest<8.0,>=7.1.2) (2.0.1)
Collecting execnet>=1.1 (from pytest-xdist<4,>=2.5.0)
  Using cached execnet-2.0.2-py3-none-any.whl.metadata (2.9 kB)
Collecting charset-normalizer<4,>=2 (from requests<3.0.0,>=2.24.0)
  Using cached charset_normalizer-3.3.0-cp38-cp38-manylinux_2_17_x86_64.manylinux2014_x86_64.whl.metadata (32 kB)
Collecting idna<4,>=2.5 (from requests<3.0.0,>=2.24.0)
  Using cached idna-3.4-py3-none-any.whl (61 kB)
Collecting urllib3<3,>=1.21.1 (from requests<3.0.0,>=2.24.0)
  Using cached urllib3-2.0.7-py3-none-any.whl.metadata (6.6 kB)
Collecting certifi>=2017.4.17 (from requests<3.0.0,>=2.24.0)
  Using cached certifi-2023.7.22-py3-none-any.whl.metadata (2.2 kB)
Collecting scipy>=1.5.0 (from scikit-learn>=0.20.0)
  Using cached scipy-1.10.1-cp38-cp38-manylinux_2_17_x86_64.manylinux2014_x86_64.whl (34.5 MB)
Collecting threadpoolctl>=2.0.0 (from scikit-learn>=0.20.0)
  Using cached threadpoolctl-3.2.0-py3-none-any.whl.metadata (10.0 kB)
Collecting greenlet!=0.4.17 (from sqlalchemy<2.0,>=1.3)
  Using cached greenlet-3.0.0-cp38-cp38-manylinux_2_24_x86_64.manylinux_2_28_x86_64.whl.metadata (3.8 kB)
Collecting docker>=4.0.0 (from testcontainers<4.0.0,>=3.0.3->testcontainers[mysql]<4.0.0,>=3.0.3; extra == "test")
  Using cached docker-6.1.3-py3-none-any.whl.metadata (3.5 kB)
Collecting wrapt (from testcontainers<4.0.0,>=3.0.3->testcontainers[mysql]<4.0.0,>=3.0.3; extra == "test")
  Using cached wrapt-1.16.0rc1-cp38-cp38-manylinux_2_5_x86_64.manylinux1_x86_64.manylinux_2_17_x86_64.manylinux2014_x86_64.whl.metadata (6.6 kB)
Collecting deprecation (from testcontainers<4.0.0,>=3.0.3->testcontainers[mysql]<4.0.0,>=3.0.3; extra == "test")
  Using cached deprecation-2.1.0-py2.py3-none-any.whl (11 kB)
Collecting pymysql (from testcontainers[mysql]<4.0.0,>=3.0.3; extra == "test")
  Using cached PyMySQL-1.1.0-py3-none-any.whl.metadata (4.4 kB)
Collecting urllib3<3,>=1.21.1 (from requests<3.0.0,>=2.24.0)
  Using cached urllib3-1.26.18-py2.py3-none-any.whl.metadata (48 kB)
Collecting pycparser (from cffi>=1.12->cryptography>=41.0.2)
  Using cached pycparser-2.21-py2.py3-none-any.whl (118 kB)
Collecting websocket-client>=0.32.0 (from docker>=4.0.0->testcontainers<4.0.0,>=3.0.3->testcontainers[mysql]<4.0.0,>=3.0.3; extra == "test")
  Using cached websocket_client-1.6.4-py3-none-any.whl.metadata (7.7 kB)
Collecting google-crc32c<2.0dev,>=1.0 (from google-cloud-storage<3.0.0dev,>=1.32.0->google-cloud-aiplatform<2.0,>=1.26.0)
  Using cached google_crc32c-1.5.0-cp38-cp38-manylinux_2_17_x86_64.manylinux2014_x86_64.whl (32 kB)
Collecting PyJWT<3,>=1.0.0 (from PyJWT[crypto]<3,>=1.0.0->msal<2.0.0,>=1.24.0->azure-identity<2,>=1.12.0)
  Using cached PyJWT-2.8.0-py3-none-any.whl.metadata (4.2 kB)
Collecting portalocker<3,>=1.0 (from msal-extensions<2.0.0,>=0.3.0->azure-identity<2,>=1.12.0)
  Using cached portalocker-2.8.2-py3-none-any.whl.metadata (8.5 kB)
Collecting pyasn1>=0.1.7 (from oauth2client>=1.4.12->google-apitools<0.5.32,>=0.5.31)
  Using cached pyasn1-0.5.0-py2.py3-none-any.whl (83 kB)
Collecting backports.zoneinfo (from tzlocal>=1.2->js2py<1,>=0.74)
  Using cached backports.zoneinfo-0.2.1-cp38-cp38-manylinux1_x86_64.whl (74 kB)
Using cached azure_core-1.29.5-py3-none-any.whl (192 kB)
Using cached azure_identity-1.15.0b2-py3-none-any.whl (162 kB)
Using cached azure_storage_blob-12.19.0b1-py3-none-any.whl (394 kB)
Using cached boto3-1.28.67-py3-none-any.whl (135 kB)
Using cached cryptography-41.0.4-cp37-abi3-manylinux_2_28_x86_64.whl (4.4 MB)
Using cached fastavro-1.8.4-cp38-cp38-manylinux_2_17_x86_64.manylinux2014_x86_64.whl (3.1 MB)
Using cached fasteners-0.19-py3-none-any.whl (18 kB)
Using cached google_api_core-2.12.0-py3-none-any.whl (121 kB)
Using cached google_auth-2.23.3-py2.py3-none-any.whl (182 kB)
Using cached google_auth_httplib2-0.1.1-py2.py3-none-any.whl (9.3 kB)
Using cached google_cloud_aiplatform-1.35.0-py2.py3-none-any.whl (3.1 MB)
Using cached google_cloud_bigquery-3.12.0-py2.py3-none-any.whl (220 kB)
Using cached google_cloud_bigquery_storage-2.22.0-py2.py3-none-any.whl (190 kB)
Using cached google_cloud_bigtable-2.21.0-py2.py3-none-any.whl (293 kB)
Using cached google_cloud_core-2.3.3-py2.py3-none-any.whl (29 kB)
Using cached google_cloud_datastore-2.18.0-py2.py3-none-any.whl (177 kB)
Using cached google_cloud_dlp-3.12.3-py2.py3-none-any.whl (143 kB)
Using cached google_cloud_language-2.11.1-py2.py3-none-any.whl (138 kB)
Using cached google_cloud_pubsub-2.18.4-py2.py3-none-any.whl (265 kB)
Using cached google_cloud_pubsublite-1.8.3-py2.py3-none-any.whl (288 kB)
Using cached google_cloud_recommendations_ai-0.10.5-py2.py3-none-any.whl (173 kB)
Using cached google_cloud_spanner-3.40.1-py2.py3-none-any.whl (332 kB)
Using cached google_cloud_videointelligence-2.11.4-py2.py3-none-any.whl (229 kB)
Using cached google_cloud_vision-3.4.5-py2.py3-none-any.whl (444 kB)
Using cached grpcio-1.59.0-cp38-cp38-manylinux_2_17_x86_64.manylinux2014_x86_64.whl (5.3 MB)
Using cached hypothesis-6.88.1-py3-none-any.whl (421 kB)
Using cached joblib-1.3.2-py3-none-any.whl (302 kB)
Using cached mock-5.1.0-py3-none-any.whl (30 kB)
Using cached numpy-1.24.4-cp38-cp38-manylinux_2_17_x86_64.manylinux2014_x86_64.whl (17.3 MB)
Using cached orjson-3.9.9-cp38-cp38-manylinux_2_17_x86_64.manylinux2014_x86_64.whl (138 kB)
Using cached proto_plus-1.23.0rc1-py3-none-any.whl (48 kB)
Using cached protobuf-4.24.4-cp37-abi3-manylinux2014_x86_64.whl (311 kB)
Using cached psycopg2_binary-2.9.9-cp38-cp38-manylinux_2_17_x86_64.manylinux2014_x86_64.whl (3.0 MB)
Using cached pymongo-4.5.0-cp38-cp38-manylinux_2_17_x86_64.manylinux2014_x86_64.whl (687 kB)
Using cached pytest-7.4.2-py3-none-any.whl (324 kB)
Using cached pytest_timeout-2.2.0-py3-none-any.whl (13 kB)
Using cached pytest_xdist-3.3.1-py3-none-any.whl (41 kB)
Using cached pytz-2023.3.post1-py2.py3-none-any.whl (502 kB)
Using cached PyYAML-6.0.1-cp38-cp38-manylinux_2_17_x86_64.manylinux2014_x86_64.whl (736 kB)
Using cached regex-2023.10.3-cp38-cp38-manylinux_2_17_x86_64.manylinux2014_x86_64.whl (776 kB)
Using cached requests-2.31.0-py3-none-any.whl (62 kB)
Using cached requests_mock-1.11.0-py2.py3-none-any.whl (28 kB)
Using cached scikit_learn-1.3.1-cp38-cp38-manylinux_2_17_x86_64.manylinux2014_x86_64.whl (11.1 MB)
Using cached SQLAlchemy-1.4.49-cp38-cp38-manylinux_2_5_x86_64.manylinux1_x86_64.manylinux_2_17_x86_64.manylinux2014_x86_64.whl (1.6 MB)
Using cached tenacity-8.2.3-py3-none-any.whl (24 kB)
Using cached typing_extensions-4.8.0-py3-none-any.whl (31 kB)
Using cached botocore-1.31.67-py3-none-any.whl (11.3 MB)
Using cached certifi-2023.7.22-py3-none-any.whl (158 kB)
Using cached cffi-1.16.0-cp38-cp38-manylinux_2_17_x86_64.manylinux2014_x86_64.whl (444 kB)
Using cached charset_normalizer-3.3.0-cp38-cp38-manylinux_2_17_x86_64.manylinux2014_x86_64.whl (137 kB)
Using cached dnspython-2.4.2-py3-none-any.whl (300 kB)
Using cached docker-6.1.3-py3-none-any.whl (148 kB)
Using cached exceptiongroup-1.1.3-py3-none-any.whl (14 kB)
Using cached execnet-2.0.2-py3-none-any.whl (37 kB)
Using cached google_cloud_resource_manager-1.10.4-py2.py3-none-any.whl (320 kB)
Using cached google_cloud_storage-2.12.0-py2.py3-none-any.whl (120 kB)
Using cached google_resumable_media-2.6.0-py2.py3-none-any.whl (80 kB)
Using cached googleapis_common_protos-1.61.0-py2.py3-none-any.whl (230 kB)
Using cached greenlet-3.0.0-cp38-cp38-manylinux_2_24_x86_64.manylinux_2_28_x86_64.whl (617 kB)
Using cached grpcio_status-1.59.0-py3-none-any.whl (14 kB)
Using cached msal-1.24.1-py2.py3-none-any.whl (95 kB)
Using cached pyparsing-3.1.1-py3-none-any.whl (103 kB)
Using cached s3transfer-0.7.0-py3-none-any.whl (79 kB)
Using cached shapely-2.0.2-cp38-cp38-manylinux_2_17_x86_64.manylinux2014_x86_64.whl (2.5 MB)
Using cached threadpoolctl-3.2.0-py3-none-any.whl (15 kB)
Using cached tzlocal-5.1-py3-none-any.whl (21 kB)
Using cached urllib3-1.26.18-py2.py3-none-any.whl (143 kB)
Using cached PyMySQL-1.1.0-py3-none-any.whl (44 kB)
Using cached wrapt-1.16.0rc1-cp38-cp38-manylinux_2_5_x86_64.manylinux1_x86_64.manylinux_2_17_x86_64.manylinux2014_x86_64.whl (82 kB)
Using cached portalocker-2.8.2-py3-none-any.whl (17 kB)
Using cached PyJWT-2.8.0-py3-none-any.whl (22 kB)
Using cached websocket_client-1.6.4-py3-none-any.whl (57 kB)
Building wheels for collected packages: apache-beam
  Building wheel for apache-beam (pyproject.toml): started
  Building wheel for apache-beam (pyproject.toml): still running...
  Building wheel for apache-beam (pyproject.toml): still running...
  Building wheel for apache-beam (pyproject.toml): still running...
  Building wheel for apache-beam (pyproject.toml): finished with status 'done'
  Created wheel for apache-beam: filename=apache_beam-2.52.0.dev0-cp38-cp38-linux_x86_64.whl size=16206788 sha256=2a4771535a92a34f793a3c34e36d4e87d0ccb0df496c8efe5f7fee7b9905ad26
  Stored in directory: /home/jenkins/.cache/pip/wheels/77/a7/e6/16454117045e3dcccdce1447c008de111593127ca25d666b73
Successfully built apache-beam
Installing collected packages: sortedcontainers, pytz, pyjsparser, docopt, crcmod, zstandard, wrapt, websocket-client, urllib3, typing-extensions, threadpoolctl, tenacity, sqlparse, six, regex, pyyaml, pyparsing, pymysql, PyJWT, pyhamcrest, pycparser, pyasn1, psycopg2-binary, protobuf, portalocker, parameterized, overrides, orjson, objsize, numpy, mock, joblib, jmespath, iniconfig, idna, grpcio, greenlet, google-crc32c, fasteners, fastavro, execnet, exceptiongroup, dnspython, dill, deprecation, cloudpickle, charset-normalizer, certifi, backports.zoneinfo, attrs, tzlocal, sqlalchemy, shapely, scipy, rsa, requests, python-dateutil, pytest, pymongo, pydot, pyasn1-modules, pyarrow, proto-plus, isodate, hypothesis, httplib2, googleapis-common-protos, google-resumable-media, cffi, scikit-learn, requests-mock, pytest-xdist, pytest-timeout, pandas, oauth2client, js2py, hdfs, grpcio-status, google-auth, freezegun, docker, cryptography, botocore, azure-core, testcontainers, s3transfer, grpc-google-iam-v1, google-auth-httplib2, google-apitools, google-api-core, azure-storage-blob, apache-beam, msal, google-cloud-core, boto3, msal-extensions, google-cloud-vision, google-cloud-videointelligence, google-cloud-storage, google-cloud-spanner, google-cloud-resource-manager, google-cloud-recommendations-ai, google-cloud-pubsub, google-cloud-language, google-cloud-dlp, google-cloud-datastore, google-cloud-bigtable, google-cloud-bigquery-storage, google-cloud-bigquery, google-cloud-pubsublite, google-cloud-aiplatform, azure-identity
Successfully installed PyJWT-2.8.0 apache-beam-2.52.0.dev0 attrs-23.1.0 azure-core-1.29.5 azure-identity-1.15.0b2 azure-storage-blob-12.19.0b1 backports.zoneinfo-0.2.1 boto3-1.28.67 botocore-1.31.67 certifi-2023.7.22 cffi-1.16.0 charset-normalizer-3.3.0 cloudpickle-2.2.1 crcmod-1.7 cryptography-41.0.4 deprecation-2.1.0 dill-0.3.1.1 dnspython-2.4.2 docker-6.1.3 docopt-0.6.2 exceptiongroup-1.1.3 execnet-2.0.2 fastavro-1.8.4 fasteners-0.19 freezegun-1.2.2 google-api-core-2.12.0 google-apitools-0.5.31 google-auth-2.23.3 google-auth-httplib2-0.1.1 google-cloud-aiplatform-1.35.0 google-cloud-bigquery-3.12.0 google-cloud-bigquery-storage-2.22.0 google-cloud-bigtable-2.21.0 google-cloud-core-2.3.3 google-cloud-datastore-2.18.0 google-cloud-dlp-3.12.3 google-cloud-language-2.11.1 google-cloud-pubsub-2.18.4 google-cloud-pubsublite-1.8.3 google-cloud-recommendations-ai-0.10.5 google-cloud-resource-manager-1.10.4 google-cloud-spanner-3.40.1 google-cloud-storage-2.12.0 google-cloud-videointelligence-2.11.4 google-cloud-vision-3.4.5 google-crc32c-1.5.0 google-resumable-media-2.6.0 googleapis-common-protos-1.61.0 greenlet-3.0.0 grpc-google-iam-v1-0.12.6 grpcio-1.59.0 grpcio-status-1.59.0 hdfs-2.7.3 httplib2-0.22.0 hypothesis-6.88.1 idna-3.4 iniconfig-2.0.0 isodate-0.6.1 jmespath-1.0.1 joblib-1.3.2 js2py-0.74 mock-5.1.0 msal-1.24.1 msal-extensions-1.0.0 numpy-1.24.4 oauth2client-4.1.3 objsize-0.6.1 orjson-3.9.9 overrides-6.5.0 pandas-1.5.3 parameterized-0.9.0 portalocker-2.8.2 proto-plus-1.23.0rc1 protobuf-4.24.4 psycopg2-binary-2.9.9 pyarrow-11.0.0 pyasn1-0.5.0 pyasn1-modules-0.3.0 pycparser-2.21 pydot-1.4.2 pyhamcrest-2.0.4 pyjsparser-2.7.1 pymongo-4.5.0 pymysql-1.1.0 pyparsing-3.1.1 pytest-7.4.2 pytest-timeout-2.2.0 pytest-xdist-3.3.1 python-dateutil-2.8.2 pytz-2023.3.post1 pyyaml-6.0.1 regex-2023.10.3 requests-2.31.0 requests-mock-1.11.0 rsa-4.9 s3transfer-0.7.0 scikit-learn-1.3.1 scipy-1.10.1 shapely-2.0.2 six-1.16.0 sortedcontainers-2.4.0 sqlalchemy-1.4.49 sqlparse-0.4.4 tenacity-8.2.3 testcontainers-3.7.1 threadpoolctl-3.2.0 typing-extensions-4.8.0 tzlocal-5.1 urllib3-1.26.18 websocket-client-1.6.4 wrapt-1.16.0rc1 zstandard-0.21.0
WARNING: There was an error checking the latest version of pip.

> Task :sdks:python:apache_beam:testing:load_tests:run
INFO:root:Using provided Python SDK container image: gcr.io/apache-beam-testing/beam-sdk/beam_python3.8_sdk:latest
INFO:root:Python SDK container image set to "gcr.io/apache-beam-testing/beam-sdk/beam_python3.8_sdk:latest" for Docker environment
INFO:apache_beam.runners.portability.fn_api_runner.translations:==================== <function pack_combiners at 0x7f2f44ae1820> ====================
INFO:apache_beam.runners.portability.fn_api_runner.translations:==================== <function lift_combiners at 0x7f2f44ae18b0> ====================
INFO:apache_beam.runners.portability.fn_api_runner.translations:==================== <function sort_stages at 0x7f2f44ae2040> ====================
WARNING:apache_beam.options.pipeline_options:Discarding unparseable args: ['--iterations=10', '--number_of_counter_operations=0', '--number_of_counters=0']
INFO:apache_beam.runners.portability.portable_runner:Job state changed to STOPPED
INFO:apache_beam.runners.portability.portable_runner:Job state changed to STARTING
INFO:apache_beam.runners.portability.portable_runner:Job state changed to RUNNING
ERROR:root:java.util.concurrent.TimeoutException: Waited 3 minutes (plus 116102 nanoseconds delay) for SettableFuture@309f5d7f[status=PENDING]
INFO:apache_beam.runners.portability.portable_runner:Job state changed to FAILED
Traceback (most recent call last):
  File "/usr/lib/python3.8/runpy.py", line 194, in _run_module_as_main
    return _run_code(code, main_globals, None,
  File "/usr/lib/python3.8/runpy.py", line 87, in _run_code
    exec(code, run_globals)
  File "<https://ci-beam.apache.org/job/beam_LoadTests_Python_ParDo_Flink_Batch/ws/src/sdks/python/apache_beam/testing/load_tests/pardo_test.py",> line 167, in <module>
    ParDoTest().run()
  File "<https://ci-beam.apache.org/job/beam_LoadTests_Python_ParDo_Flink_Batch/ws/src/sdks/python/apache_beam/testing/load_tests/load_test.py",> line 152, in run
    state = self.result.wait_until_finish(duration=self.timeout_ms)
  File "<https://ci-beam.apache.org/job/beam_LoadTests_Python_ParDo_Flink_Batch/ws/src/sdks/python/apache_beam/runners/portability/portable_runner.py",> line 575, in wait_until_finish
    raise self._runtime_exception
RuntimeError: Pipeline load-tests-python-flink-batch-pardo-1-1020155256_77866926-28ee-4a69-9f83-8b0a5eba3017 failed in state FAILED: java.util.concurrent.TimeoutException: Waited 3 minutes (plus 116102 nanoseconds delay) for SettableFuture@309f5d7f[status=PENDING]

> Task :sdks:python:apache_beam:testing:load_tests:run FAILED

FAILURE: Build failed with an exception.

* Where:
Build file '<https://ci-beam.apache.org/job/beam_LoadTests_Python_ParDo_Flink_Batch/ws/src/sdks/python/apache_beam/testing/load_tests/build.gradle'> line: 63

* What went wrong:
Execution failed for task ':sdks:python:apache_beam:testing:load_tests:run'.
> error occurred

* Try:
> Run with --stacktrace option to get the stack trace.
> Run with --info or --debug option to get more log output.
> Get more help at https://help.gradle.org.

Deprecated Gradle features were used in this build, making it incompatible with Gradle 9.0.

You can use '--warning-mode all' to show the individual deprecation warnings and determine if they come from your own scripts or plugins.

For more on this, please refer to https://docs.gradle.org/8.3/userguide/command_line_interface.html#sec:command_line_warnings in the Gradle documentation.

BUILD FAILED in 11m 19s
9 actionable tasks: 8 executed, 1 from cache

Publishing build scan...
https://ge.apache.org/s/5vlwfgdgzjcd4

Build step 'Invoke Gradle script' changed build result to FAILURE
Build step 'Invoke Gradle script' marked build as failure

---------------------------------------------------------------------
To unsubscribe, e-mail: builds-unsubscribe@beam.apache.org
For additional commands, e-mail: builds-help@beam.apache.org


Build failed in Jenkins: beam_LoadTests_Python_ParDo_Flink_Batch #1473

Posted by Apache Jenkins Server <je...@builds.apache.org>.
See <https://ci-beam.apache.org/job/beam_LoadTests_Python_ParDo_Flink_Batch/1473/display/redirect>

Changes:


------------------------------------------
[...truncated 180.79 KB...]
  Using cached google_cloud_language-2.11.1-py2.py3-none-any.whl.metadata (5.3 kB)
Collecting google-cloud-videointelligence<3,>=2.0
  Using cached google_cloud_videointelligence-2.11.4-py2.py3-none-any.whl.metadata (5.6 kB)
Collecting google-cloud-vision<4,>=2
  Using cached google_cloud_vision-3.4.4-py2.py3-none-any.whl.metadata (6.2 kB)
Collecting google-cloud-recommendations-ai<0.11.0,>=0.1.0
  Using cached google_cloud_recommendations_ai-0.10.5-py2.py3-none-any.whl.metadata (5.2 kB)
Collecting google-cloud-aiplatform<2.0,>=1.26.0
  Using cached google_cloud_aiplatform-1.35.0-py2.py3-none-any.whl.metadata (27 kB)
Collecting six>=1.11.0 (from azure-core<2,>=1.7.0)
  Using cached six-1.16.0-py2.py3-none-any.whl (11 kB)
Collecting msal<2.0.0,>=1.24.0 (from azure-identity<2,>=1.12.0)
  Using cached msal-1.24.1-py2.py3-none-any.whl.metadata (11 kB)
Collecting msal-extensions<2.0.0,>=0.3.0 (from azure-identity<2,>=1.12.0)
  Using cached msal_extensions-1.0.0-py2.py3-none-any.whl (19 kB)
Collecting isodate>=0.6.1 (from azure-storage-blob<13,>=12.3.2)
  Using cached isodate-0.6.1-py2.py3-none-any.whl (41 kB)
Collecting botocore<1.32.0,>=1.31.66 (from boto3<2,>=1.9)
  Using cached botocore-1.31.66-py3-none-any.whl.metadata (6.1 kB)
Collecting jmespath<2.0.0,>=0.7.1 (from boto3<2,>=1.9)
  Using cached jmespath-1.0.1-py3-none-any.whl (20 kB)
Collecting s3transfer<0.8.0,>=0.7.0 (from boto3<2,>=1.9)
  Using cached s3transfer-0.7.0-py3-none-any.whl.metadata (1.8 kB)
Collecting cffi>=1.12 (from cryptography>=41.0.2)
  Using cached cffi-1.16.0-cp38-cp38-manylinux_2_17_x86_64.manylinux2014_x86_64.whl.metadata (1.5 kB)
Collecting googleapis-common-protos<2.0.dev0,>=1.56.2 (from google-api-core<3,>=2.0.0)
  Using cached googleapis_common_protos-1.61.0-py2.py3-none-any.whl.metadata (1.5 kB)
Collecting oauth2client>=1.4.12 (from google-apitools<0.5.32,>=0.5.31)
  Using cached oauth2client-4.1.3-py2.py3-none-any.whl (98 kB)
Collecting pyasn1-modules>=0.2.1 (from google-auth<3,>=1.18.0)
  Using cached pyasn1_modules-0.3.0-py2.py3-none-any.whl (181 kB)
Collecting rsa<5,>=3.1.4 (from google-auth<3,>=1.18.0)
  Using cached rsa-4.9-py3-none-any.whl (34 kB)
Collecting google-cloud-storage<3.0.0dev,>=1.32.0 (from google-cloud-aiplatform<2.0,>=1.26.0)
  Using cached google_cloud_storage-2.12.0-py2.py3-none-any.whl.metadata (6.1 kB)
Collecting google-cloud-resource-manager<3.0.0dev,>=1.3.3 (from google-cloud-aiplatform<2.0,>=1.26.0)
  Using cached google_cloud_resource_manager-1.10.4-py2.py3-none-any.whl.metadata (5.2 kB)
Collecting shapely<3.0.0dev (from google-cloud-aiplatform<2.0,>=1.26.0)
  Using cached shapely-2.0.2-cp38-cp38-manylinux_2_17_x86_64.manylinux2014_x86_64.whl.metadata (7.0 kB)
Collecting google-resumable-media<3.0dev,>=0.6.0 (from google-cloud-bigquery<4,>=2.0.0)
  Using cached google_resumable_media-2.6.0-py2.py3-none-any.whl.metadata (2.1 kB)
Collecting grpc-google-iam-v1<1.0.0dev,>=0.12.4 (from google-cloud-bigtable<3,>=2.19.0)
  Using cached grpc_google_iam_v1-0.12.6-py2.py3-none-any.whl (26 kB)
Collecting grpcio-status>=1.33.2 (from google-cloud-pubsub<3,>=2.1.0)
  Using cached grpcio_status-1.59.0-py3-none-any.whl.metadata (1.3 kB)
Collecting overrides<7.0.0,>=6.0.1 (from google-cloud-pubsublite<2,>=1.2.0)
  Using cached overrides-6.5.0-py3-none-any.whl (17 kB)
Collecting sqlparse>=0.4.4 (from google-cloud-spanner<4,>=3.0.0)
  Using cached sqlparse-0.4.4-py3-none-any.whl (41 kB)
Collecting docopt (from hdfs<3.0.0,>=2.1.0)
  Using cached docopt-0.6.2-py2.py3-none-any.whl
Collecting pyparsing!=3.0.0,!=3.0.1,!=3.0.2,!=3.0.3,<4,>=2.4.2 (from httplib2<0.23.0,>=0.8)
  Using cached pyparsing-3.1.1-py3-none-any.whl.metadata (5.1 kB)
Collecting attrs>=19.2.0 (from hypothesis<=7.0.0,>5.0.0)
  Using cached attrs-23.1.0-py3-none-any.whl (61 kB)
Collecting sortedcontainers<3.0.0,>=2.1.0 (from hypothesis<=7.0.0,>5.0.0)
  Using cached sortedcontainers-2.4.0-py2.py3-none-any.whl (29 kB)
Collecting exceptiongroup>=1.0.0 (from hypothesis<=7.0.0,>5.0.0)
  Using cached exceptiongroup-1.1.3-py3-none-any.whl.metadata (6.1 kB)
Collecting tzlocal>=1.2 (from js2py<1,>=0.74)
  Using cached tzlocal-5.1-py3-none-any.whl.metadata (16 kB)
Collecting pyjsparser>=2.5.1 (from js2py<1,>=0.74)
  Using cached pyjsparser-2.7.1-py3-none-any.whl
Collecting dnspython<3.0.0,>=1.16.0 (from pymongo<5.0.0,>=3.8.0)
  Using cached dnspython-2.4.2-py3-none-any.whl.metadata (4.9 kB)
Collecting iniconfig (from pytest<8.0,>=7.1.2)
  Using cached iniconfig-2.0.0-py3-none-any.whl (5.9 kB)
Requirement already satisfied: pluggy<2.0,>=0.12 in <https://ci-beam.apache.org/job/beam_LoadTests_Python_ParDo_Flink_Batch/ws/src/build/gradleenv/1329484227/lib/python3.8/site-packages> (from pytest<8.0,>=7.1.2) (1.3.0)
Requirement already satisfied: tomli>=1.0.0 in <https://ci-beam.apache.org/job/beam_LoadTests_Python_ParDo_Flink_Batch/ws/src/build/gradleenv/1329484227/lib/python3.8/site-packages> (from pytest<8.0,>=7.1.2) (2.0.1)
Collecting execnet>=1.1 (from pytest-xdist<4,>=2.5.0)
  Using cached execnet-2.0.2-py3-none-any.whl.metadata (2.9 kB)
Collecting charset-normalizer<4,>=2 (from requests<3.0.0,>=2.24.0)
  Using cached charset_normalizer-3.3.0-cp38-cp38-manylinux_2_17_x86_64.manylinux2014_x86_64.whl.metadata (32 kB)
Collecting idna<4,>=2.5 (from requests<3.0.0,>=2.24.0)
  Using cached idna-3.4-py3-none-any.whl (61 kB)
Collecting urllib3<3,>=1.21.1 (from requests<3.0.0,>=2.24.0)
  Using cached urllib3-2.0.7-py3-none-any.whl.metadata (6.6 kB)
Collecting certifi>=2017.4.17 (from requests<3.0.0,>=2.24.0)
  Using cached certifi-2023.7.22-py3-none-any.whl.metadata (2.2 kB)
Collecting scipy>=1.5.0 (from scikit-learn>=0.20.0)
  Using cached scipy-1.10.1-cp38-cp38-manylinux_2_17_x86_64.manylinux2014_x86_64.whl (34.5 MB)
Collecting threadpoolctl>=2.0.0 (from scikit-learn>=0.20.0)
  Using cached threadpoolctl-3.2.0-py3-none-any.whl.metadata (10.0 kB)
Collecting greenlet!=0.4.17 (from sqlalchemy<2.0,>=1.3)
  Using cached greenlet-3.0.0-cp38-cp38-manylinux_2_24_x86_64.manylinux_2_28_x86_64.whl.metadata (3.8 kB)
Collecting docker>=4.0.0 (from testcontainers<4.0.0,>=3.0.3->testcontainers[mysql]<4.0.0,>=3.0.3; extra == "test")
  Using cached docker-6.1.3-py3-none-any.whl.metadata (3.5 kB)
Collecting wrapt (from testcontainers<4.0.0,>=3.0.3->testcontainers[mysql]<4.0.0,>=3.0.3; extra == "test")
  Using cached wrapt-1.16.0rc1-cp38-cp38-manylinux_2_5_x86_64.manylinux1_x86_64.manylinux_2_17_x86_64.manylinux2014_x86_64.whl.metadata (6.6 kB)
Collecting deprecation (from testcontainers<4.0.0,>=3.0.3->testcontainers[mysql]<4.0.0,>=3.0.3; extra == "test")
  Using cached deprecation-2.1.0-py2.py3-none-any.whl (11 kB)
Collecting pymysql (from testcontainers[mysql]<4.0.0,>=3.0.3; extra == "test")
  Using cached PyMySQL-1.1.0-py3-none-any.whl.metadata (4.4 kB)
Collecting urllib3<3,>=1.21.1 (from requests<3.0.0,>=2.24.0)
  Using cached urllib3-1.26.18-py2.py3-none-any.whl.metadata (48 kB)
Collecting pycparser (from cffi>=1.12->cryptography>=41.0.2)
  Using cached pycparser-2.21-py2.py3-none-any.whl (118 kB)
Collecting websocket-client>=0.32.0 (from docker>=4.0.0->testcontainers<4.0.0,>=3.0.3->testcontainers[mysql]<4.0.0,>=3.0.3; extra == "test")
  Using cached websocket_client-1.6.4-py3-none-any.whl.metadata (7.7 kB)
Collecting google-crc32c<2.0dev,>=1.0 (from google-cloud-storage<3.0.0dev,>=1.32.0->google-cloud-aiplatform<2.0,>=1.26.0)
  Using cached google_crc32c-1.5.0-cp38-cp38-manylinux_2_17_x86_64.manylinux2014_x86_64.whl (32 kB)
Collecting PyJWT<3,>=1.0.0 (from PyJWT[crypto]<3,>=1.0.0->msal<2.0.0,>=1.24.0->azure-identity<2,>=1.12.0)
  Using cached PyJWT-2.8.0-py3-none-any.whl.metadata (4.2 kB)
Collecting portalocker<3,>=1.0 (from msal-extensions<2.0.0,>=0.3.0->azure-identity<2,>=1.12.0)
  Using cached portalocker-2.8.2-py3-none-any.whl.metadata (8.5 kB)
Collecting pyasn1>=0.1.7 (from oauth2client>=1.4.12->google-apitools<0.5.32,>=0.5.31)
  Using cached pyasn1-0.5.0-py2.py3-none-any.whl (83 kB)
Collecting backports.zoneinfo (from tzlocal>=1.2->js2py<1,>=0.74)
  Using cached backports.zoneinfo-0.2.1-cp38-cp38-manylinux1_x86_64.whl (74 kB)
Using cached azure_core-1.29.4-py3-none-any.whl (192 kB)
Using cached azure_identity-1.15.0b2-py3-none-any.whl (162 kB)
Using cached azure_storage_blob-12.19.0b1-py3-none-any.whl (394 kB)
Using cached boto3-1.28.66-py3-none-any.whl (135 kB)
Using cached cryptography-41.0.4-cp37-abi3-manylinux_2_28_x86_64.whl (4.4 MB)
Using cached fastavro-1.8.4-cp38-cp38-manylinux_2_17_x86_64.manylinux2014_x86_64.whl (3.1 MB)
Using cached fasteners-0.19-py3-none-any.whl (18 kB)
Using cached google_api_core-2.12.0-py3-none-any.whl (121 kB)
Using cached google_auth-2.23.3-py2.py3-none-any.whl (182 kB)
Using cached google_auth_httplib2-0.1.1-py2.py3-none-any.whl (9.3 kB)
Using cached google_cloud_aiplatform-1.35.0-py2.py3-none-any.whl (3.1 MB)
Using cached google_cloud_bigquery-3.12.0-py2.py3-none-any.whl (220 kB)
Using cached google_cloud_bigquery_storage-2.22.0-py2.py3-none-any.whl (190 kB)
Using cached google_cloud_bigtable-2.21.0-py2.py3-none-any.whl (293 kB)
Using cached google_cloud_core-2.3.3-py2.py3-none-any.whl (29 kB)
Using cached google_cloud_datastore-2.18.0-py2.py3-none-any.whl (177 kB)
Using cached google_cloud_dlp-3.12.3-py2.py3-none-any.whl (143 kB)
Using cached google_cloud_language-2.11.1-py2.py3-none-any.whl (138 kB)
Using cached google_cloud_pubsub-2.18.4-py2.py3-none-any.whl (265 kB)
Using cached google_cloud_pubsublite-1.8.3-py2.py3-none-any.whl (288 kB)
Using cached google_cloud_recommendations_ai-0.10.5-py2.py3-none-any.whl (173 kB)
Using cached google_cloud_spanner-3.40.1-py2.py3-none-any.whl (332 kB)
Using cached google_cloud_videointelligence-2.11.4-py2.py3-none-any.whl (229 kB)
Using cached google_cloud_vision-3.4.4-py2.py3-none-any.whl (444 kB)
Using cached grpcio-1.59.0-cp38-cp38-manylinux_2_17_x86_64.manylinux2014_x86_64.whl (5.3 MB)
Using cached hypothesis-6.88.1-py3-none-any.whl (421 kB)
Using cached joblib-1.3.2-py3-none-any.whl (302 kB)
Using cached mock-5.1.0-py3-none-any.whl (30 kB)
Using cached numpy-1.24.4-cp38-cp38-manylinux_2_17_x86_64.manylinux2014_x86_64.whl (17.3 MB)
Using cached orjson-3.9.9-cp38-cp38-manylinux_2_17_x86_64.manylinux2014_x86_64.whl (138 kB)
Using cached proto_plus-1.22.3-py3-none-any.whl (48 kB)
Using cached protobuf-4.24.4-cp37-abi3-manylinux2014_x86_64.whl (311 kB)
Using cached psycopg2_binary-2.9.9-cp38-cp38-manylinux_2_17_x86_64.manylinux2014_x86_64.whl (3.0 MB)
Using cached pymongo-4.5.0-cp38-cp38-manylinux_2_17_x86_64.manylinux2014_x86_64.whl (687 kB)
Using cached pytest-7.4.2-py3-none-any.whl (324 kB)
Using cached pytest_timeout-2.2.0-py3-none-any.whl (13 kB)
Using cached pytest_xdist-3.3.1-py3-none-any.whl (41 kB)
Using cached pytz-2023.3.post1-py2.py3-none-any.whl (502 kB)
Using cached PyYAML-6.0.1-cp38-cp38-manylinux_2_17_x86_64.manylinux2014_x86_64.whl (736 kB)
Using cached regex-2023.10.3-cp38-cp38-manylinux_2_17_x86_64.manylinux2014_x86_64.whl (776 kB)
Using cached requests-2.31.0-py3-none-any.whl (62 kB)
Using cached requests_mock-1.11.0-py2.py3-none-any.whl (28 kB)
Using cached scikit_learn-1.3.1-cp38-cp38-manylinux_2_17_x86_64.manylinux2014_x86_64.whl (11.1 MB)
Using cached SQLAlchemy-1.4.49-cp38-cp38-manylinux_2_5_x86_64.manylinux1_x86_64.manylinux_2_17_x86_64.manylinux2014_x86_64.whl (1.6 MB)
Using cached tenacity-8.2.3-py3-none-any.whl (24 kB)
Using cached typing_extensions-4.8.0-py3-none-any.whl (31 kB)
Using cached botocore-1.31.66-py3-none-any.whl (11.3 MB)
Using cached certifi-2023.7.22-py3-none-any.whl (158 kB)
Using cached cffi-1.16.0-cp38-cp38-manylinux_2_17_x86_64.manylinux2014_x86_64.whl (444 kB)
Using cached charset_normalizer-3.3.0-cp38-cp38-manylinux_2_17_x86_64.manylinux2014_x86_64.whl (137 kB)
Using cached dnspython-2.4.2-py3-none-any.whl (300 kB)
Using cached docker-6.1.3-py3-none-any.whl (148 kB)
Using cached exceptiongroup-1.1.3-py3-none-any.whl (14 kB)
Using cached execnet-2.0.2-py3-none-any.whl (37 kB)
Using cached google_cloud_resource_manager-1.10.4-py2.py3-none-any.whl (320 kB)
Using cached google_cloud_storage-2.12.0-py2.py3-none-any.whl (120 kB)
Using cached google_resumable_media-2.6.0-py2.py3-none-any.whl (80 kB)
Using cached googleapis_common_protos-1.61.0-py2.py3-none-any.whl (230 kB)
Using cached greenlet-3.0.0-cp38-cp38-manylinux_2_24_x86_64.manylinux_2_28_x86_64.whl (617 kB)
Using cached grpcio_status-1.59.0-py3-none-any.whl (14 kB)
Using cached msal-1.24.1-py2.py3-none-any.whl (95 kB)
Using cached pyparsing-3.1.1-py3-none-any.whl (103 kB)
Using cached s3transfer-0.7.0-py3-none-any.whl (79 kB)
Using cached shapely-2.0.2-cp38-cp38-manylinux_2_17_x86_64.manylinux2014_x86_64.whl (2.5 MB)
Using cached threadpoolctl-3.2.0-py3-none-any.whl (15 kB)
Using cached tzlocal-5.1-py3-none-any.whl (21 kB)
Using cached urllib3-1.26.18-py2.py3-none-any.whl (143 kB)
Using cached PyMySQL-1.1.0-py3-none-any.whl (44 kB)
Using cached wrapt-1.16.0rc1-cp38-cp38-manylinux_2_5_x86_64.manylinux1_x86_64.manylinux_2_17_x86_64.manylinux2014_x86_64.whl (82 kB)
Using cached portalocker-2.8.2-py3-none-any.whl (17 kB)
Using cached PyJWT-2.8.0-py3-none-any.whl (22 kB)
Using cached websocket_client-1.6.4-py3-none-any.whl (57 kB)
Building wheels for collected packages: apache-beam
  Building wheel for apache-beam (pyproject.toml): started
  Building wheel for apache-beam (pyproject.toml): still running...
  Building wheel for apache-beam (pyproject.toml): still running...
  Building wheel for apache-beam (pyproject.toml): still running...
  Building wheel for apache-beam (pyproject.toml): finished with status 'done'
  Created wheel for apache-beam: filename=apache_beam-2.52.0.dev0-cp38-cp38-linux_x86_64.whl size=16206751 sha256=2b3e122d994c861a183254c561a3de7725b39d90e90c5a10448a204276b95cd7
  Stored in directory: /home/jenkins/.cache/pip/wheels/77/a7/e6/16454117045e3dcccdce1447c008de111593127ca25d666b73
Successfully built apache-beam
Installing collected packages: sortedcontainers, pytz, pyjsparser, docopt, crcmod, zstandard, wrapt, websocket-client, urllib3, typing-extensions, threadpoolctl, tenacity, sqlparse, six, regex, pyyaml, pyparsing, pymysql, PyJWT, pyhamcrest, pycparser, pyasn1, psycopg2-binary, protobuf, portalocker, parameterized, overrides, orjson, objsize, numpy, mock, joblib, jmespath, iniconfig, idna, grpcio, greenlet, google-crc32c, fasteners, fastavro, execnet, exceptiongroup, dnspython, dill, deprecation, cloudpickle, charset-normalizer, certifi, backports.zoneinfo, attrs, tzlocal, sqlalchemy, shapely, scipy, rsa, requests, python-dateutil, pytest, pymongo, pydot, pyasn1-modules, pyarrow, proto-plus, isodate, hypothesis, httplib2, googleapis-common-protos, google-resumable-media, cffi, scikit-learn, requests-mock, pytest-xdist, pytest-timeout, pandas, oauth2client, js2py, hdfs, grpcio-status, google-auth, freezegun, docker, cryptography, botocore, azure-core, testcontainers, s3transfer, grpc-google-iam-v1, google-auth-httplib2, google-apitools, google-api-core, azure-storage-blob, apache-beam, msal, google-cloud-core, boto3, msal-extensions, google-cloud-vision, google-cloud-videointelligence, google-cloud-storage, google-cloud-spanner, google-cloud-resource-manager, google-cloud-recommendations-ai, google-cloud-pubsub, google-cloud-language, google-cloud-dlp, google-cloud-datastore, google-cloud-bigtable, google-cloud-bigquery-storage, google-cloud-bigquery, google-cloud-pubsublite, google-cloud-aiplatform, azure-identity
Successfully installed PyJWT-2.8.0 apache-beam-2.52.0.dev0 attrs-23.1.0 azure-core-1.29.4 azure-identity-1.15.0b2 azure-storage-blob-12.19.0b1 backports.zoneinfo-0.2.1 boto3-1.28.66 botocore-1.31.66 certifi-2023.7.22 cffi-1.16.0 charset-normalizer-3.3.0 cloudpickle-2.2.1 crcmod-1.7 cryptography-41.0.4 deprecation-2.1.0 dill-0.3.1.1 dnspython-2.4.2 docker-6.1.3 docopt-0.6.2 exceptiongroup-1.1.3 execnet-2.0.2 fastavro-1.8.4 fasteners-0.19 freezegun-1.2.2 google-api-core-2.12.0 google-apitools-0.5.31 google-auth-2.23.3 google-auth-httplib2-0.1.1 google-cloud-aiplatform-1.35.0 google-cloud-bigquery-3.12.0 google-cloud-bigquery-storage-2.22.0 google-cloud-bigtable-2.21.0 google-cloud-core-2.3.3 google-cloud-datastore-2.18.0 google-cloud-dlp-3.12.3 google-cloud-language-2.11.1 google-cloud-pubsub-2.18.4 google-cloud-pubsublite-1.8.3 google-cloud-recommendations-ai-0.10.5 google-cloud-resource-manager-1.10.4 google-cloud-spanner-3.40.1 google-cloud-storage-2.12.0 google-cloud-videointelligence-2.11.4 google-cloud-vision-3.4.4 google-crc32c-1.5.0 google-resumable-media-2.6.0 googleapis-common-protos-1.61.0 greenlet-3.0.0 grpc-google-iam-v1-0.12.6 grpcio-1.59.0 grpcio-status-1.59.0 hdfs-2.7.3 httplib2-0.22.0 hypothesis-6.88.1 idna-3.4 iniconfig-2.0.0 isodate-0.6.1 jmespath-1.0.1 joblib-1.3.2 js2py-0.74 mock-5.1.0 msal-1.24.1 msal-extensions-1.0.0 numpy-1.24.4 oauth2client-4.1.3 objsize-0.6.1 orjson-3.9.9 overrides-6.5.0 pandas-1.5.3 parameterized-0.9.0 portalocker-2.8.2 proto-plus-1.22.3 protobuf-4.24.4 psycopg2-binary-2.9.9 pyarrow-11.0.0 pyasn1-0.5.0 pyasn1-modules-0.3.0 pycparser-2.21 pydot-1.4.2 pyhamcrest-2.0.4 pyjsparser-2.7.1 pymongo-4.5.0 pymysql-1.1.0 pyparsing-3.1.1 pytest-7.4.2 pytest-timeout-2.2.0 pytest-xdist-3.3.1 python-dateutil-2.8.2 pytz-2023.3.post1 pyyaml-6.0.1 regex-2023.10.3 requests-2.31.0 requests-mock-1.11.0 rsa-4.9 s3transfer-0.7.0 scikit-learn-1.3.1 scipy-1.10.1 shapely-2.0.2 six-1.16.0 sortedcontainers-2.4.0 sqlalchemy-1.4.49 sqlparse-0.4.4 tenacity-8.2.3 testcontainers-3.7.1 threadpoolctl-3.2.0 typing-extensions-4.8.0 tzlocal-5.1 urllib3-1.26.18 websocket-client-1.6.4 wrapt-1.16.0rc1 zstandard-0.21.0
WARNING: There was an error checking the latest version of pip.

> Task :sdks:python:apache_beam:testing:load_tests:run
INFO:root:Using provided Python SDK container image: gcr.io/apache-beam-testing/beam-sdk/beam_python3.8_sdk:latest
INFO:root:Python SDK container image set to "gcr.io/apache-beam-testing/beam-sdk/beam_python3.8_sdk:latest" for Docker environment
INFO:apache_beam.runners.portability.fn_api_runner.translations:==================== <function pack_combiners at 0x7f09c51b78b0> ====================
INFO:apache_beam.runners.portability.fn_api_runner.translations:==================== <function lift_combiners at 0x7f09c51b7940> ====================
INFO:apache_beam.runners.portability.fn_api_runner.translations:==================== <function sort_stages at 0x7f09c51ba0d0> ====================
WARNING:apache_beam.options.pipeline_options:Discarding unparseable args: ['--iterations=10', '--number_of_counter_operations=0', '--number_of_counters=0']
INFO:apache_beam.runners.portability.portable_runner:Job state changed to STOPPED
INFO:apache_beam.runners.portability.portable_runner:Job state changed to STARTING
INFO:apache_beam.runners.portability.portable_runner:Job state changed to RUNNING
ERROR:root:java.util.concurrent.TimeoutException: Waited 3 minutes (plus 108607 nanoseconds delay) for SettableFuture@1700f0d7[status=PENDING]
INFO:apache_beam.runners.portability.portable_runner:Job state changed to FAILED
Traceback (most recent call last):
  File "/usr/lib/python3.8/runpy.py", line 194, in _run_module_as_main
    return _run_code(code, main_globals, None,
  File "/usr/lib/python3.8/runpy.py", line 87, in _run_code
    exec(code, run_globals)
  File "<https://ci-beam.apache.org/job/beam_LoadTests_Python_ParDo_Flink_Batch/ws/src/sdks/python/apache_beam/testing/load_tests/pardo_test.py",> line 167, in <module>
    ParDoTest().run()
  File "<https://ci-beam.apache.org/job/beam_LoadTests_Python_ParDo_Flink_Batch/ws/src/sdks/python/apache_beam/testing/load_tests/load_test.py",> line 152, in run
    state = self.result.wait_until_finish(duration=self.timeout_ms)
  File "<https://ci-beam.apache.org/job/beam_LoadTests_Python_ParDo_Flink_Batch/ws/src/sdks/python/apache_beam/runners/portability/portable_runner.py",> line 575, in wait_until_finish
    raise self._runtime_exception
RuntimeError: Pipeline load-tests-python-flink-batch-pardo-1-1019155254_a2a8d7c6-d6dc-4b9d-9a2b-647abade7484 failed in state FAILED: java.util.concurrent.TimeoutException: Waited 3 minutes (plus 108607 nanoseconds delay) for SettableFuture@1700f0d7[status=PENDING]

> Task :sdks:python:apache_beam:testing:load_tests:run FAILED

FAILURE: Build failed with an exception.

* Where:
Build file '<https://ci-beam.apache.org/job/beam_LoadTests_Python_ParDo_Flink_Batch/ws/src/sdks/python/apache_beam/testing/load_tests/build.gradle'> line: 63

* What went wrong:
Execution failed for task ':sdks:python:apache_beam:testing:load_tests:run'.
> error occurred

* Try:
> Run with --stacktrace option to get the stack trace.
> Run with --info or --debug option to get more log output.
> Get more help at https://help.gradle.org.

Deprecated Gradle features were used in this build, making it incompatible with Gradle 9.0.

You can use '--warning-mode all' to show the individual deprecation warnings and determine if they come from your own scripts or plugins.

For more on this, please refer to https://docs.gradle.org/8.3/userguide/command_line_interface.html#sec:command_line_warnings in the Gradle documentation.

BUILD FAILED in 11m 3s
9 actionable tasks: 8 executed, 1 from cache

Publishing build scan...
https://ge.apache.org/s/c26owjfkp3qt6

Build step 'Invoke Gradle script' changed build result to FAILURE
Build step 'Invoke Gradle script' marked build as failure

---------------------------------------------------------------------
To unsubscribe, e-mail: builds-unsubscribe@beam.apache.org
For additional commands, e-mail: builds-help@beam.apache.org


Build failed in Jenkins: beam_LoadTests_Python_ParDo_Flink_Batch #1472

Posted by Apache Jenkins Server <je...@builds.apache.org>.
See <https://ci-beam.apache.org/job/beam_LoadTests_Python_ParDo_Flink_Batch/1472/display/redirect>

Changes:


------------------------------------------
[...truncated 180.76 KB...]
  Using cached google_cloud_language-2.11.1-py2.py3-none-any.whl.metadata (5.3 kB)
Collecting google-cloud-videointelligence<3,>=2.0
  Using cached google_cloud_videointelligence-2.11.4-py2.py3-none-any.whl.metadata (5.6 kB)
Collecting google-cloud-vision<4,>=2
  Using cached google_cloud_vision-3.4.4-py2.py3-none-any.whl.metadata (6.2 kB)
Collecting google-cloud-recommendations-ai<0.11.0,>=0.1.0
  Using cached google_cloud_recommendations_ai-0.10.5-py2.py3-none-any.whl.metadata (5.2 kB)
Collecting google-cloud-aiplatform<2.0,>=1.26.0
  Using cached google_cloud_aiplatform-1.35.0-py2.py3-none-any.whl.metadata (27 kB)
Collecting six>=1.11.0 (from azure-core<2,>=1.7.0)
  Using cached six-1.16.0-py2.py3-none-any.whl (11 kB)
Collecting msal<2.0.0,>=1.24.0 (from azure-identity<2,>=1.12.0)
  Using cached msal-1.24.1-py2.py3-none-any.whl.metadata (11 kB)
Collecting msal-extensions<2.0.0,>=0.3.0 (from azure-identity<2,>=1.12.0)
  Using cached msal_extensions-1.0.0-py2.py3-none-any.whl (19 kB)
Collecting isodate>=0.6.1 (from azure-storage-blob<13,>=12.3.2)
  Using cached isodate-0.6.1-py2.py3-none-any.whl (41 kB)
Collecting botocore<1.32.0,>=1.31.65 (from boto3<2,>=1.9)
  Using cached botocore-1.31.65-py3-none-any.whl.metadata (6.1 kB)
Collecting jmespath<2.0.0,>=0.7.1 (from boto3<2,>=1.9)
  Using cached jmespath-1.0.1-py3-none-any.whl (20 kB)
Collecting s3transfer<0.8.0,>=0.7.0 (from boto3<2,>=1.9)
  Using cached s3transfer-0.7.0-py3-none-any.whl.metadata (1.8 kB)
Collecting cffi>=1.12 (from cryptography>=41.0.2)
  Using cached cffi-1.16.0-cp38-cp38-manylinux_2_17_x86_64.manylinux2014_x86_64.whl.metadata (1.5 kB)
Collecting googleapis-common-protos<2.0.dev0,>=1.56.2 (from google-api-core<3,>=2.0.0)
  Using cached googleapis_common_protos-1.61.0-py2.py3-none-any.whl.metadata (1.5 kB)
Collecting oauth2client>=1.4.12 (from google-apitools<0.5.32,>=0.5.31)
  Using cached oauth2client-4.1.3-py2.py3-none-any.whl (98 kB)
Collecting pyasn1-modules>=0.2.1 (from google-auth<3,>=1.18.0)
  Using cached pyasn1_modules-0.3.0-py2.py3-none-any.whl (181 kB)
Collecting rsa<5,>=3.1.4 (from google-auth<3,>=1.18.0)
  Using cached rsa-4.9-py3-none-any.whl (34 kB)
Collecting google-cloud-storage<3.0.0dev,>=1.32.0 (from google-cloud-aiplatform<2.0,>=1.26.0)
  Using cached google_cloud_storage-2.12.0-py2.py3-none-any.whl.metadata (6.1 kB)
Collecting google-cloud-resource-manager<3.0.0dev,>=1.3.3 (from google-cloud-aiplatform<2.0,>=1.26.0)
  Using cached google_cloud_resource_manager-1.10.4-py2.py3-none-any.whl.metadata (5.2 kB)
Collecting shapely<3.0.0dev (from google-cloud-aiplatform<2.0,>=1.26.0)
  Using cached shapely-2.0.2-cp38-cp38-manylinux_2_17_x86_64.manylinux2014_x86_64.whl.metadata (7.0 kB)
Collecting google-resumable-media<3.0dev,>=0.6.0 (from google-cloud-bigquery<4,>=2.0.0)
  Using cached google_resumable_media-2.6.0-py2.py3-none-any.whl.metadata (2.1 kB)
Collecting grpc-google-iam-v1<1.0.0dev,>=0.12.4 (from google-cloud-bigtable<3,>=2.19.0)
  Using cached grpc_google_iam_v1-0.12.6-py2.py3-none-any.whl (26 kB)
Collecting grpcio-status>=1.33.2 (from google-cloud-pubsub<3,>=2.1.0)
  Using cached grpcio_status-1.59.0-py3-none-any.whl.metadata (1.3 kB)
Collecting overrides<7.0.0,>=6.0.1 (from google-cloud-pubsublite<2,>=1.2.0)
  Using cached overrides-6.5.0-py3-none-any.whl (17 kB)
Collecting sqlparse>=0.4.4 (from google-cloud-spanner<4,>=3.0.0)
  Using cached sqlparse-0.4.4-py3-none-any.whl (41 kB)
Collecting docopt (from hdfs<3.0.0,>=2.1.0)
  Using cached docopt-0.6.2-py2.py3-none-any.whl
Collecting pyparsing!=3.0.0,!=3.0.1,!=3.0.2,!=3.0.3,<4,>=2.4.2 (from httplib2<0.23.0,>=0.8)
  Using cached pyparsing-3.1.1-py3-none-any.whl.metadata (5.1 kB)
Collecting attrs>=19.2.0 (from hypothesis<=7.0.0,>5.0.0)
  Using cached attrs-23.1.0-py3-none-any.whl (61 kB)
Collecting sortedcontainers<3.0.0,>=2.1.0 (from hypothesis<=7.0.0,>5.0.0)
  Using cached sortedcontainers-2.4.0-py2.py3-none-any.whl (29 kB)
Collecting exceptiongroup>=1.0.0 (from hypothesis<=7.0.0,>5.0.0)
  Using cached exceptiongroup-1.1.3-py3-none-any.whl.metadata (6.1 kB)
Collecting tzlocal>=1.2 (from js2py<1,>=0.74)
  Using cached tzlocal-5.1-py3-none-any.whl.metadata (16 kB)
Collecting pyjsparser>=2.5.1 (from js2py<1,>=0.74)
  Using cached pyjsparser-2.7.1-py3-none-any.whl
Collecting dnspython<3.0.0,>=1.16.0 (from pymongo<5.0.0,>=3.8.0)
  Using cached dnspython-2.4.2-py3-none-any.whl.metadata (4.9 kB)
Collecting iniconfig (from pytest<8.0,>=7.1.2)
  Using cached iniconfig-2.0.0-py3-none-any.whl (5.9 kB)
Requirement already satisfied: pluggy<2.0,>=0.12 in <https://ci-beam.apache.org/job/beam_LoadTests_Python_ParDo_Flink_Batch/ws/src/build/gradleenv/1329484227/lib/python3.8/site-packages> (from pytest<8.0,>=7.1.2) (1.3.0)
Requirement already satisfied: tomli>=1.0.0 in <https://ci-beam.apache.org/job/beam_LoadTests_Python_ParDo_Flink_Batch/ws/src/build/gradleenv/1329484227/lib/python3.8/site-packages> (from pytest<8.0,>=7.1.2) (2.0.1)
Collecting execnet>=1.1 (from pytest-xdist<4,>=2.5.0)
  Using cached execnet-2.0.2-py3-none-any.whl.metadata (2.9 kB)
Collecting charset-normalizer<4,>=2 (from requests<3.0.0,>=2.24.0)
  Using cached charset_normalizer-3.3.0-cp38-cp38-manylinux_2_17_x86_64.manylinux2014_x86_64.whl.metadata (32 kB)
Collecting idna<4,>=2.5 (from requests<3.0.0,>=2.24.0)
  Using cached idna-3.4-py3-none-any.whl (61 kB)
Collecting urllib3<3,>=1.21.1 (from requests<3.0.0,>=2.24.0)
  Using cached urllib3-2.0.7-py3-none-any.whl.metadata (6.6 kB)
Collecting certifi>=2017.4.17 (from requests<3.0.0,>=2.24.0)
  Using cached certifi-2023.7.22-py3-none-any.whl.metadata (2.2 kB)
Collecting scipy>=1.5.0 (from scikit-learn>=0.20.0)
  Using cached scipy-1.10.1-cp38-cp38-manylinux_2_17_x86_64.manylinux2014_x86_64.whl (34.5 MB)
Collecting threadpoolctl>=2.0.0 (from scikit-learn>=0.20.0)
  Using cached threadpoolctl-3.2.0-py3-none-any.whl.metadata (10.0 kB)
Collecting greenlet!=0.4.17 (from sqlalchemy<2.0,>=1.3)
  Using cached greenlet-3.0.0-cp38-cp38-manylinux_2_24_x86_64.manylinux_2_28_x86_64.whl.metadata (3.8 kB)
Collecting docker>=4.0.0 (from testcontainers<4.0.0,>=3.0.3->testcontainers[mysql]<4.0.0,>=3.0.3; extra == "test")
  Using cached docker-6.1.3-py3-none-any.whl.metadata (3.5 kB)
Collecting wrapt (from testcontainers<4.0.0,>=3.0.3->testcontainers[mysql]<4.0.0,>=3.0.3; extra == "test")
  Using cached wrapt-1.16.0rc1-cp38-cp38-manylinux_2_5_x86_64.manylinux1_x86_64.manylinux_2_17_x86_64.manylinux2014_x86_64.whl.metadata (6.6 kB)
Collecting deprecation (from testcontainers<4.0.0,>=3.0.3->testcontainers[mysql]<4.0.0,>=3.0.3; extra == "test")
  Using cached deprecation-2.1.0-py2.py3-none-any.whl (11 kB)
Collecting pymysql (from testcontainers[mysql]<4.0.0,>=3.0.3; extra == "test")
  Using cached PyMySQL-1.1.0-py3-none-any.whl.metadata (4.4 kB)
Collecting urllib3<3,>=1.21.1 (from requests<3.0.0,>=2.24.0)
  Using cached urllib3-1.26.18-py2.py3-none-any.whl.metadata (48 kB)
Collecting pycparser (from cffi>=1.12->cryptography>=41.0.2)
  Using cached pycparser-2.21-py2.py3-none-any.whl (118 kB)
Collecting websocket-client>=0.32.0 (from docker>=4.0.0->testcontainers<4.0.0,>=3.0.3->testcontainers[mysql]<4.0.0,>=3.0.3; extra == "test")
  Using cached websocket_client-1.6.4-py3-none-any.whl.metadata (7.7 kB)
Collecting google-crc32c<2.0dev,>=1.0 (from google-cloud-storage<3.0.0dev,>=1.32.0->google-cloud-aiplatform<2.0,>=1.26.0)
  Using cached google_crc32c-1.5.0-cp38-cp38-manylinux_2_17_x86_64.manylinux2014_x86_64.whl (32 kB)
Collecting PyJWT<3,>=1.0.0 (from PyJWT[crypto]<3,>=1.0.0->msal<2.0.0,>=1.24.0->azure-identity<2,>=1.12.0)
  Using cached PyJWT-2.8.0-py3-none-any.whl.metadata (4.2 kB)
Collecting portalocker<3,>=1.0 (from msal-extensions<2.0.0,>=0.3.0->azure-identity<2,>=1.12.0)
  Using cached portalocker-2.8.2-py3-none-any.whl.metadata (8.5 kB)
Collecting pyasn1>=0.1.7 (from oauth2client>=1.4.12->google-apitools<0.5.32,>=0.5.31)
  Using cached pyasn1-0.5.0-py2.py3-none-any.whl (83 kB)
Collecting backports.zoneinfo (from tzlocal>=1.2->js2py<1,>=0.74)
  Using cached backports.zoneinfo-0.2.1-cp38-cp38-manylinux1_x86_64.whl (74 kB)
Using cached azure_core-1.29.4-py3-none-any.whl (192 kB)
Using cached azure_identity-1.15.0b2-py3-none-any.whl (162 kB)
Using cached azure_storage_blob-12.19.0b1-py3-none-any.whl (394 kB)
Using cached boto3-1.28.65-py3-none-any.whl (135 kB)
Using cached cryptography-41.0.4-cp37-abi3-manylinux_2_28_x86_64.whl (4.4 MB)
Using cached fastavro-1.8.4-cp38-cp38-manylinux_2_17_x86_64.manylinux2014_x86_64.whl (3.1 MB)
Using cached fasteners-0.19-py3-none-any.whl (18 kB)
Using cached google_api_core-2.12.0-py3-none-any.whl (121 kB)
Using cached google_auth-2.23.3-py2.py3-none-any.whl (182 kB)
Using cached google_auth_httplib2-0.1.1-py2.py3-none-any.whl (9.3 kB)
Using cached google_cloud_aiplatform-1.35.0-py2.py3-none-any.whl (3.1 MB)
Using cached google_cloud_bigquery-3.12.0-py2.py3-none-any.whl (220 kB)
Using cached google_cloud_bigquery_storage-2.22.0-py2.py3-none-any.whl (190 kB)
Using cached google_cloud_bigtable-2.21.0-py2.py3-none-any.whl (293 kB)
Using cached google_cloud_core-2.3.3-py2.py3-none-any.whl (29 kB)
Using cached google_cloud_datastore-2.18.0-py2.py3-none-any.whl (177 kB)
Using cached google_cloud_dlp-3.12.3-py2.py3-none-any.whl (143 kB)
Using cached google_cloud_language-2.11.1-py2.py3-none-any.whl (138 kB)
Using cached google_cloud_pubsub-2.18.4-py2.py3-none-any.whl (265 kB)
Using cached google_cloud_pubsublite-1.8.3-py2.py3-none-any.whl (288 kB)
Using cached google_cloud_recommendations_ai-0.10.5-py2.py3-none-any.whl (173 kB)
Using cached google_cloud_spanner-3.40.1-py2.py3-none-any.whl (332 kB)
Using cached google_cloud_videointelligence-2.11.4-py2.py3-none-any.whl (229 kB)
Using cached google_cloud_vision-3.4.4-py2.py3-none-any.whl (444 kB)
Using cached grpcio-1.59.0-cp38-cp38-manylinux_2_17_x86_64.manylinux2014_x86_64.whl (5.3 MB)
Using cached hypothesis-6.88.1-py3-none-any.whl (421 kB)
Using cached joblib-1.3.2-py3-none-any.whl (302 kB)
Using cached mock-5.1.0-py3-none-any.whl (30 kB)
Using cached numpy-1.24.4-cp38-cp38-manylinux_2_17_x86_64.manylinux2014_x86_64.whl (17.3 MB)
Using cached orjson-3.9.9-cp38-cp38-manylinux_2_17_x86_64.manylinux2014_x86_64.whl (138 kB)
Using cached proto_plus-1.22.3-py3-none-any.whl (48 kB)
Using cached protobuf-4.24.4-cp37-abi3-manylinux2014_x86_64.whl (311 kB)
Using cached psycopg2_binary-2.9.9-cp38-cp38-manylinux_2_17_x86_64.manylinux2014_x86_64.whl (3.0 MB)
Using cached pymongo-4.5.0-cp38-cp38-manylinux_2_17_x86_64.manylinux2014_x86_64.whl (687 kB)
Using cached pytest-7.4.2-py3-none-any.whl (324 kB)
Using cached pytest_timeout-2.2.0-py3-none-any.whl (13 kB)
Using cached pytest_xdist-3.3.1-py3-none-any.whl (41 kB)
Using cached pytz-2023.3.post1-py2.py3-none-any.whl (502 kB)
Using cached PyYAML-6.0.1-cp38-cp38-manylinux_2_17_x86_64.manylinux2014_x86_64.whl (736 kB)
Using cached regex-2023.10.3-cp38-cp38-manylinux_2_17_x86_64.manylinux2014_x86_64.whl (776 kB)
Using cached requests-2.31.0-py3-none-any.whl (62 kB)
Using cached requests_mock-1.11.0-py2.py3-none-any.whl (28 kB)
Using cached scikit_learn-1.3.1-cp38-cp38-manylinux_2_17_x86_64.manylinux2014_x86_64.whl (11.1 MB)
Using cached SQLAlchemy-1.4.49-cp38-cp38-manylinux_2_5_x86_64.manylinux1_x86_64.manylinux_2_17_x86_64.manylinux2014_x86_64.whl (1.6 MB)
Using cached tenacity-8.2.3-py3-none-any.whl (24 kB)
Using cached typing_extensions-4.8.0-py3-none-any.whl (31 kB)
Using cached botocore-1.31.65-py3-none-any.whl (11.3 MB)
Using cached certifi-2023.7.22-py3-none-any.whl (158 kB)
Using cached cffi-1.16.0-cp38-cp38-manylinux_2_17_x86_64.manylinux2014_x86_64.whl (444 kB)
Using cached charset_normalizer-3.3.0-cp38-cp38-manylinux_2_17_x86_64.manylinux2014_x86_64.whl (137 kB)
Using cached dnspython-2.4.2-py3-none-any.whl (300 kB)
Using cached docker-6.1.3-py3-none-any.whl (148 kB)
Using cached exceptiongroup-1.1.3-py3-none-any.whl (14 kB)
Using cached execnet-2.0.2-py3-none-any.whl (37 kB)
Using cached google_cloud_resource_manager-1.10.4-py2.py3-none-any.whl (320 kB)
Using cached google_cloud_storage-2.12.0-py2.py3-none-any.whl (120 kB)
Using cached google_resumable_media-2.6.0-py2.py3-none-any.whl (80 kB)
Using cached googleapis_common_protos-1.61.0-py2.py3-none-any.whl (230 kB)
Using cached greenlet-3.0.0-cp38-cp38-manylinux_2_24_x86_64.manylinux_2_28_x86_64.whl (617 kB)
Using cached grpcio_status-1.59.0-py3-none-any.whl (14 kB)
Using cached msal-1.24.1-py2.py3-none-any.whl (95 kB)
Using cached pyparsing-3.1.1-py3-none-any.whl (103 kB)
Using cached s3transfer-0.7.0-py3-none-any.whl (79 kB)
Using cached shapely-2.0.2-cp38-cp38-manylinux_2_17_x86_64.manylinux2014_x86_64.whl (2.5 MB)
Using cached threadpoolctl-3.2.0-py3-none-any.whl (15 kB)
Using cached tzlocal-5.1-py3-none-any.whl (21 kB)
Using cached urllib3-1.26.18-py2.py3-none-any.whl (143 kB)
Using cached PyMySQL-1.1.0-py3-none-any.whl (44 kB)
Using cached wrapt-1.16.0rc1-cp38-cp38-manylinux_2_5_x86_64.manylinux1_x86_64.manylinux_2_17_x86_64.manylinux2014_x86_64.whl (82 kB)
Using cached portalocker-2.8.2-py3-none-any.whl (17 kB)
Using cached PyJWT-2.8.0-py3-none-any.whl (22 kB)
Using cached websocket_client-1.6.4-py3-none-any.whl (57 kB)
Building wheels for collected packages: apache-beam
  Building wheel for apache-beam (pyproject.toml): started
  Building wheel for apache-beam (pyproject.toml): still running...
  Building wheel for apache-beam (pyproject.toml): still running...
  Building wheel for apache-beam (pyproject.toml): still running...
  Building wheel for apache-beam (pyproject.toml): finished with status 'done'
  Created wheel for apache-beam: filename=apache_beam-2.52.0.dev0-cp38-cp38-linux_x86_64.whl size=16206768 sha256=e75b75782e0c320879ab79f1cd418c5429dca0fd912ba305b8987031f7c91228
  Stored in directory: /home/jenkins/.cache/pip/wheels/77/a7/e6/16454117045e3dcccdce1447c008de111593127ca25d666b73
Successfully built apache-beam
Installing collected packages: sortedcontainers, pytz, pyjsparser, docopt, crcmod, zstandard, wrapt, websocket-client, urllib3, typing-extensions, threadpoolctl, tenacity, sqlparse, six, regex, pyyaml, pyparsing, pymysql, PyJWT, pyhamcrest, pycparser, pyasn1, psycopg2-binary, protobuf, portalocker, parameterized, overrides, orjson, objsize, numpy, mock, joblib, jmespath, iniconfig, idna, grpcio, greenlet, google-crc32c, fasteners, fastavro, execnet, exceptiongroup, dnspython, dill, deprecation, cloudpickle, charset-normalizer, certifi, backports.zoneinfo, attrs, tzlocal, sqlalchemy, shapely, scipy, rsa, requests, python-dateutil, pytest, pymongo, pydot, pyasn1-modules, pyarrow, proto-plus, isodate, hypothesis, httplib2, googleapis-common-protos, google-resumable-media, cffi, scikit-learn, requests-mock, pytest-xdist, pytest-timeout, pandas, oauth2client, js2py, hdfs, grpcio-status, google-auth, freezegun, docker, cryptography, botocore, azure-core, testcontainers, s3transfer, grpc-google-iam-v1, google-auth-httplib2, google-apitools, google-api-core, azure-storage-blob, apache-beam, msal, google-cloud-core, boto3, msal-extensions, google-cloud-vision, google-cloud-videointelligence, google-cloud-storage, google-cloud-spanner, google-cloud-resource-manager, google-cloud-recommendations-ai, google-cloud-pubsub, google-cloud-language, google-cloud-dlp, google-cloud-datastore, google-cloud-bigtable, google-cloud-bigquery-storage, google-cloud-bigquery, google-cloud-pubsublite, google-cloud-aiplatform, azure-identity
Successfully installed PyJWT-2.8.0 apache-beam-2.52.0.dev0 attrs-23.1.0 azure-core-1.29.4 azure-identity-1.15.0b2 azure-storage-blob-12.19.0b1 backports.zoneinfo-0.2.1 boto3-1.28.65 botocore-1.31.65 certifi-2023.7.22 cffi-1.16.0 charset-normalizer-3.3.0 cloudpickle-2.2.1 crcmod-1.7 cryptography-41.0.4 deprecation-2.1.0 dill-0.3.1.1 dnspython-2.4.2 docker-6.1.3 docopt-0.6.2 exceptiongroup-1.1.3 execnet-2.0.2 fastavro-1.8.4 fasteners-0.19 freezegun-1.2.2 google-api-core-2.12.0 google-apitools-0.5.31 google-auth-2.23.3 google-auth-httplib2-0.1.1 google-cloud-aiplatform-1.35.0 google-cloud-bigquery-3.12.0 google-cloud-bigquery-storage-2.22.0 google-cloud-bigtable-2.21.0 google-cloud-core-2.3.3 google-cloud-datastore-2.18.0 google-cloud-dlp-3.12.3 google-cloud-language-2.11.1 google-cloud-pubsub-2.18.4 google-cloud-pubsublite-1.8.3 google-cloud-recommendations-ai-0.10.5 google-cloud-resource-manager-1.10.4 google-cloud-spanner-3.40.1 google-cloud-storage-2.12.0 google-cloud-videointelligence-2.11.4 google-cloud-vision-3.4.4 google-crc32c-1.5.0 google-resumable-media-2.6.0 googleapis-common-protos-1.61.0 greenlet-3.0.0 grpc-google-iam-v1-0.12.6 grpcio-1.59.0 grpcio-status-1.59.0 hdfs-2.7.3 httplib2-0.22.0 hypothesis-6.88.1 idna-3.4 iniconfig-2.0.0 isodate-0.6.1 jmespath-1.0.1 joblib-1.3.2 js2py-0.74 mock-5.1.0 msal-1.24.1 msal-extensions-1.0.0 numpy-1.24.4 oauth2client-4.1.3 objsize-0.6.1 orjson-3.9.9 overrides-6.5.0 pandas-1.5.3 parameterized-0.9.0 portalocker-2.8.2 proto-plus-1.22.3 protobuf-4.24.4 psycopg2-binary-2.9.9 pyarrow-11.0.0 pyasn1-0.5.0 pyasn1-modules-0.3.0 pycparser-2.21 pydot-1.4.2 pyhamcrest-2.0.4 pyjsparser-2.7.1 pymongo-4.5.0 pymysql-1.1.0 pyparsing-3.1.1 pytest-7.4.2 pytest-timeout-2.2.0 pytest-xdist-3.3.1 python-dateutil-2.8.2 pytz-2023.3.post1 pyyaml-6.0.1 regex-2023.10.3 requests-2.31.0 requests-mock-1.11.0 rsa-4.9 s3transfer-0.7.0 scikit-learn-1.3.1 scipy-1.10.1 shapely-2.0.2 six-1.16.0 sortedcontainers-2.4.0 sqlalchemy-1.4.49 sqlparse-0.4.4 tenacity-8.2.3 testcontainers-3.7.1 threadpoolctl-3.2.0 typing-extensions-4.8.0 tzlocal-5.1 urllib3-1.26.18 websocket-client-1.6.4 wrapt-1.16.0rc1 zstandard-0.21.0
WARNING: There was an error checking the latest version of pip.

> Task :sdks:python:apache_beam:testing:load_tests:run
INFO:root:Using provided Python SDK container image: gcr.io/apache-beam-testing/beam-sdk/beam_python3.8_sdk:latest
INFO:root:Python SDK container image set to "gcr.io/apache-beam-testing/beam-sdk/beam_python3.8_sdk:latest" for Docker environment
INFO:apache_beam.runners.portability.fn_api_runner.translations:==================== <function pack_combiners at 0x7f4e924e78b0> ====================
INFO:apache_beam.runners.portability.fn_api_runner.translations:==================== <function lift_combiners at 0x7f4e924e7940> ====================
INFO:apache_beam.runners.portability.fn_api_runner.translations:==================== <function sort_stages at 0x7f4e924f10d0> ====================
WARNING:apache_beam.options.pipeline_options:Discarding unparseable args: ['--iterations=10', '--number_of_counter_operations=0', '--number_of_counters=0']
INFO:apache_beam.runners.portability.portable_runner:Job state changed to STOPPED
INFO:apache_beam.runners.portability.portable_runner:Job state changed to STARTING
INFO:apache_beam.runners.portability.portable_runner:Job state changed to RUNNING
ERROR:root:java.util.concurrent.TimeoutException: Waited 3 minutes (plus 93610 nanoseconds delay) for SettableFuture@2baf122c[status=PENDING]
INFO:apache_beam.runners.portability.portable_runner:Job state changed to FAILED
Traceback (most recent call last):
  File "/usr/lib/python3.8/runpy.py", line 194, in _run_module_as_main
    return _run_code(code, main_globals, None,
  File "/usr/lib/python3.8/runpy.py", line 87, in _run_code
    exec(code, run_globals)
  File "<https://ci-beam.apache.org/job/beam_LoadTests_Python_ParDo_Flink_Batch/ws/src/sdks/python/apache_beam/testing/load_tests/pardo_test.py",> line 167, in <module>
    ParDoTest().run()
  File "<https://ci-beam.apache.org/job/beam_LoadTests_Python_ParDo_Flink_Batch/ws/src/sdks/python/apache_beam/testing/load_tests/load_test.py",> line 152, in run
    state = self.result.wait_until_finish(duration=self.timeout_ms)
  File "<https://ci-beam.apache.org/job/beam_LoadTests_Python_ParDo_Flink_Batch/ws/src/sdks/python/apache_beam/runners/portability/portable_runner.py",> line 575, in wait_until_finish
    raise self._runtime_exception
RuntimeError: Pipeline load-tests-python-flink-batch-pardo-1-1018155309_b8ea559f-af6c-458e-b68d-0d05e3ecc0f4 failed in state FAILED: java.util.concurrent.TimeoutException: Waited 3 minutes (plus 93610 nanoseconds delay) for SettableFuture@2baf122c[status=PENDING]

> Task :sdks:python:apache_beam:testing:load_tests:run FAILED

FAILURE: Build failed with an exception.

* Where:
Build file '<https://ci-beam.apache.org/job/beam_LoadTests_Python_ParDo_Flink_Batch/ws/src/sdks/python/apache_beam/testing/load_tests/build.gradle'> line: 63

* What went wrong:
Execution failed for task ':sdks:python:apache_beam:testing:load_tests:run'.
> error occurred

* Try:
> Run with --stacktrace option to get the stack trace.
> Run with --info or --debug option to get more log output.
> Get more help at https://help.gradle.org.

Deprecated Gradle features were used in this build, making it incompatible with Gradle 9.0.

You can use '--warning-mode all' to show the individual deprecation warnings and determine if they come from your own scripts or plugins.

For more on this, please refer to https://docs.gradle.org/8.3/userguide/command_line_interface.html#sec:command_line_warnings in the Gradle documentation.

BUILD FAILED in 11m 26s
9 actionable tasks: 8 executed, 1 from cache

Publishing build scan...
https://ge.apache.org/s/35xacoudnrmke

Build step 'Invoke Gradle script' changed build result to FAILURE
Build step 'Invoke Gradle script' marked build as failure

---------------------------------------------------------------------
To unsubscribe, e-mail: builds-unsubscribe@beam.apache.org
For additional commands, e-mail: builds-help@beam.apache.org